##TITLE=$$ Begin of the data block
##JCAMP-DX=5.00 $$ ACD/SpecManager v 10.08
##SPECTROMETER/DATA SYSTEM=Alpha
##DATE=15 Apr 2014 09:00:42
##DATA TYPE=INFRARED SPECTRUM
##DATA CLASS=XYDATA
##ORIGIN=
##OWNER=
##NPOINTS=1765
##FIRSTX=399.75695801
##LASTX=3997.56933594
##MAXX=3997.56933594
##MINX=399.75695801
##MAXY=0.83560562
##MINY=0.22752850
##XFACTOR=1.0000000000
##YFACTOR=1.000000000000000e-9
##FIRSTY=0.56506217
##DELTAX=2.03957629
##XUNITS=1/CM
##YUNITS=ARBITRARY UNITS
##XYDATA=(X++(Y..Y))
399.8E65062165k134561j246810k82467j061558j251817m42445r99749q33809N46515
418.1E57355464n49317j470089k87533l34620p38561m14491p87497q91923k73407p37131
438.5E50870895q09073L34859j8895p01129j93894o17147j020014l5405j69099j015305
458.9E46625793n25713q53717j498044o96540o90222j476347j061559j086354j475632
477.3E37261665l85702O0857p12514m00901k96414j079142p12693n30183j443625j140177
497.7E30621171n17249j112282r26316l63589j121163j123130m13478j102566j545430
516E22395968j121759j645744j788378q18610j037240j665771j067877j149833j508236
534.4E10592520p30276q48830j469552o99103n31971j294137r25481p06613j351118
$$ plain form
399.8 565062165 562927604 561680794 561398327 560336769 559084952 558642507 557642758 556808949 557355464
418.1 557355464 556806147 555336058 555048525 554713905 553975344 553560853 552773356 551881433 551608026 550870895
438.5 550870895 550061822 550396681 550377786 549676657 549482763 548865616 547845602 547810197 547641098 546625793
458.9 546625793 546100080 545246363 543748319 543051779 542361557 540885210 539823651 538737297 537261665
477.3 537261665 536875963 536936820 536224306 535823405 535526991 534447849 533735156 533204973 531761348 530621171
497.7 530621171 530103922 528991640 528065324 527701735 526580572 525457442 525043964 523941398 522395968
516 522395968 521274209 519628465 517840087 517021477 515984237 514318466 513250589 512100756 510592520
534.4 510592520 509862244 509013414 507543862 506844759 506312788 505018651 504093170 503386557 502035439
552.7E02035439j187980j109809j820594j602173j256287k085537k271741j855105
569D88846213k470315k532810j797199k171189k287477j460403j652539k181560j800447
587.4D70492274j879901k167344j674146j795113k388894k282083k591163l214807
603.7D52498823k436578j388043j076937m92662o9290K07156J932859L790736L961265
622.1D56927329M156709M592747M021912L752619M082352L484279L016025L208280
638.4D87242252K230197R80586J601129K830863L207893K917200J134694n92232J276254
656.7E02828836M886210O305039O014228M718006L747821M794717M164278K749384
673.1E40208519L091454L664017K908051K658486L240585K537132J870513K316951
$$ plain form
552.7 502035439 500847459 499737650 497917056 496314883 495058596 492973059 490701318 488846213
569 488846213 486375898 483843088 482045889 479874700 477587223 476126820 474474281 472292721 470492274
587.4 470492274 468612373 466445029 464770883 462975770 460586876 458304793 455713630 452498823
603.7 452498823 450062245 448674202 447597265 447104603 447035313 447242469 449175328 452966064 456927329
622.1 456927329 461084038 465676785 469698697 473451316 477533668 481017947 484033972 487242252
638.4 487242252 489472449 490453035 492054164 494885027 498092920 501010120 502144814 501552582 502828836
656.7 502828836 507715046 514020085 520034313 524752319 528500140 533294857 537459135 540208519
673.1 540208519 543299973 546963990 549872041 552530527 555771112 558308244 560178757 562495708
689.4E62495708J866639J128793J522541J284182O77884J425922J852393J527250K284526
707.7E76065838K720356K093971K532005L033221K359510K585888L208398K479315
724E97078502K363086K927184K285481J972436K565086K002061J397252K039909J896858
742.4F16527855J447320K108694K105295J534462K099335K190113J452923J974225
758.7F31440222K408505J699507J939356K413690J556099J291513J454115L56674k11894
777.1F44347787Q8453p25925j327097n70834l89159j45673J485645K601088L279447
795.4F48643732N014539N947709N706191O188571O053150M697859M283965L911912
811.7F90447628K302826J537085J242101l42787j455962j900494l430009m394591m119337
$$ plain form
689.4 562495708 564362347 565491140 567013681 568297863 568975747 570401669 572254062 573781312 576065838
707.7 576065838 578786194 580880165 583412170 586445391 588804901 591390789 594599187 597078502
724 597078502 599441588 602368772 604654253 606626689 609191775 611193836 612591088 614630997 616527855
742.4 616527855 617975175 620083869 622189164 623723626 625822961 628013074 629465997 631440222
758.7 631440222 633848727 635548234 637487590 639901280 641457379 642748892 644203007 644559681 644347787
777.1 644347787 644436240 643710315 642383218 641812384 641423225 641277552 642763197 645364285 648643732
795.4 648643732 653658271 659605980 665312171 671500742 677553892 682251751 686535716 690447628
811.7 690447628 692750454 694287539 695529640 695186853 693730891 691830397 688400388 684005797 679886460
830.1F79886460m680395n001366m013598l834128m157603l424287l003061k826452
846.4F48945570j129389Q14736K217710M595339O776870P423222Q343816R248733Q581877
864.8F95818484P983565P721901O117940M705370M333317L041863J666546J268923
881.1G32657909N8592j334608j396477j772046k462864j745224r64463q08000J95324
899.4G22428143Q99732M29809N52476O28829n98908j450240j936853l411413m357993
917.8G13183582m244209m508614m138410k455771j293063n52297O06477P81477J62959
936.2F97542131K75433J50859n66065n66959p10845j777709k456903l068090m514098
954.5F84307754n614459o414354q080781r662270j0733068j2358666j3752103j3991117
$$ plain form
830.1 679886460 675206065 670204699 666191101 662356973 658199370 654775083 651772022 648945570
846.4 648945570 647816181 648630917 650848627 655443966 662220836 669644058 677987874 687236607 695818484
864.8 695818484 703802049 711523950 717641890 722347260 726680577 729722440 731388986 732657909
881.1 732657909 732716501 731381893 729985416 728213370 725750506 724005282 723040819 722232819 722428143
899.4 722428143 723327875 723757684 724310160 724938989 724340081 722889841 720952988 717541575 713183582
917.8 713183582 708939373 704430759 700292349 697836578 696543515 695991218 696597695 697379172 697542131
936.2 697542131 697817564 697968423 697402358 696835399 696124554 694346845 691889942 688821852 684307754
954.5 684307754 678693295 672278941 664198160 654535890 643802822 631444156 617692053 603700936
970.8F03700936j3862312j3087809j1256039r712577q688569p351756o430388o120085
987.1E27191401n336285m474402m073679l326595k467632k198517j906693j643002
1003.5E01764596k214134l078312l762424m720956n401731n288630n161256n104005
1019.8D67033148m641861m314274m253208l843308l500700l512680l189206k699107
1036.1D37078804k527207k256424j978397k137870k238512k081930k104581j892119
1052.4D19861764j049668j89066N07951J136810J091569K64973p99716k112508l460049
1070.8D15252060m157424m338414m344940l989637l535271l486722l649265l852218
1087.1C83898169m143447m124790l555507k716213j697868o26743J6451K65211M04894
$$ plain form
970.8 603700936 589838624 576750815 565494776 555782199 547093630 539741874 533311486 527191401
987.1 527191401 521855116 517380714 513307035 509980440 507512808 505314291 503407598 501764596
1003.5 501764596 499550462 496472150 492709726 487988770 482587039 477298409 472137153 467033148
1019.8 467033148 462391287 458077013 453823805 449980497 446479797 442967117 439777911 437078804
1036.1 437078804 434551597 432295173 430316776 428178906 425940394 423858464 421753883 419861764
1052.4 419861764 418812096 418623030 419130981 420267791 421359360 421624333 420824617 418712109 415252060
1070.8 415252060 411094636 406756222 402411282 398421645 394886374 391399652 387750387 383898169
1087.1 383898169 379754722 375629932 372074425 369358212 367660344 367033601 367050052 367315263 367720157
1105.4C67720157K47180k38329p41660j405210k458632l615170m649371n073756l962905
1123.8C45822304j798689k54452K48045J8596n41061l35216Q58992J896709K214313
1142.2C48129541K180844J950503J608997J499027J670599J943320K427489L148764
1158.5C64559084L892750M773617N819767O661624P245660P704764P830978P682860
1174.8D16171104P559925P267863O679833O077617N273014L980130K680987J704872
1191.1D57395345R65387P67201J219332J819044K455235L200889L540843L404588L221303
1209.5D77989167K806991K158970J830310J718968J557588J681865J947224J990109
1225.8D93681192K243191K741874K955526L161132L554523L632069L576755L673375
$$ plain form
1105.4 367720157 367967337 367729008 366987348 365582138 363123506 359508336 354858965 349785209 345822304
1123.8 345822304 344023615 343769163 344017208 344035804 343494743 343159527 344018519 345915228 348129541
1142.2 348129541 350310385 352260888 353869885 355368912 357039511 358982831 361410320 364559084
1158.5 364559084 368451834 373225451 379045218 385706842 392952502 400657266 408488244 416171104
1174.8 416171104 423731029 430998892 437678725 443756342 449029356 453009486 455690473 457395345
1191.1 457395345 458360732 459127933 460347265 462166309 464621544 467822433 471363276 474767864 477989167
1209.5 477989167 480796158 482955128 484785438 486504406 488061994 489743859 491691083 493681192
1225.8 493681192 495924383 498666257 501621783 504782915 508337438 511969507 515546262 519219637
1242.1E19219637L370047K777934K491355K088248J437366J161874J049399Q86917
1258.4E34482777J221717J776516K026856K533793L260136L520727L769338M272461
1274.7E56864321M381359M445910M911363N061269N042076N505264N692482N380511
1291E97284555N433917N372286M778982M549145M387856L672778L296554L198863K533376
1309.4F34508312K099037K118111J623153J279116J596332J497924J337886J796543
1325.7F47856414J738668J183390J164139R00388K28106L07560M51088L2127L28183
1344.1F54190063R08316O96122O60420Q87334L86894J79J46269l07738j002610j155674
1364.5F55409575j455188j641631j078427q97646j433253j432002j522839k410591
$$ plain form
1242.1 519219637 522589684 525367618 527858973 529947221 531384587 532546461 533595860 534482777
1258.4 534482777 535704494 537481010 539507866 542041659 545301795 548822522 552591860 556864321
1274.7 556864321 561245680 565691590 570602953 575664222 580706298 586211562 591904044 597284555
1291 597284555 602718472 608090758 612869740 617418885 621806741 625479519 628776073 631974936 634508312
1309.4 634508312 636607349 638725460 640348613 641627729 643224061 644721985 646059871 647856414
1325.7 647856414 649595082 650778472 651942611 652842999 653071105 653378665 653829753 653861880 654190063
1344.1 654190063 655098379 655794501 656454921 657342255 657729149 657729328 657875597 657567859 656565249 655409575
1364.5 655409575 653954387 652312756 651234329 650336683 648903430 647471428 645948589 643537998
1380.8F43537998k612531j815915j343787j207292j097560j480162j858473k040267
1397.1F30082011k930462l485143l099859l305852l535629k841353k490640k421617
1413.4F05971456j588583j000047j397073j281083q62360j064539q78036n84483j004994
1431.8E96310258q37863n1915k25604m01676L24190O17325R24767J930177K380013
1450.1F00969672K550483L837287O387175P700026O413936O194532P124305P649660
1466.4F48827076P520378Q268237J0244548R823918P034243N594074N172134L974914
1482.8G06459522K598882K136290R67860r98258j619220j979768l137887l724277l871620
1501.1F96831524l958642m070759n897045p112682o151617n304157m888475m104495
$$ plain form
1380.8 643537998 640925467 639109552 637765765 636558473 635460913 633980751 632122278 630082011
1397.1 630082011 627151549 623666406 620566547 617260695 613725066 610883713 608393073 605971456
1413.4 605971456 604382873 603382826 601985753 600704670 599842310 598777771 597899735 597315252 596310258
1431.8 596310258 595472395 595420480 595194876 594793200 595117390 595734715 596659482 598589659 600969672
1450.1 600969672 603520155 607357442 613744617 621444643 627858579 634053111 641177416 648827076
1466.4 648827076 656347454 664615691 674860239 684684157 691718400 697312474 702484608 706459522
1482.8 706459522 709058404 711194694 712162554 711164296 709545076 707565308 704427421 700703144 696831524
1501.1 696831524 692872882 688802123 682905078 675792396 669640779 664336622 659448147 655343652
1517.4F55343652k922893l028333l425479k894878k986431k864540j960695j894772
1533.7F33365631k112806j035988k21133j057983j034319m67122j35541P05004J467109
1552.1F29472852J521468J818478K598822J080156p15137n70536p91371j532912k368092
1570.5F30513728l232897l927350n179405o256640o571948o728948p103204p858932
1586.8E83654404q130968q272290q675218q760214q570432q685232q700847q466482
1603.1E15392721q463323q494676q463978q459360q043796p830441q450985p475912
1619.4D49710250o163299o216526o098896n289615m421949l340513k001643r03338
1635.7D15274471m30077K21848J337558K297580L615380M297614L442198M698783O925225
$$ plain form
1517.4 655343652 652420759 649392426 645966947 643072069 640085638 637221098 635260403 633365631
1533.7 633365631 631252825 630216837 629995704 628937721 627903402 627436280 627300739 628005743 629472852
1552.1 629472852 630994320 632812798 635411620 636491776 635776639 635206103 634414732 632881820 630513728
1570.5 630513728 627280831 623353481 618174076 611917436 605345488 598616540 591513336 583654404
1586.8 583654404 575523436 567251146 558575928 549815714 541245282 532560050 523859203 515392721
1603.1 515392721 506929398 498434722 489970744 481511384 473467588 465637147 457186162 449710250
1619.4 449710250 443546951 437330425 431231529 425941914 421519965 418179452 416177809 415274471
1635.7 415274471 414844394 415066242 416403800 418701380 422316760 426614374 430056572 434755355 441680580
1654.1D41680580M822702M010647N405873O803334O921411O360918P380694Q350044
1670.4D91736203P483304P955223Q653760P804275P694065R087205J1164427R695768
1686.7E61274230P957578Q308888Q277833R454966J0453582J0788440J2275934J0097623
1703F38889074Q678317Q956135P636487O746054O664514O630958O628573N525290M081488
1721.4G00436890L899932M234374M083395L844142L908038M382550L811419L179253
1737.7G31779993L819763M048169M047453M447103M567385M554927M319489L591955
1754G65176237L389001L487885L151357K776384K492011K378940K365411K458989K287626
1772.4G89963841J544357J328349J638770J610756J500845J576662J432359J442671
$$ plain form
1654.1 441680580 446503282 450513929 455919802 462723136 469644547 476005465 483386159 491736203
1670.4 491736203 499219507 507174730 515828490 523632765 531326830 540414035 551578462 561274230
1686.7 561274230 569231808 577540696 585818529 595273495 605727077 616515517 628791451 638889074
1703 638889074 647567391 656523526 664160013 670906067 677570581 684201539 690830112 696355402 700436890
1721.4 700436890 704336822 708571196 712654591 716498733 720406771 724789321 728600740 731779993
1737.7 731779993 735599756 739647925 743695378 748142481 752709866 757264793 761584282 765176237
1754 765176237 768565238 772053123 775204480 777980864 780472875 782851815 785217226 787676215 789963841
1772.4 789963841 791508198 792836547 794475317 796086073 797586918 799163580 800595939 802038610
1788.7H02038610J757562J517236R34899J073778J275599J052678R13918Q97288Q39889
1807H12301457R75549R85801O43134O54042Q32618O60240O53506R48071Q58665O79194
1827.4H20192277P38323M26114K29597N18441N83351M57108P19130P99835K95221J81914
1847.8H25141311L79204L10839L44097M97103L52681K79844M63664M69804M60267N32091
1868.2H29230905J77204r2089J91569L08037J54793K39194L23355J91271K81275M10080
1888.6H31415594J40071M4524K21908J01686K3663K17974J88470J05560K51174J91748
1909H32902372k8372O8605K37882J49131P0214L1352j43647r0122J22845K0206o4254
1931.5H33276212N6327l5882j08660R8288O7950j93239j46687r9241k07663q8751k5869
$$ plain form
1788.7 802038610 803796172 805313408 806248307 807322085 808597684 809650362 810564280 811461568 812301457
1807 812301457 813277006 814262807 814905941 815559983 816392601 817052841 817706347 818654418 819513083 820192277
1827.4 820192277 820930600 821356714 821586311 822104752 822688103 823145211 823864341 824664176 824959397 825141311
1847.8 825141311 825520515 825831354 826175451 826672554 827025235 827305079 827768743 828238547 828698814 829230905
1868.2 829230905 829408109 829316020 829507589 829815626 829970419 830209613 830532968 830724239 831005514 831415594
1888.6 831415594 831555665 831600189 831822097 831923783 831947446 832165420 832353890 832459450 832710624 832902372
1909 832902372 832874000 832942605 833180487 833329618 833399832 833431184 833287537 833197415 833320260 833340466 833276212
1931.5 833276212 833332539 833296657 833187997 833286285 833354235 833160996 833014309 832915068 832707405 832618654 832592785
1953.9H32592785k00808j66177n2810j80602j45078J9252j42812k49863r6321j57118
1974.3H31220448k48432o3718n6803j93774q0169o3777k09272q4579n7399l01242k21073
1996.7H29640210n4419k20597k58684j13249k37465l01957j21415j64449k41756r5130
2017.1H27831089j77383l64661j99855j34944l01660k01404j01983k47896j81675o4373
2037.5H25855255k24173j98603l6835j98543k89619j15455j56700k11179k1935n2333
2057.9H24349880k00212n5790l1471k11060q2433J5616j69158r8646N0784j00375p9453
2080.3H23387682P3493p2181r8944O8247p8857j86503K9684J6987q3149P8202M6551
2102.8H23181212j20938J9193P5757r1493P391R0897p9453J6332K02358M0114p16J67251
$$ plain form
1953.9 832592785 832391977 832225800 832172990 831992388 831847310 831866562 831723750 831473887 831377566 831220448
1974.3 831220448 830972016 830908298 830851495 830657721 830577552 830513775 830304503 830219924 830162525 829861283 829640210
1996.7 829640210 829585791 829365194 829106510 828993261 828755796 828453839 828332424 828167975 827926219 827831089
2017.1 827831089 827653706 827289045 827089190 826954246 826652586 826451182 826349199 826101303 825919628 825855255
2037.5 825855255 825631082 825432479 825395644 825197101 824907482 824792027 824635327 824424148 824402213 824349880
2057.9 824349880 824149668 824093878 824062407 823851347 823768914 823784530 823615372 823516726 823567510 823467135 823387682
2080.3 823387682 823461175 823388994 823290050 823358297 823279440 823092937 823122621 823139608 823056459 823134661 823181212
2102.8 823181212 823060274 823079467 823155224 823063731 823071122 823162019 823082566 823098898 823301256 823341370 823340654 823507905
2127.3H23507905P1168K7716J89245P5877l7253J51872J41084L7909K10881J99914
2147.7H24576318M053J24216K01643K0087R9718K39194P7009P3075K08676Q6963P4864
2170.1H25785816K37882J38223P2181K17915J20997n96J81616J88589K2113J16348
2190.5H27081084J39296j9729J07885K17437J4007K1697J32560j9312l040J64509M4346
2212.9H27880740j3888J51813O0618p3194Q3327Q0764n6028O9678P6353j20699k6047
2235.4H28113437Q6128m4465k443Q1419n5313m3034M4286j08957j17123N8472k6107
2257.8H27986300j07348M6015P570j01030N1975Q4579k7657Q1122J16706k6345R7871
2280.2H28209758K28405M2081j20R6858m7624j02878N4121J7941m6313N6744K682j00374
$$ plain form
2127.3 823507905 823579073 823606789 823796034 823871911 823834658 823986530 824127614 824165523 824376404 824576318
2147.7 824576318 824580371 824704587 824906230 824926317 825026035 825265229 825342238 825415313 825623989 825710952 825785816
2170.1 825785816 826023698 826161921 826234102 826452017 826573014 826572418 826754034 826942623 826964736 827081084
2190.5 827081084 827220380 827200651 827308536 827525973 827539980 827561677 827694237 827674925 827671885 827836394 827880740
2212.9 827880740 827866852 828018665 828079283 828006089 828089416 828170180 828114152 828183830 828260183 828139484 828113437
2235.4 828113437 828199565 828155100 828152657 828234076 828178763 828135729 828180015 828071058 827953935 828012407 827986300
2257.8 827986300 827878952 827924967 827932537 827831507 827883482 827968061 827940404 828021526 828138232 828111887 828209758
2280.2 828209758 828438163 828480244 828480124 828576982 828529358 828426480 828480601 828498542 828452229 828508973 828511655 828411281
2304.7H28411281m291l7075j49488j4126K1219j89960k28107j08182p0453J907L4988
2327.1H27667713m6789K7954Q7321j04725j26422L4571J6808J95742P12752P02143
2347.5H29167068J48356k77698m97580n62250k84314J4185J99557N36859O63280M60804
2367.9H29568267N08308O98686O40511O54161P57158O34194N08844M86315L01838J35898
2388.3H34894180J79947J26064l994P3195J08897m232M2320J01566k742J1027P9393
2410.8H35605621m2140q5652J0788o0677j05322J4604m8340j59323m9889j9908j16885
2433.2H34942877p9632o0200j56224j21653n4240j28746j27435p0334j39415j27554
2453.6H33877444l4332j14560j62363p8857j25587k00927j50025j54674j99557j30295
$$ plain form
2304.7 828411281 828406990 828369915 828220427 828206301 828227520 828037560 827809453 827701271 827630818 827632725 827667713
2327.1 827667713 827620924 827648878 827736199 827631474 827505052 827539623 827556431 827752173 828464925 829167068
2347.5 829167068 829315424 829037726 828540146 827977896 827693582 827707767 827907324 828444183 829107463 829568267
2367.9 829568267 830076575 830775261 831415772 832069933 832827091 833461285 833970129 834456444 834758282 834894180
2388.3 834894180 835074127 835200191 835196197 835269392 835378289 835374057 835416377 835517943 835515201 835526228 835605621
2410.8 835605621 835563481 835477829 835488617 835427940 835322618 835337222 835288882 835129559 835079670 835059762 834942877
2433.2 834942877 834863245 834803045 834646821 834525168 834470928 834342182 834214747 834144413 834004998 833877444
2453.6 833877444 833843112 833728552 833566189 833487332 833361745 833160818 833010793 832856119 832656562 832526267
2474H32526267j24157k12312j51693q7560j87218j87993j03652j63556j96337j31548
2494.4H30980241j51455j67728j13844j45793j92762j47879j67310k15948j39117r6977
2514.8H29441428j44481j27495j44779k17021j73330j20938j81317k07782j72675j90139
2535.2H27761471j88172j46746j91331k15054j44720j55091k01404j44839j44363k24829
2555.6H26004922k14934k00152k40147k13862j92702k51055k48134k17199k90990l32773
2576H23602974l01420l17514l16680k93374l48270l82006l27885l46005m27365m13180
2596.4H20129275l88443m38213m65930m61102m70697m67897m60386m76182m85897m93943
2616.8H15520585n15163n13196m70698m58598m77255m78565n21481n37217m60208m47154
$$ plain form
2474 832526267 832402110 832189798 832038105 831950545 831763327 831575334 831471682 831308126 831111789 830980241
2494.4 830980241 830828786 830661058 830547214 830401421 830208659 830060780 829893470 829677522 829538405 829441428
2514.8 829441428 829296947 829169452 829024673 828807652 828634322 828513384 828332067 828124285 827951610 827761471
2535.2 827761471 827573299 827426553 827235222 827020168 826875448 826720357 826518953 826374114 826229751 826004922
2555.6 826004922 825789988 825589836 825349689 825135827 824943125 824692070 824443936 824226737 823935747 823602974
2576 823602974 823301554 822984040 822667360 822373986 822025716 821643710 821315825 820969820 820542455 820129275
2596.4 820129275 819740832 819302619 818836689 818375587 817904890 817436993 816976607 816500425 816014528 815520585
2616.8 815520585 815005422 814492226 814021528 813562930 813085675 812607110 812085629 811548412 811088204 810641050
2637.1H10641050m90367m57764m19616m38691m59611m58300m74990m86314m35412m13179
2657.5H06106806m40717m23312m12583m45247m28736l69430l77417m34756m56273m47810
2677.9H01870525m30048m22299m58359n00977m82023m55260m63188m65155n05089n54443
2698.3G97133684n61654n76318n73218n42223n57661o07371o11008o03079o16372o01888
2718.7G91282892n92232o07848o04808o13153o50942o29723n49436n24700n66184n87404
2739.1G85356462n76794n52356n17548n21063n71490o12318o21677o30438o47128o57796
2759.5G79447854o88374p31051p28727p09474p23600p55012q01921q38876q39829q43108
2779.9G71787882q36551q35896r08434r73463r75073r80377j000166j026273j089632
$$ plain form
2637.1 810641050 810150683 809692919 809273303 808834612 808375001 807916701 807441711 806955397 806519985 806106806
2657.5 806106806 805666089 805242777 804830194 804384947 803956211 803586781 803209364 802774608 802318335 801870525
2677.9 801870525 801440477 801018178 800559819 800058842 799576819 799121559 798658371 798193216 797688127 797133684
2698.3 797133684 796572030 795995712 795422494 794880271 794322610 793715239 793104231 792501152 791884780 791282892
2718.7 791282892 790690660 790082812 789478004 788864851 788213909 787584186 787034750 786510050 785943866 785356462
2739.1 785356462 784779668 784227312 783709764 783188701 782617211 782004893 781383216 780752778 780105650 779447854
2759.5 779447854 778759480 778028429 777299702 776590228 775866628 775111616 774309695 773470819 772630990 771787882
2779.9 771787882 770951331 770115435 769207001 768233538 767258465 766278088 765277922 764251649 763162017
2798.3G63162017j180887j210153j197577j223147j242757j277983j373053j437783
2814.6G53018677j430094j441538j505077j578450j686156j818359j917601k053916
2830.9G39587486k288997k605319l055990l663898m352331n124450n983471o507039
2847.2G06005991o120027m786789k916098j091003J29461N29587K26260n11647j343727
2865.6F90122008j971662k212763k033889j630127j290620j115262j078546j216889
2881.9F77572250j505911j812637k075493k318084k491057k556682k635598k740145
2898.2F59436643k785444k892971l177703l561318m038333m680157n435228o041527
2914.5F26823962o071627n320192m043221k645612j309454r7275Q56876J513481K054453
$$ plain form
2798.3 763162017 761981130 760770977 759573400 758350253 757107496 755829513 754456460 753018677
2814.6 753018677 751588583 750147045 748641968 747063518 745377362 743559003 741641402 739587486
2830.9 739587486 737298489 734693170 731637180 727973282 723620951 718496501 712513030 706005991
2847.2 706005991 699885964 695099175 692183077 691092074 691221535 691751122 691977382 691465735 690122008
2865.6 690122008 688150346 685937583 683903694 682273567 680982947 679867685 678789139 677572250
2881.9 677572250 676066339 674253702 672178209 669860125 667369068 664812386 662176788 659436643
2898.2 659436643 656651199 653758228 650580525 647019207 642980874 638300717 632865489 626823962
2914.5 626823962 620752335 615432143 611388922 608743310 607433856 607336581 608193457 609706938 611761391
2932.9F11761391K606511L066838L346324L408372L172100K616406J864254J151085
2949.2F32993281O26802K46644P5996K74122P03454J128376J463234J679122J783371
2967.6F40974402J827658J853108J823902J729548J647711J564860J417816J255691
2983.9F54094696J113534R81331Q51512O13510K19584j15573l53218n90980p30216
3002.2F56084180q17597r09686q91209q19921q65639j044154j243293j364231j416087
3020.6F46712363j473785j561582j614988j581728j534462j552761j693248j886726
3036.9F33813083j902759j821577j892031k039432k120793k130687k131045k152801
3053.2F17621958k159416k191544k199829k108216k010405j959980j978158k050281
$$ plain form
2932.9 611761391 614367902 617434740 620781064 624189436 627361536 629977942 631842196 632993281
2949.2 632993281 633620083 633866727 633942723 634216845 634920299 636048675 637511909 639191031 640974402
2967.6 640974402 642802060 644655168 646479070 648208618 649856329 651421189 652839005 654094696
2983.9 654094696 655208230 656189561 657041073 657654583 657874167 657758594 657405376 656814396 656084180
3002.2 656084180 655266583 654356897 653465688 652645767 651780128 650735974 649492681 648128450 646712363
3020.6 646712363 645238578 643676996 642062008 640480280 638945818 637393057 635699809 633813083
3036.9 633813083 631910324 630088747 628196716 626157284 624036491 621905804 619774759 617621958
3053.2 617621958 615462542 613270998 611071169 608962953 606952548 604992568 603014410 600964129
3069.5F00964129k070963k004385j895070j838148j932204k054155k088308k122462
3085.8E84958434k121925k059162k083123k196669k236903k169788k147794k258658
3102.2E67684412k361536k322853k294480k433002k510131k395511k356231k518236
3118.5E48492432k745092k872169k839804k751708k727449k778590k873778k942503
3134.8E25961339k892434k849162k956211l066957l096700l092885l031194k964974
3151.1E02010822l050863l223747l267885l233075l233015l239692l234535l199786
3167.4D76328224l157675l179252l245324l280551l245622l169089l178388l222406
3183.7D50649917l189593l166467l206969l236055l187925l123700l109247l104359
$$ plain form
3069.5 600964129 598893166 596888781 594993711 593155563 591223359 589169204 587080896 584958434
3085.8 584958434 582836509 580777347 578694224 576497555 574260652 572090864 569943070 567684412
3102.2 567684412 565322876 563000023 560705543 558272541 555762410 553366899 551010668 548492432
3118.5 548492432 545747340 542875171 540035367 537283659 534556210 531777620 528903842 525961339
3134.8 525961339 523068905 520219743 517263532 514196575 511099875 508006990 504975796 502010822
3151.1 502010822 498959959 495736212 492468327 489235252 486002237 482762545 479528010 476328224
3167.4 476328224 473170549 469991297 466745973 463465422 460219800 457050711 453872323 450649917
3183.7 450649917 447460324 444293857 441086888 437850833 434662908 431539208 428429961 425325602
3200.1D25325602l055811l013968k994984k932638k875895k872467k846569k789348
3216.4D01943922k760947k728194k704441k711326k670676k590447k529472k459884
3232.7C80788535k443493k503812k498239k417594k291590k173722k181798k251208
3249C62027079k238244k126932k032399k036333k040357j991480j997561k026856j945167
3267.4C43591750j850397j890033j936645j914143j930326j934737j896024j908988
3283.7C28330457j925111j885503j801819j736074j811445j946807j979143j932472
3300C13312083j869380j825809j869679k009511k133459k140283k064526j995862j978427
3318.4B95425147k022535k033829j976967k009243k107442k112925k072304k016574
$$ plain form
3200.1 425325602 422269791 419255823 416260839 413328201 410452306 407579839 404733270 401943922
3216.4 401943922 399182975 396454781 393750340 391039014 388368338 385777891 383248419 380788535
3232.7 380788535 378345042 375841230 373342991 370925397 368633807 366460085 364278287 362027079
3249 362027079 359788835 357661903 355629504 353593171 351552814 349561334 347563773 345536917 343591750
3267.4 343591750 341741353 339851320 337914675 336000532 334070206 332135469 330239445 328330457
3283.7 328330457 326405346 324519843 322718024 320981950 319170505 317223698 315244555 313312083
3300 313312083 311442703 309616894 307747215 305737704 303604245 301463962 299399436 297403574 295425147
3318.4 295425147 293402612 291368783 289391816 287382573 285275131 283162206 281089902 279073328
3334.7B79073328j934648j947969k049446k111733k141982k085358j925975j903475
3351B62972742k056658k115458j992762j866997j851528j837403j707748j607671j707315
3369.3B46229202j890615j862526j605213j429245j376897j314148j206040j056791
3385.7B34487727q41006o06731o25357q75711q61928m86687k49833m20481o66708n65320
3406.1B28287965k81408j43022j23262j20923r0852J4364J38387K13355L45916N67481
3426.5B28808001P47621P58931P82192R21234R04396P58559Q25241J080483J300439
3444.8B36887097J413703J391650J429990J589551J727149J868665J990080J925275
3461.1B50223160J904756K213180K460926K242238J830071J778305K090662K452344
$$ plain form
3334.7 279073328 277138680 275190711 273141265 271029532 268887550 266802192 264876217 262972742
3351 262972742 260916084 258800626 256807864 254940867 253089339 251251936 249544188 247936517 246229202
3369.3 246229202 244338587 242476061 240870848 239441603 238064706 236750558 235544518 234487727
3385.7 234487727 233646721 233039990 232414633 231538922 230676994 230190307 229940474 229519993 228853285 228287965
3406.1 228287965 228006557 227863535 227740273 227619350 227528498 227542862 227681249 227894604 228240520 228808001
3426.5 228808001 229555622 230314553 231096745 232017979 232922375 233680934 234506175 235586658 236887097
3444.8 236887097 238300800 239692450 241122440 242711991 244439140 246307805 248297885 250223160
3461.1 250223160 252127916 254341096 256802022 259044260 260874331 262652636 264743298 267195642
3477.4B67195642K552003K378374K343327K516031K545744K466858K564251K749056
3493.8B87311286K863854K817631K800852K953231K916902K707482K814263L139585
3510.1C10325086L285766L201246L112227L203809L396630L674150L711343L475368
3526.4C37385625L468662L647238L782958L992379M106491L945292M032403M423052
3542.7C68784100M589587M368931M156441M326522M622013M655093M673600M915118
3559D05091405N080908N046756N257129N846501N785197N252301N312890N739004O027370
3577.4D54439461O196112O289541O331861O556422O901085O744027O339908O574750
3593.7E06373167O992400P084131P122993P061005O835818O887079P407784P535040
$$ plain form
3477.4 267195642 269747645 272126019 274469346 276985377 279531121 281997979 284562230 287311286
3493.8 287311286 290175140 292992771 295793623 298746854 301663756 304371238 307185501 310325086
3510.1 310325086 313610852 316812098 319924325 323128134 326524764 330198914 333910257 337385625
3526.4 337385625 340854287 344501525 348284483 352276862 356383353 360328645 364361048 368784100
3542.7 368784100 373373687 377742618 381899059 386225581 390847594 395502687 400176287 405091405
3559 405091405 410172313 415219069 420476198 426322699 432107896 437360197 442673087 448412091 454439461
3577.4 454439461 460635573 466925114 473256975 479813397 486714482 493458509 499798417 506373167
3593.7 506373167 513365567 520449698 527572691 534633696 541469514 548356593 555764377 563299417
3610E63299417P272184P202149P002234P210017P521152O763041O091297O413221P581651
3628.4F26356363P568181O072342N746007N968988N890489N794525N628765N396902
3644.7F74422562N535662O083608N569220M077911L731787M333794M206240L685117
3661G11645901L548086L527224L515661L651142L437042K856195K757490K398550J848817
3679.4G39186108J950264K246320K479732K861560K742707J800478J342058J462579
3695.7G56071806J540065J592278J659155J450777J280010J478434J595675J199842
3712G67868042P32243O98686Q58068R75490R76145Q11398O71506P29501R59218J262784
3732.4G76543081J182914O80506M28021N03778O52731Q39412Q31127N96762L74853
$$ plain form
3610 563299417 570571601 577773750 584775984 591986001 599507153 606270194 612361491 618774712 626356363
3628.4 626356363 633924544 639996886 645742893 651711881 657602370 663396895 669025660 674422562
3644.7 674422562 679958224 686041832 691611052 695688963 699420750 703754544 707960784 711645901
3661 711645901 715193987 718721211 722236872 725888014 729325056 732181251 734938741 737337291 739186108
3679.4 739186108 741136372 743382692 745862424 748723984 751466691 753267169 754609227 756071806
3695.7 756071806 757611871 759204149 760863304 762314081 763594091 765072525 766668200 767868042
3712 767868042 768600285 769298971 770157039 771132529 772108674 772920072 773591578 774321079 775280297 776543081
3732.4 776543081 777725995 778406501 778834522 779338300 779991031 780830443 781661570 782258332 782633185
3750.7G82633185J57595J42694L16262M35948L38257K60233M55916N88954M19795K03908
3771.1G85952747J50442K88606N40793N20527J48714L3378J69397K10464L05473M29809
3791.5G88750350M05550M33028M89652L80814K78175J75000n782r3997M2320L21626
3811.9G91176736N12541N27203M16755K27333l1650k08915j50025K5273K03371L61204
3832.3G93059826M74512L95775L2485j81616j05381j18732j06692K00689M82797L17872
3852.7G94451535j12713k65181j66416P5281K27392J35183O0439R2864L9339p8976
3873.1G94458747j08957n6148J16229K53797J35660k0266p2896n7221m5657o9141M053
3895.5G94538200K36630L68119O8664k53558k06470j88351k48611j18435Q5712J49310
$$ plain form
3750.7 782633185 782790780 782933474 783249736 783685684 784023941 784284174 784740090 785329044 785748839 785952747
3771.1 785952747 786103189 786391795 786932588 787453115 787601829 787635207 787804604 788015068 788320541 788750350
3791.5 788750350 789155900 789588928 790078580 790459394 790737569 790912569 790906787 790812790 790855110 791176736
3811.9 791176736 791689277 792216480 792633235 792860568 792828918 792620003 792469978 792495251 792698622 793059826
3832.3 793059826 793534338 793930113 793962598 793780982 793675601 793556869 793450177 793650866 794133663 794451535
3852.7 794451535 794338822 794073641 793907225 793982506 794209898 794345081 794405520 794498384 794537723 794458747
3873.1 794458747 794349790 794293642 794409871 794663668 794799328 794779062 794706166 794648945 794603288 794534147 794538200
3895.5 794538200 794774830 795142949 795211613 794958055 794751585 794563234 794314623 794196188 794281900 794431210
3915.9G94431210J48236J41085J1563r1791l7849K4676R9003J51694J6272j31130q7202
3938.4G94675767P928O3002Q5771Q1420Q5652P3612K5987%L7015M2140L5465R4593
3962.9G95308352P5161N36N7400J64449J38998M7684N901J4662Q7977J89364J74045
3985.3G96264529O8665M8518P1526O3002J09017J65998
3997.5G96791255
$$ plain form
3915.9 794431210 794579446 794720531 794732094 794640303 794602454 794627130 794726133 794877827 794894099 794762969 794675767
3938.4 794675767 794683695 794746697 794832468 794913888 794999540 795073152 795099139 795099139 795136154 795178294 795213759 795308352
3962.9 795308352 795383513 795384049 795441449 795605898 795744896 795792580 795798481 795813143 795901120 796090484 796264529
3985.3 796264529 796333194 796381712 796453238 796516240 796625257 796791255
3997.5 796791255
##END=$$ End of the data block
