##TITLE=$$ Begin of the data block
##JCAMP-DX=5.00 $$ ACD/SpecManager v 10.08
##SPECTROMETER/DATA SYSTEM=Alpha
##DATE=15 Apr 2014 09:00:42
##DATA TYPE=INFRARED SPECTRUM
##DATA CLASS=XYDATA
##ORIGIN=
##OWNER=
##NPOINTS=1765
##FIRSTX=399.75695801
##LASTX=3997.56933594
##MAXX=3997.56933594
##MINX=399.75695801
##MAXY=0.83593112
##MINY=0.22763132
##XFACTOR=1.0000000000
##YFACTOR=1.000000000000000e-9
##FIRSTY=0.56204313
##DELTAX=2.03957629
##XUNITS=1/CM
##YUNITS=ARBITRARY UNITS
##XYDATA=(X++(Y..Y))
399.8E62043130j522302j213670l74913j212418j505435l67343l87550l20613K95162
$$ 562043130 560520828 559307158 558932245 557719827 556214392 555847049 555459499 555138886 555434048
418.1E55434048r18150j153469M3154n03123q44479k47776q99851j039267j52647o29008
$$ 555434048 554515898 553362429 553405583 552902460 552057981 551810205 550910354 549871087 549718440 549089432
438.5E49089432p96438K88845p0632p38084j0252j48118q26180l04997m80830j256347
$$ 549089432 548292994 548581839 548511207 547773123 547762871 547614753 546788573 546483576 546002746 544746399
458.9E44746399p18474p96617j119136l31879n72383j427234r59098r38296j465321
$$ 544746399 544027925 543231308 542112172 541780293 541207910 539780676 538821578 537883282 536417961
477.3E36417961o38604j76907p15196k78115k52426j287758r37879k95103j027643
$$ 536417961 535779357 535602450 534887254 534609139 534356713 533068955 532131076 531835973 530808330
495.6E30808330r72152m85420j161695r86278l56674j179278j271606n17308j048982
$$ 530808330 529836178 529350758 528189063 527202785 526846111 525666833 524395227 523877919 522828937
514E22828937j368106r98139j655519j896382j030802j151264j608729j124978j152993
$$ 522828937 521460831 520462692 518807173 516910791 515879989 514728725 513119996 511995018 510842025
532.3E10842025j340091p53999r07659j310408o26922o04570j266479p99179o30498
$$ 510842025 509501934 508747935 507840276 506529868 505902946 505298376 504031897 503232718 502602220
550.7E02602220j354278j105964r76532j833410j677870j387477k257973k335996j910030
$$ 502602220 501247942 500141978 499165446 497332036 495654166 494266689 492008716 489672720 487762690
569D87762690k452851k372443j740188k190083k261728j571715j771063j929313j427143
$$ 487762690 485309839 482937396 481197208 479007125 476745397 475173682 473402619 471473306 470046163
587.4D70046163j813591k304941j778931j830429k347767k169818k548068l276796
$$ 470046163 468232572 465927631 464148700 462318271 459970504 457800686 455252618 451975822
603.7D51975822k466231j303703j000762n50925j32829K14398J919031L812790M102319
$$ 451975822 449509591 448205888 447205126 446654201 446521372 446735770 448654801 452467591 456569910
622.1D56569910M225969M493744L925591L757954M189253L611147L114373L217488
$$ 456569910 460795879 465289623 469215214 472973168 477162421 480773568 483887941 487105429
638.4D87105429K097190R25958J681298K817899L136962K856523J055539n22554J496196
$$ 487105429 489202619 490128577 491809875 494627774 497764736 500621259 501676798 501154244 502650440
656.7E02650440M978716O212652N934954M660189L612101M764914M308462K852858
$$ 502650440 507629156 513841808 519776762 524436951 528049052 532813966 537122428 539975286
673.1E39975286L134846L720939K981782K669692L149331K452433J941502K410412
$$ 539975286 543110132 546831071 549812853 552482545 555631876 558084309 560025811 562436223
689.4E62436223J848877J176834J623630J232326O17266J474261J842141J484156K318978
$$ 562436223 564285100 565461934 567085564 568317890 568935156 570409417 572251558 573735714 576054692
707.7E76054692K776742K128244K560734L041149K331435K547741L177583K481103
$$ 576054692 578831434 580959678 583520412 586561561 588892996 591440737 594618320 597099423
724E97099423K439678K995193K243996J922011K558232K003252J403093J992047J812041
$$ 597099423 599539101 602534294 604778290 606700301 609258533 611261785 612664878 614656925 616468966
742.4F16468966J427472K167046K147257J485407J999319K145529J502692K033234
$$ 616468966 617896438 620063484 622210741 623696148 625695467 627840996 629343688 631376922
758.7F31376922K406001J663327J921475K414048J541495J295031J507997L68536k43724
$$ 631376922 633782923 635446250 637367725 639781773 641323268 642618299 644126296 644494832 644251108
777.1F44251108P5519p38799j287937n11051m01616j75416J461744K519786L186405
$$ 644251108 644326627 643587828 642299891 641788840 641387224 641211808 642673552 645193338 648379743
795.4F48379743N006611N986035N763173O272376O076992M621267M196823L906667
$$ 648379743 653386354 659372389 665135562 671407938 677484930 682106197 686303020 690209687
811.7F90209687K376139J594007J220405l95834j494050j888991l363967m347801m099846
$$ 690209687 692585826 694179833 695400238 695004404 693510354 691621363 688257396 683909595 679809749
830.1F79809749m648447m974246m039526l909171m174768l386796l015935k811075
$$ 679809749 675161302 670187056 666147530 662238359 658063591 654676795 651660860 648849785
846.4F48849785j020968R05097K221763M534960O723165P456780Q399486R227157Q548558
$$ 648849785 647828817 648733914 650955677 655490637 662213802 669670582 678070068 687297225 695845783
864.8F95845783P965326P654965O038189M678488M343509L075421J705587J240909
$$ 695845783 703811109 711466074 717504263 722182751 726526260 729601681 731307268 732548177
881.1G32548177K39j309395j333118j760304k480209j787722r86397p77960K02716
$$ 732548177 732548416 731239021 729905903 728145599 725665390 723877668 722891271 722113311 722316027
899.4G22316027R16958M69028N33045N67138o40690j470864j958788l411471m327000
$$ 722316027 723232985 723702013 724235058 724802196 724161506 722690642 720731854 717320383 712993383
917.8G12993383m212915m480482m119515k473414j315057n50986N71311P04825J52588
$$ 712993383 708780468 704299986 700180471 697707057 696392000 695841014 696412325 697117150 697269738
936.2F97269738L31580J49727o19054n95808p20024j771092k428949l064096m554629
$$ 697269738 697601318 697751045 697131991 696536183 695816159 694045067 691616118 688552022 683997393
954.5F83997393n653978o414413q034110r595156j0716140j2391448j3750315j3946712
$$ 683997393 678343415 671929002 663894892 654299736 643583596 631192148 617441833 603495121
970.8F03495121j3822556j3074159j1276543r761036q706450p308483o376624o090522
$$ 603495121 589672565 576598406 565321863 555560827 546854377 539545894 533169270 527078748
987.1E27078748n353928m508555m053056l273368k453744k221048j910925j639426
$$ 527078748 521724820 517216265 513163209 509889841 507436097 505215049 503304124 501664698
1003.5E01664698k256572l169000l846050m735320n338788n228222n170464n109638
$$ 501664698 499408126 496239126 492393076 487657756 482318968 477090746 471920282 466810644
1019.8D66810644m603327m285127m212141l796130l484190l485143l145694k690942
$$ 466810644 462207317 457922190 453710049 449913919 446429729 442944586 439798892 437107950
1036.1D37107950k561986k285600j986593k140403k238363k103000k116144j854360
$$ 437107950 434545964 432260364 430273771 428133368 425895005 423792005 421675861 419821501
1052.4D19821501j025915k01345N13762J129210J050145K55346p78109k117812l484249
$$ 419821501 418795586 418594241 419108003 420237213 421287358 421542704 420764595 418646783 415162534
1070.8D15162534m144848m310757m330367l946930l485650l467679l621578l833234
$$ 415162534 411017686 406706929 402376562 398429632 394943982 391476303 387854725 384021491
1087.1C84021491m205436m208266l557384k666921j663297o15806K7389K89648M11600
$$ 384021491 379816055 375607789 372050405 369383484 367720187 367104381 367131770 367421418 367833018
1105.4C67833018K49148k00421p24018j436233k477825l622025m674494n101472l973544
$$ 367833018 368082166 367881745 367157727 365721494 363243669 359621644 354947150 349845678 345872134
1123.8C45872134j797050k68668K20805J8746n27322l37422Q45819J889229K231091
$$ 345872134 344075084 343806416 344027221 344045967 343518645 343181223 344027042 345916271 348147362
1142.2C48147362K197803J942157J597822J506954J681954J929700K403766L137082
$$ 348147362 350345165 352287322 353885144 355392098 357074052 359003752 361407518 364544600
1158.5C64544600L886581M770666N812794O631702P203579P693589P852942P685512
$$ 364544600 368431181 373201847 379014641 385646343 392849922 400543511 408396453 416081965
1174.8D16081965P531524P252514O698489O094128N259544L983080K725482J727402
$$ 416081965 423613489 430866003 437564492 443658620 448918164 452901244 455626726 457354128
1191.1D57354128R34303P38532J215100J833379K493531L199517L499151L402829L239929
$$ 457354128 458288431 459026963 460242063 462075442 464568973 467768490 471267641 474670470 477910399
1209.5D77910399K795786K152562J863301J750648J559794J680136J950234J993686
$$ 477910399 480706185 482858747 484722048 486472696 488032490 489712626 491662860 493656546
1225.8D93656546K247959K734095K955884L186703L568232L627658L558933L643334
$$ 493656546 495904505 498638600 501594484 504781187 508349419 511977077 515536010 519179344
1242.1E19179344L360331K807439K527177K092242J441240J204312J081348Q72612
$$ 519179344 522539675 525347114 527874291 529966533 531407773 532612085 533693433 534566045
1258.4E34566045J199901J756191K010584K532840L223777L441810L722668M270136
$$ 534566045 535765946 537522137 539532721 542065561 545289338 548731148 552453816 556723952
1274.7E56723952M376710M438162M904210N033553N021274N507052N692720N395890
$$ 556723952 561100662 565538824 570443034 575476587 580497861 586004913 591697633 597093523
1291E97093523N438804N340159M789949M608571M401803L659606L340244L271044K561629
$$ 597093523 602532327 607872486 612662435 617271006 621672809 625332415 628672659 631943703 634505332
1309.4F34505332K097427K113045J603067J268088J607716J511276J342774J783907
$$ 634505332 636602759 638715804 640318871 641586959 643194675 644705951 646048725 647832632
1325.7F47832632J747072J231789J188159Q72016K11954L32296M55261K5689L44157
$$ 647832632 649579704 650811493 651999652 652871668 653083622 653415918 653871179 653896868 654241025
1344.1F54241025R15289P10249O93858Q81612L57509J1980J59681l18944j003325j158238
$$ 654241025 655156314 655866563 656560421 657442033 657799542 657811522 657971203 657652259 656648934 655490696
1364.5F55490696j472473j650333j079977r13918j436770j401543j517117k444327
$$ 655490696 654018223 652367890 651287913 650373995 648937225 647535682 646018565 643574238
1380.8F43574238k638936j844168j361966j185358j094043j492858j825154j996040
$$ 643574238 640935302 639091134 637729168 636543810 635449767 633956909 632131755 630135715
1397.1F30135715k925396l481746l091633l306329l513038k822638k502382k420306
$$ 630135715 627210319 623728573 620636940 617330611 613817573 610994935 608492553 606072247
1413.4F06072247j582086j010537j387835j279831q91208j058102q53360n94973r94981
$$ 606072247 604490161 603479624 602091789 600811958 599920750 598862648 598009288 597414315 596419334
1431.8E96419334q12888j00791k87831l95417L22521N91099R35197J967311K387523
$$ 596419334 595606446 595505655 595217824 594822407 595144928 595736027 596671224 598638535 601026058
1450.1F01026058K537966L820419O336987P669211O443262O179571P080913P668495
$$ 601026058 603564024 607384443 613721430 621390641 627833903 634013474 641094387 648762882
1466.4F48762882P523238Q199931J0188877R836555P090926N667329N216181L985524
$$ 648762882 656286120 664486051 674674928 684511483 691602409 697269738 702485919 706471443
1482.8G06471443K598405K103865R40323r24349j531303k013385l215611l724277l875911
$$ 706471443 709069848 711173713 712114036 711189687 709658384 707644999 704429388 700705111 696829200
1501.1F96829200m015565m133701n885780p037819o096482n257309m832684m064084
$$ 696829200 692813635 688679934 682794154 675756335 669659853 664402544 659569860 655505776
1517.4F55505776k951800l100098l422498k846897k954721k827228j948297j922905
$$ 655505776 652553976 649453878 646031380 643184483 640229762 637402534 635454237 633531332
1533.7F33531332k131522j081884k93552j018525r36806m09901j10209P13110J446545
$$ 633531332 631399810 630317926 630024374 629005849 628069043 627659142 627548933 628262043 629708588
1552.1F29708588J496613J804292K562523J091898o49989n47469q15093j542270k338052
$$ 629708588 631205201 633009493 635572016 636663914 636013925 635466456 634651363 633109093 630771041
1570.5F30771041l223360l959119n186379o192863o498754o718814p160426p889151
$$ 630771041 627547681 623588562 618402183 612209320 605710566 598991752 591831326 583942175
1586.8E83942175q112311q289397q733750q787751q551657q681893q751810q548737
$$ 583942175 575829864 567540467 558806717 550018966 541467309 532785416 524033606 515484869
1603.1E15484869q522510q496940q436054q448929q071601p884145q476764p449269
$$ 515484869 506962359 498465419 490029365 481580436 473508835 465624690 457147926 449698657
1619.4D49698657o160140o269783o135702n289793m429043l346204k011538r24170
$$ 449698657 443538517 437268734 431133032 425843239 421414196 418067992 416056454 415132284
1635.7D15132284m03315K69443J344741K269059L617436M352510L454029M658401O948203
$$ 415132284 414728969 414998412 416343153 418612212 422229648 426582158 430036187 434694588 441642791
1654.1D41642791M891306M042983N434305O831228O926001O362944P395953Q387059
$$ 441642791 446534097 450577080 456011385 462842613 469768614 476131558 483527511 491914570
1670.4D91914570P502914P936895Q659780P848501P719517R074330J1170745R723365
$$ 491914570 499417484 507354379 516014159 523862660 531582177 540656507 551827252 561550617
1686.7E61550617P937134Q262157Q238792R417236J0419727J0781705J2283683J0080099
$$ 561550617 569487751 577749908 585988700 595405936 605825663 616607368 628891051 638971150
1703F38971150Q685350Q998573P645607O740093O659508O595075O616295N588233M139304
$$ 638971150 647656500 656655073 664300680 671040773 677700281 684295356 690911651 696499884 700639188
1721.4G00639188L913224M214168M040658L791452L872513M400075L865719L190577
$$ 700639188 704552412 708766580 712807238 716598690 720471203 724871278 728736997 731927574
1737.7G31927574L785014M024863M049122M460156M583419M563093M324913L592431
$$ 731927574 735712588 739737451 743786573 748246729 752830148 757393241 761718154 765310585
1754G65310585L398955L500760L129840K779722K556503K424955K366305K415657K234637
$$ 765310585 768709540 772210300 775340140 778119862 780676365 783101320 785467625 787883282 790117919
1772.4G90117919J548708J344502J636982J611113J511336J595020J433432J410186
$$ 790117919 791666627 793011129 794648111 796259224 797770560 799365580 800799012 802209198
1788.7H02209198J707435J501441R87351J131833J270055J020670R08733Q79705Q20338
$$ 802209198 803916633 805418074 806405425 807537258 808807313 809827983 810736716 811616421 812436759
1807H12436759R89080J010776O67750O72758Q44181O87241O73175R25839Q23378O60420
$$ 812436759 813425839 814436615 815104365 815777123 816621304 817308545 817981720 818907559 819730937 820391357
1827.4H20391357P41661M43577K23816M98593N80728M62949P11799P84695K98440K03014
$$ 820391357 821133018 821576595 821800411 822299004 822879732 823342681 824054480 824839175 825137615 825340629
1847.8H25340629M01795K99930K99871M81844L79205L02076M54843M78923N08488N47230
$$ 825340629 825742424 826042354 826342225 826824069 827203274 827505350 827960193 828439116 828947604 829494834
1868.2H29494834J56999j00613J73271K84135J71721K80201L22640J46747K54452M25339
$$ 829494834 829651833 829551220 829724491 830008626 830180347 830460548 830783188 830929935 831184387 831609726
1888.6H31609726J67906M7088J99258R0361L3498K40743K04265Q8930K29776J90675
$$ 831609726 831777632 831824720 832023978 832114339 832147837 832388580 832592845 832681775 832911551 833102226
1909H33102226j4186Q8036K32459J23918P6651P2122j10209r4474Q5772k4140r1911
$$ 833102226 833088040 833176076 833408535 833532453 833609104 833681226 833571017 833476543 833562315 833538175 833446264
1931.5H33446264M6969l8266r4951J14918P5102j76847j42336j23501k19583p3195
$$ 833446264 833493233 833454967 833360016 833474934 833550036 833373189 833230853 833107352 832887769 832814574
1951.9H32814574r954j99735j73628n7578j86563j44183K5033j48236k60651j02759
$$ 832814574 832804620 832604885 832431257 832373679 832187116 832042933 832067966 831919730 831659079 831556320
1972.3H31556320j44720k10404m4167q5652k25902j02699q4877k02894o5386m1187
$$ 831556320 831411600 831201196 831157029 831071377 830845475 830742776 830657899 830455005 830389619 830348432
1992.6H30348432k72036j97112p0691k50757k41518p0274k19285k82288r6738j73927
$$ 830348432 830076396 829879284 829808593 829557836 829316318 829246044 829026759 828744471 828647733 828473806
2013H28473806k63452j06037j86801l64840k06470j46926k81691j86742j29103k70367
$$ 828473806 828210354 828104317 827917516 827552676 827346206 827199280 826917589 826730847 826601744 826331377
2033.4H26331377j81973p2360k26974j76967j4364j69695k51531j08540j73152k15590
$$ 826331377 826149404 826077044 825850070 825673103 825658739 825489044 825237513 825128973 824955821 824740231
2053.8H24740231k3961n9187j95086o2883o5327k07841m1247P749k14160r6380P7188
$$ 824740231 824716270 824657083 824461997 824399114 824333787 824125946 824084699 824092448 823878288 823781908 823859096
2076.3H23859096j19687j07646P0990q6964j17540P0334n3406j51336M0292J6928o2346
$$ 823859096 823739409 823631763 823702753 823615789 823498249 823568583 823515177 823363841 823404133 823421061 823358715
2098.7H23358715J03354M8161j29998K0742P4148r0599J9312Q5414j02580R537K02000
$$ 823358715 823462069 823510230 823380232 823400974 823475122 823384523 823403835 823489249 823386669 823396206 823598206
2121.1H23598206L2187n603J41382L4153L4213K24293J09970j609J67370J23143J252
$$ 823598206 823630393 823624790 823766172 823800325 823834538 824058831 824168801 824167192 824334562 824457705 824458957
2143.6H24458957J74641J79231M471J35541K04146K8968J23322K45928P5102P9692
$$ 824458957 824633598 824812829 824817300 824952841 825156987 825185955 825309277 825555205 825630307 825709999
2164H25709999K03073P2062O8366K41697J42276P2718K27630J39535K5689J92046J55032
$$ 825709999 825913072 825985134 826053500 826295197 826437473 826510191 826737821 826877356 826903045 827095091 827250123
2186.4H27250123J4842J79052J81436m7266M7803J59025m947O5267J90735j5497k9624
$$ 827250123 827264965 827444017 827625453 827578187 827625990 827785015 827780068 827845335 828036070 828020573 827990949
2208.8H27990949J54674L5405j6868J51456M3213p5340J00493Q1062o0737P3493Q8096
$$ 827990949 828145623 828181028 828164160 828315616 828358829 828283489 828383982 828465044 828404307 828477800 828565896
2231.3H28565896q6844r478N5671o8903m470P1883o2466l9219M7862r6679r9063N4717
$$ 828565896 828479052 828469574 828525245 828456342 828451872 828523755 828461289 828422070 828469932 828373253 828274190 828328907
2255.8H28328907n4121j23083O1035J9968j09613N1617R1434l0577Q2075J26124j967
$$ 828328907 828274786 828151703 828212738 828232706 828123093 828174710 828266144 828235567 828317642 828443766 828441799
2278.2H28441799J17302K10404K4378J5140J15394l2067q0347N6982j013m8220P1823
$$ 828441799 828559101 828769505 828793883 828809023 828924417 828892350 828812003 828868985 828867972 828819752 828891575
2300.6H28891575q881j30117Q524K3186j06216k6524r477j73390j56164n3346p5281
$$ 828891575 828882694 828752577 828761101 828784287 828678071 828651547 828642070 828468680 828312516 828259170 828183889
2323.1H28183889l2663l5286j55866o5804P2718m6313q6009O1095J06871K48491O35028
$$ 828183889 828151226 828115940 827960074 827894270 827966988 827920675 827834666 827895761 828002632 828251123 828886151
2345.5H28886151O20485J38342k43247m13775m23670k31623j29223J7762M72307O82712
$$ 828886151 829506636 829644978 829401731 828987956 828564286 828332663 828203440 828221202 828693509 829376221
2365.9H29376221N24759N97775P27057N98133O15895P48932O38187M87924M56810L10004
$$ 829376221 829900980 830498755 831225812 831823945 832439840 833188772 833826959 834314883 834771693 835081697
2386.3H35081697J54912J75714J20938J7703J07169J23322k3305n782O7353L994K7299
$$ 835081697 835236609 835412323 835533261 835550964 835658133 835781455 835758150 835752368 835819721 835823715 835851014
2408.7H35851014Q0108l1709m8697J6272q2672j12176j5736p2419j31071k8133l4750
$$ 835851014 835931122 835899413 835850716 835866988 835784316 835672140 835656404 835583985 835452914 835424781 835390031
2431.2H35390031j22010o5029n9962j66118j29939n6862j08838r4891o8545j71066
$$ 835390031 835268021 835202992 835143030 834976912 834846973 834790111 834681273 834586382 834517837 834346771
2451.5H34346771j39892j9550j03653j71065j21236j72198j93834j04308j27196j95802
$$ 834346771 834206879 834187329 834083676 833912611 833791375 833619177 833425343 833321035 833193839 832998037
2471.9H32998037j30117j22070k05040j51396j02997j82807j72198j17540j67966j81377
$$ 832998037 832867920 832745850 832540810 832389414 832286417 832103610 831931412 831813872 831645906 831464529
2492.3H31464529j28508j31726j38700j21474j73092j93417j32024j61410j93059j15752
$$ 831464529 831336021 831204295 831065595 830944121 830771029 830577612 830445588 830284178 830091119 829975367
2512.7H29975367j26899k03728j60575j49966k12311j48952r0301j75000k25424j86146
$$ 829975367 829848468 829644740 829484165 829334199 829121888 828972936 828882635 828707635 828482211 828296065
2533.1H28296065j53899j01030q1360k06888k81572j90079j54555j94907j65522j66357
$$ 828296065 828142166 828041136 827959776 827752888 827471316 827281237 827126682 826931775 826766253 826599896
2553.5H26599896k25008k06768j94848k36392k13444j94371k40922k38716k24591k98798
$$ 826599896 826374888 826168120 825973272 825736880 825523436 825329065 825088143 824849427 824624836 824326038
2573.9H24326038l51786l23951k96355k70784k77638l54529l81588l46482l93927m53532
$$ 824326038 823974252 823650301 823353946 823083162 822805524 822450995 822069407 821722925 821328998 820875466
2594.3H20875466m15683l89397m19080m30346m24802m67181n19216n14389m85658m56631
$$ 820875466 820459783 820070386 819651306 819220960 818796158 818328977 817809761 817295372 816809714 816353083
2614.7H16353083m59791m90486m87745m79281n10633m94718m44532m89294n10872m52280
$$ 816353083 815893292 815402806 814915061 814435780 813925147 813430429 812985897 812496603 811985731 811533451
2635.1H11533451m73082n00262m28736m21703n03421m93049m40002m74632m83334m03702
$$ 811533451 811060369 810560107 810131371 809709668 809206247 808713198 808273196 807798564 807315230 806911528
2655.5H06911528l96430m50194m37141m21643m37558m15265l74735l74615m10855m42087
$$ 806911528 806515098 806064904 805627763 805206120 804768562 804353297 803978562 803603947 803193092 802751005
2675.9H02751005m41790m19199m18187m86910n51999n16414m47393m19974m42445n24640
$$ 802751005 802309215 801890016 801471829 800984919 800432920 799916506 799469113 799049139 798606694 798082054
2696.3G98082054n81265n54263n49317n81503n70476n66006n86688n72801n89072o43433
$$ 798082054 797500789 796946526 796397209 795815706 795245230 794679224 794092536 793519735 792930663 792287230
2716.7G92287230o29663n90146o11841o37055o28471o30975n95510n39243n60999n89251
$$ 792287230 791657567 791067421 790455580 789818525 789190054 788559079 787963569 787424326 786863327 786274076
2737.1G86274076n67556n45978n23448n10693n38290n86629o22212o37114o37889o24180
$$ 786274076 785706520 785160542 784637094 784126401 783588111 783001482 782379270 781742156 781104267 780480087
2757.5G80480087o43313p21097p57158p18236o91175p13230p39693p56622p95066q30114
$$ 780480087 779836774 779115677 778358519 777640283 776949108 776235878 775496185 774739563 773944497 773114383
2777.9G73114383q61108q94606q85904q77380r41396j009762r94146r96530j068175
$$ 773114383 772253275 771358669 770472765 769595385 768653989 767644227 766650081 765653551 764585376
2796.2G64585376j112759j144529j160562j169145j235127j275838j287520j365721
$$ 764585376 763472617 762328088 761167526 759998381 758763254 757487416 756199896 754834175
2812.5G54834175j420677j405954j446545j531541j589537j687229j830458j927078
$$ 754834175 753413498 752007544 750560999 749029458 747439921 745752692 743922234 741995156
2828.9G41995156k037108k270699k608955l050506l637790m353583n170167o019115
$$ 741995156 739958048 737687349 735078394 732027888 728390098 724036515 718866348 712847233
2845.2G12847233o510496o114006m773915k903164j083791J38044N29111K09272n22256
$$ 712847233 706336737 700222731 695448816 692545652 691461861 691599905 692129016 692338288 691816032
2863.5F91816032j340270j957655k190530k025724j647293j320303j154423j123547
$$ 691816032 690475762 688518107 686327577 684301853 682654560 681334257 680179834 679056287
2879.9F79056287j219094j436889j746357k082526k362907k519787k554416k616585
$$ 679056287 677837193 676400304 674653947 672571421 670208514 667688727 665134311 662517726
2896.2F62517726k747893k820074k910972l149808l504216l998757m665374n439580
$$ 662517726 659769833 656949759 654038787 650888979 647384763 643386006 638720632 633281052
2912.5F33281052o059646o040931n253077m052818k713799j358688j31190Q39293J516044
$$ 633281052 627221406 621180475 615927398 611874580 609160781 607802093 607670903 608510196 610026240
2930.8F10026240K061725K606750L065884L357112L432036L193497K626360J868128
$$ 610026240 612087965 614694715 617760599 621117711 624549747 627743244 630369604 632237732
2947.2F32237732J138091N86451K07722O7115K77757P10726J154721J503944J717508
$$ 632237732 633375823 633962274 634169996 634237111 634514868 635225594 636380315 637884259 639601767
2965.5F39601767J809895J835883J827597J800061J748442J668334J570940J424611
$$ 639601767 641411662 643247545 645075142 646875203 648623645 650291979 651862919 653287530
2981.8F53287530J256883J121461R84788Q34763O06657K30908j07229l66270o20842
$$ 653287530 654544413 655665874 656650662 657485425 658092082 658322990 658215761 657849491 657228649
3000.2F57228649p35283p98285r02653q75950p79688q39174j044393j258730j382828
$$ 657228649 656493366 655695081 654792428 653916478 653136790 652297616 651253223 649994493 648611665
3018.5F48611665j400590j427770j533151j625239j635075j603007j591862j704573
$$ 648611665 647211075 645783305 644250154 642624915 640989840 639386833 637794971 636090398
3034.9F36090398j884639j872719j757145j853585k076626k169788k145528k108753
$$ 636090398 634205759 632333040 630575895 628722310 626645684 624475896 622330368 620221615
3051.2F20221615k102614k155423k248823k249062k104998j981855j952588j971901
$$ 620221615 618119001 615963578 613714755 611465693 609360695 607378840 605426252 603454351
3067.5F03454351k024173k044440j998543j921893j850664j896322k031922k093435
$$ 603454351 601430178 599385738 597387195 595465302 593614638 591718316 589686394 587592959
3083.8E87592959k122044k138853k087534k093553k192438k224088k172768k177596
$$ 587592959 585470915 583332062 581244528 579150975 576958537 574734449 572561681 570384085
3100.1E70384085k261579k329588k327978k331734k436459k476275k359510k353191
$$ 570384085 568122506 565792918 563464940 561133206 558696747 556220472 553860962 551507771
3116.4E51507771k536058k742172k868533k864837k798796k760589k766788k842546
$$ 551507771 548971713 546229541 543361008 540496171 537697375 534936786 532169998 529327452
3132.8E29327452k910495k857804k834499k975106l100574l111422l085673l031373
$$ 529327452 526416957 523559153 520724654 517749548 514648974 511537552 508451879 505420506
3149.1E05420506k984345l069103l240794l303706l274411l254503l209621l158063
$$ 505420506 502436161 499367058 496126264 492822558 489548147 486293644 483084023 479925960
3165.4D79925960l150314l173709l225863l273934l266901l206968l148049l179371
$$ 479925960 476775646 473601937 470376074 467102140 463835239 460628271 457480222 454300851
3181.7D54300851l249050l245860l179937l156752l200978l194570l141255l119588
$$ 454300851 451051801 447805941 444626004 441469252 438268274 435073704 431932449 428812861
3198D28812861l108382l060609l000975k967983k933294k874821k846390k853066k807617
$$ 428812861 425704479 422643870 419642895 416674912 413741618 410866797 408020407 405167341 402359724
3216.4D02359724k739847k724349k740771k740949k675384k580405k533585k495765
$$ 402359724 399619877 396895528 394154757 391413808 388738424 386158019 383624434 381128669
3232.7C81128669k470076k485544k466053k373814k267778k213866k191752k207279
$$ 381128669 378658593 376173049 373706996 371333182 369065404 366851538 364659786 362452507
3249C62452507k220362k153099k084464k044678k004683k004236k017855k004951j955986
$$ 362452507 360232145 358079046 355994582 353949904 351945221 349940985 347923130 345918179 343962193
3267.4C43962193j905650j919270j923770j902967j936078j947225j889139j850247
$$ 343962193 342056543 340137273 338213503 336310536 334374458 332427233 330538094 328687847
3283.7C28687847j853764j864642j846046j811355j860142j966566j990765j920402
$$ 328687847 326834083 324969441 323123395 321312040 319451898 317485332 315494567 313574165
3300C13574165j844674j798719j836807j981378k119809k167523k111137k043754k035945
$$ 313574165 311729491 309930772 308093965 306112587 303992778 301825255 299714118 297670364 295634419
3318.4B95634419k006501j958192j989722k085090k127647k085954k048880k019703
$$ 295634419 293627918 291669726 289680004 287594914 285467267 283381313 281332433 279312730
3334.7B79312730j972795k002239k065211k058655k080709k080381j961619j944780
$$ 279312730 277339935 275337696 273272485 271213830 269133121 267052740 265091121 263146341
3351B63146341k069026k092541j982540j861423j829147j837909j725510j616955j716435
$$ 263146341 261077315 258984774 257002234 255140811 253311664 251473755 249748245 248131290 246414855
3369.3B46414855j879692j828074j597166j440436j377240j343578j262695j067206
$$ 246414855 244535163 242707089 241109923 239669487 238292247 236948669 235685974 234618768
3385.7B34618768q05974n78046o06850q70093q73819m81412k21014m34533p36609o02871
$$ 234618768 233812794 233234748 232627898 231757805 230883986 230402574 230181560 229747027 229010418 228407547
3406.1B28407547k49788r9197j28672j72883j25691J6093J47983K40207L61264N25206
$$ 228407547 228157759 228058562 227929890 227757007 227631316 227647409 227795392 228035599 228396863 228922069
3426.5B28922069P22006Q05467Q38831R53272Q93087O93813P77572J078203J307130
$$ 228922069 229644075 230449542 231288373 232241645 233134732 233828545 234606117 235684320 236991450
3444.8B36991450J447827J445710J427442J551867J702130J811936J951903J991064
$$ 236991450 238439277 239884987 241312429 242864296 244566426 246378362 248330265 250321329
3461.1B50321329J994580K225488K425402K231271J861333J829237K094984K385169
$$ 250321329 252315909 254541397 256966799 259198070 261059403 262888640 264983624 267368793
3477.4B67368793K516270K401471K326668K461433K525240K501250K639383K814531
$$ 267368793 269885063 272286534 274613202 277074635 279599875 282101125 284740508 287555039
3493.8B87555039K871871K781928K765119K921491K876491K689212K830953L142148
$$ 287555039 290426910 293208838 295973957 298895448 301771939 304461151 307292104 310434252
3510.1C10434252L291637L255546L144592L200501L427684L695250L676683L430128
$$ 310434252 313725889 316981435 320126027 323326528 326754212 330449462 334126145 337556273
3526.4C37556273L437817L656477L860145M078627M161328M010171M046082M371941
$$ 337556273 340994090 344650567 348510712 352589339 356750667 360760838 364806920 369178861
3542.7C69178861M616350M425228M133046M281282M601181M689067M728317M919082
$$ 369178861 373795211 378220439 382353485 386634767 391235948 395925015 400653332 405572414
3559D05572414N061478N040884N261183N840718N793542N311251N371153N766124O011217
$$ 405572414 410633892 415674776 420935959 426776677 432570219 437881470 443252623 449018747 455029964
3577.4D55029964O154269O288380O355256O604343O971270O740272O300360O615579
$$ 455029964 461184233 467472613 473827869 480432212 487403482 494143754 500444114 507059693
3593.7E07059693P065535P081389P101000P115841O938219O943524P377445P483959
$$ 507059693 514125228 521206617 528307617 535423458 542361677 549305201 556682646 564166605
3610E64166605P229031P138013O993115P283450P611453O840587O088316O301284P486284
$$ 564166605 571395636 578533649 585526764 592810214 600421667 607262254 613350570 619651854 627138138
3628.4F27138138P621646O182194N775928N919576N853533N769730N580485N387843
$$ 627138138 634759784 640941978 646717906 652637482 658491015 664260745 669841230 675229073
3644.7F75229073N597293O149113N568802M058362L749609M346430M171312L641486
$$ 675229073 680826366 686975479 692544281 696602643 700352252 704698682 708869994 712511480
3661G12511480L515541L489137L484607L664851L489733K868235K724230K409876J902639
$$ 712511480 716027021 719516158 723000765 726665616 730155349 733023584 735747814 738157690 740060329
3679.4G40060329J967371K235353K471209K828776K728701J839042J370191J474798
$$ 740060329 742027700 744263053 746734262 749563038 752291739 754130781 755500972 756975770
3695.7G56975770J564205J607537J620829J384258J241327J467228J584410J230777
$$ 756975770 758539975 760147512 761768341 763152599 764393926 765861154 767445564 768676341
3712G68676341P98225P40349R32753J026392Q45194O27101O45935P80165R19998J178384
$$ 768676341 769474566 770214915 771147668 772174060 773019254 773646355 774292290 775072455 775992453 777170837
3732.4G77170837J204550P70331N02169N38826O00874P60138P93159N63801L89874
$$ 777170837 778375387 779145718 779647887 780186713 780787587 781547725 782340884 782904685 783294559
3750.7G83294559K39253K01284L09289L92318L56436L38494M61221N11527L63410J96933
$$ 783294559 783533812 783735096 784044385 784436703 784793139 785131633 785592854 786104381 786467791 786664724
3771.1G86664724J85371L41236N72265N51819J74284J2756J47640J90974K59757M29749
$$ 786664724 786850095 787191331 787763596 788315415 788489699 788502455 788650095 788841069 789100826 789530575
3791.5G89530575M73559M83453M86374L51489K49684J83224N5194n3167l8445J73211
$$ 789530575 790004134 790487587 790973961 791325450 791575134 791758358 791813552 791760385 791721940 791895151
3811.9G91895151M16994N62310N24402K47419j06275k25067o8605J03891J72674K53976
$$ 791895151 792312145 792874455 793398857 793646276 793540001 793314934 793246329 793350220 793522894 793776870
3832.3G93776870M24385M02391O7532j18256j33514j85967o4551K22742L99232L21507
$$ 793776870 794201255 794603646 794671178 794552922 794419408 794233441 794168890 794391632 794790864 795112371
3852.7G95112371p391k19345j36911P3194J73867R8884Q2016J29461L5584j08182j03891
$$ 795112371 795104980 794885635 794748724 794821918 794995785 795094669 795176685 795306146 795341730 795233548 795129657
3875.2G95129657k1160J33097K47538J14739k3126k8551l934j2815r2208o3539J50025
$$ 795129657 795108497 795241594 795489132 795603871 795580745 795552194 795548260 795535445 795443237 795379698 795529723
3897.6G95529723L00288J23382j58429j90735j74403k25604j13010P2777J00613P2658
$$ 795529723 795830011 795953393 795794964 795604229 795429826 795204222 795091212 795163989 795264602 795337260
3918G95337260O8366J1027l2484l3558k2054O3897J38819M6313o4850m1127j5974N543
$$ 795337260 795405626 795416653 795384169 795350611 795328557 795392454 795531273 795577586 795512736 795471609 795455635 795461178
3942.5G95461178J04785J32203R0897N1200k0444J2398J09315Q7440N1081P6771M7624
$$ 795461178 795565963 795698166 795789063 795840263 795819819 795832217 795941532 796028972 796080053 796156824 796204448
3964.9G96204448k4557J6451J28209J37150J03236R3162M1187M1782J45913J40011
$$ 796204448 796179891 796196342 796324551 796461701 796564937 796658099 796699286 796741068 796886981 797026992
3985.3G97026992J7464J7166J20163J49131J35362J52946
$$ 797026992 797044456 797061622 797181785 797330916 797466278 797619224
3997.5G97619224
$$ 797619224
##END=$$ End of the data block
