##TITLE=$$ Begin of the data block
##JCAMP-DX=5.00 $$ ACD/SpecManager v 10.08
##SPECTROMETER/DATA SYSTEM=Alpha
##DATE=15 Apr 2014 09:00:42
##DATA TYPE=INFRARED SPECTRUM
##DATA CLASS=XYDATA
##ORIGIN=
##OWNER=
##NPOINTS=1765
##FIRSTX=399.75695801
##LASTX=3997.56933594
##MAXX=3997.56933594
##MINX=399.75695801
##MAXY=0.83637208
##MINY=0.22763959
##XFACTOR=1.0000000000
##YFACTOR=1.000000000000000e-9
##FIRSTY=0.56495655
##DELTAX=2.03957629
##XUNITS=1/CM
##YUNITS=ARBITRARY UNITS
##XYDATA=(X++(Y..Y))
399.8E64956546j854718j110017l68595j427055j664817n29349o90102l46900N93007
$$ 564956546 563101828 561991811 561623216 560196161 558531344 558001995 557311893 556964993 557558000
418.1E57558000q28922j309573j37151o15358q40008q0586p13885j145958n15342o71447
$$ 557558000 556729078 555419505 555282354 554666996 553826988 553746402 553032517 551886559 551371217 550699770
438.5E50699770m24444K91526m52399r19342j68920l55184o66320J35958j96516j236260
$$ 550699770 550275326 550566852 550114453 549195111 549026191 548671007 548004687 548140645 547944129 546707869
458.9E46707869p16269o74606j235544p47920p63654j275480q04603r02653j426339
$$ 546707869 545991600 545316994 544081450 543333530 542569876 541294396 540489793 539587140 538160801
477.3E38160801o50704m24921j062274m62354k68042j050949o29842l84629j322269
$$ 538160801 537510097 537085176 536022902 535560548 535292506 534241557 533611715 533227086 531904817
495.6E31904817j141787n91934j202762r67741k52425r87411j267135q05617j314520
$$ 531904817 530763030 530171096 528968334 528000593 527748168 526760757 525493622 524688005 523373485
514E23373485j349330q01683j416802j630128r65893j487493j878977q90196q37803
$$ 523373485 522024155 521222472 519805670 518175542 517209649 515722156 513843179 512952983 512115180
532.3E12115180j367151r42171j023412j344740n75185n36144j282751q48472p11918
$$ 512115180 510748029 509805858 508782446 507437706 506862521 506326377 505043626 504195154 503483236
550.7E03483236j486778j259983j065135j769930j521409j218944k213687k371550
$$ 503483236 501996458 500736475 499671340 497901410 496380001 495161057 492947370 490575820
567D90575820j841813k421111k432823j746863k100677k092450j446456j849026k190590
$$ 490575820 488734007 486312896 483880073 482133210 480032533 477940083 476493627 474644601 472454011
585.4D72454011j738160k030611k279312j625270j718491k238244k134770k575546
$$ 472454011 470715851 468685240 466405928 464780658 463062167 460823923 458689153 456113607
601.7D56113607l215373k418965j468688j267553o22630m112L81529K088427L844053
$$ 456113607 452898234 450479269 449010581 447743028 447120398 447116286 447497815 449586242 453430295
620D53430295L949434M070311M365147L904342L924221M276484L521025L068775L311634
$$ 453430295 457379729 461450040 465815187 469719529 473643750 477920234 481441259 484510034 487821668
638.4D87821668K279997J025886J558870K674520L181725K975107J136779n01215J385450
$$ 487821668 490101665 491127551 492686421 495360941 498542666 501517773 502654552 502153337 503538787
656.7E03538787M829884O241023O080509M783869L780424M826009M121364K731084
$$ 503538787 508368671 514609694 520690203 525474072 529254496 534080505 538201869 540932953
673.1E40932953L146351L728270K956748K712965L277779K539873J939058K380848
$$ 540932953 544079304 547807574 550764322 553477287 556755066 559294939 561233997 563614845
689.4E63614845J789391J097501J520455J181244P20561J568377J815677J445055K306103
$$ 563614845 565404236 566501737 568022192 569203436 569923997 571492374 573308051 574753106 577059209
707.7E77059209K760768K128303K546549K957404K296686K619326L202260K477944
$$ 577059209 579819977 581948280 584494829 587452233 589748919 592368245 595570505 598048449
724E98048449K434492K892911K189398K019405K625764J932084J335025K038062J876175
$$ 598048449 600482941 603375852 605565250 607584655 610210419 612142503 613477528 615515590 617391765
742.4F17391765J444280K123833K055347J482785K075195K122700J460433K092362
$$ 617391765 618836045 620959878 623015225 624498010 626573205 628695905 630156338 632248700
758.7F32248700K416253J601755J916647K387226J494884J354754J552761L44932k44737
$$ 632248700 634664953 636266708 638183355 640570581 642065465 643420219 644972980 645317912 645073175
777.1F45073175M0472p99656j288652m78149l84152j69039J464129K549708L249287
$$ 645073175 645113647 644313991 643025339 642547190 642163038 641993999 643458128 646007836 649257123
795.4F49257123M993201N891263N704046O248414O060660M661322M234135L815949
$$ 649257123 654250324 660141587 665845633 672094047 678154707 682816029 687050164 690866113
811.7F90866113K272010J631796J310527l11553j417399j930296l486395m391909m095673
$$ 690866113 693138123 694769919 696080446 695768893 694351494 692421198 688934803 684542894 680447221
830.1F80447221m649043m925609l974914l885031m184544l401339l013492k790987
$$ 680447221 675798178 670872569 666897655 663012624 658828080 655426741 652413249 649622262
846.4F49622262r92001Q96275K230406M612744O733716P374406Q324384R126485Q420169
$$ 649622262 648630261 649526536 651756942 656369686 663103402 670477808 678802192 687928677 696348846
864.8F96348846P930756P701397O101429M749894M332185K963781J638592J299083
$$ 696348846 704279602 711980999 718082428 722832322 727164507 730128288 731766880 733065963
881.1G33065963R1970j309514j427472j819432k408206j709461j067460q82387K28166
$$ 733065963 733157933 731848419 730420947 728601515 726193309 724483848 723416388 722534001 722762167
899.4G22762167R50218M56333N34534N22077p02977j422405j882434l401160m350305
$$ 722762167 723712385 724168718 724703252 725225329 724522352 723099947 721217513 717816353 713466048
917.8G13466048m267990m524947m097044k437234j331031n85914N26071O43849J50442
$$ 713466048 709198058 704673111 700576067 698138833 696807802 696221888 696747959 697391808 697542250
936.2F97542250L95656J85728o41227o26862p35402j778543k456188l115356m553914
$$ 697542250 697937906 698123634 697482407 696855545 696120143 694341600 691885412 688770056 684216142
954.5F84216142n589962o403029q087993r623766j0735929j2419045j3714254j3881206
$$ 684216142 678626180 672223151 664135158 654511392 643775463 631356418 617642164 603760958
970.8F03760958j3801992j3038039j1204422r699941q666396p314026o430924o123483
$$ 603760958 589958966 576920927 565716505 556016564 547350168 540036142 533605218 527481735
987.1E27481735n324364m483163m083813l350913k539516k253592j911163j685262
$$ 527481735 522157371 517674208 513590395 510239482 507699966 505446374 503535211 501849949
1003.5E01849949k308309l145009l794730m718542n328089n214065n160719n093724
$$ 501849949 499541640 496396631 492601901 487883359 482555270 477341205 472180486 467086762
1019.8D67086762m592091m255235m139393l730119l440827l443479l134489k724290
$$ 467086762 462494671 458239436 454100043 450369924 446929097 443485618 440351129 437626839
1036.1D37626839k599031k302766j968175k072632k168864k070189k091587j840770
$$ 437626839 435027808 432725042 430756867 428684235 426515371 424445182 422353595 420512825
1052.4D20512825j064181k85864M23640J085699J060277K74062p81119k131074l482730
$$ 420512825 419448644 419162780 419586420 420672119 421732396 422006458 421225339 419094265 415611535
1070.8D15611535m157811m341841m322588l907889l489852l522218l651142l803760
$$ 415611535 411453724 407111883 402789295 398881406 395391554 391869336 388218194 384414434
1087.1C84414434m139185m151642l521681k645045j680583o27756M1723K68996L77685
$$ 384414434 380275249 376123607 372601926 369956881 368276298 367648542 367690265 367959261 368336946
1105.4C68336946K31623k27958p41481j418799k452553l622681m703015n120158l966361
$$ 368336946 368568569 368340611 367599130 366180331 363727778 360105097 355402082 350281924 346315563
1123.8C46315563j794428k78622K08378J5974n05626l05474Q63016J885146K224296
$$ 346315563 344521135 344242513 344450891 344466865 343961239 343655765 344518781 346403927 348628223
1142.2C48628223K186656J893967J546413J504839J699090J934200K398849L134489
$$ 348628223 350814879 352708846 354255259 355760098 357459188 359393388 361792237 364926726
1158.5C64926726L881603M745334N792737O632805P197470P667214P818490P673442
$$ 364926726 368808329 373553663 379346400 385979205 393176675 400843889 408662379 416335821
1174.8D16335821P537216P241517O688565O088466N223065L939599K704114J718342
$$ 416335821 423873037 431114554 437803119 443891585 449114650 453054249 455758363 457476705
1191.1D57476705R57072P99596J265079J842469K482951L187895L479182L384054L220111
$$ 457476705 458433777 459233373 460498452 462340921 464823872 468011767 471490949 474875003 478095114
1209.5D78095114K770394K153367J884282J772940J595765J708061J943201J996338
$$ 478095114 480865508 483018875 484903157 486676097 488271862 489979923 491923124 493919462
1225.8D93919462K274662K735228K929598L175676L582358L646910L604591L687561
$$ 493919462 496194124 498929352 501858950 505034626 508616984 512263894 515868485 519556046
1242.1E19556046L359437K814531K549946K096474J445234J215577J084924Q81851
$$ 519556046 522915483 525730014 528279960 530376434 531821668 533037245 534122169 535004020
1258.4E35004020J215160J744151J964688K469182L165245L418803L733158M262031
$$ 535004020 536219180 537963331 539928019 542397201 545562446 548981249 552714407 556976438
1274.7E56976438M337251M392147M841327M981876N035162N545735N690634N394459
$$ 556976438 561313689 565705836 570547163 575529039 580564201 586109936 591800570 597195029
1291E97195029N474568N358457M783094M616499M418016L685712L364325L237903K509534
$$ 597195029 602669597 608028054 612811148 617427647 621845663 625531375 628895700 632133603 634643137
1309.4F34643137K105415K139926J634419J340628J646757J503766J374006J814484
$$ 634643137 636748552 638888478 640522897 641863525 643510282 645014048 646388054 648202538
1325.7F48202538J707495J192629J193166Q55327J96993L70681M80116P689L34680
$$ 648202538 649910033 651102662 652295828 653151155 653348148 653718829 654198945 654206634 654541314
1344.1F54541314R16958P19487P20859Q92162L45945J2458J63257l15666r78589j168788
$$ 654541314 655458272 656177759 656898618 657790780 658136725 658149183 658312440 657996774 657018185 655849397
1364.5F55849397j524806j630187j023173r34839j459480j393914j541436k433538
$$ 655849397 654324591 652694404 651671231 650736392 649276912 647882998 646341562 643908024
1380.8F43908024k585948j817643j340390j175105j118779j503527j817644k027869
$$ 643908024 641322076 639504433 638164043 636988938 635870159 634366632 632548988 630521119
1397.1F30521119k954185l457904l086984l343881l526866k806664k498567k418935
$$ 630521119 627566934 624109030 621022046 617678165 614151299 611344635 608846068 606427133
1413.4F06427133j577020j034021j398504j254022r03189j077294q25286n80490j032412
$$ 606427133 604850113 603816092 602417588 601163566 600260377 599183083 598357797 597777307 596744895
1431.8E96744895q41796q3626k61545l93927K92122N30243Q89659J940370K364278
$$ 596744895 595903099 595819473 595557928 595164001 595456123 595986366 596876025 598816395 601180673
1450.1F01180673K566397L854930O285906P634401O479919O190539P093370P701873
$$ 601180673 603747070 607602000 613887906 621522307 628002226 634192765 641286135 648988008
1466.4F48988008P506788Q175552J0249973R897232P082045N658626N197704L953755
$$ 648988008 656494796 664670348 674920321 684817553 691899598 697558224 702755928 706709683
1482.8G06709683K608836K133250R32336r63152j582861k046644l180981l677666l883064
$$ 706709683 709318519 711451769 712384105 711420953 709838092 707791448 704610467 700932801 697049737
1501.1F97049737m010499m074335n853772p045209o072283n271435m899859m079759
$$ 697049737 693039238 688964903 683111131 676065922 669993639 664722204 659822345 655742586
1517.4F55742586k908528l059864l386796k831876k957046k814353j951277j942217
$$ 655742586 652834058 649774194 646387398 643555522 640598476 637784123 635832846 633890629
1533.7F33890629k095282j025737k83300j010478r33528m36842r4593P63059J436233
$$ 633890629 631795347 630769610 630486310 629475832 628542304 628105462 628010869 628773928 630210161
1552.1F30210161J459718J820266K574980J068056o39737n32031q01086j490712k302528
$$ 630210161 631669879 633490145 636065125 637133181 636493444 635961413 635160327 633669615 631367087
1570.5F31367087l259480l972768n147338o191492o508053o696522p156670p905781
$$ 631367087 628107607 624134839 618987501 612796009 606287956 599591434 592434764 584528983
1586.8E84528983q113802q306563q741796q758604q585453q753956q732795q501053
$$ 584528983 576415181 568108618 559366822 550608218 542022765 533268809 524536014 516034961
1603.1E16034961q549333q567482q508027q479893q045733p876247q518636p479281
$$ 516034961 507485628 498918146 490410119 481930226 473884493 466008246 457489610 450010329
1619.4D50010329o174564o283492o140232n304396m482657l412604k041161r20266
$$ 450010329 443835765 437552273 431412041 426107645 421624988 418212384 416171223 415250957
1635.7D15250957m17382K62023J375854K322971L665388M371554L479391M715800O979019
$$ 415250957 414833575 415095598 416471452 418794423 422459811 426831365 430310756 435026556 442005575
1654.1D42005575M876643M045218N460829O877869O986589O418436P431597Q400798
$$ 442005575 446882218 450927436 456388265 463266134 470252723 476671159 484102756 492503554
1670.4D92503554P532447P970333Q651734P826388P695078R021879J1118173R701669
$$ 492503554 500036001 508006334 516658068 524484456 532179534 541201413 552319586 562021255
1686.7E62021255P922769Q268595Q259654R412706J0404944J0783673J2281179J0105133
$$ 562021255 569944024 578212619 586472273 595884979 606289923 617073596 629354775 639459908
1703F39459908Q715570Q971751P628381O779373O688893O593585O622493N574524M100263
$$ 639459908 648175478 657147229 664775610 671554983 678243876 684837461 691459954 697034478 701134741
1721.4G01134741L910423M247903M062832L811478L887654M351079L798187L193855
$$ 701134741 705045164 709293067 713355899 717167377 721055031 725406110 729204297 732398152
1737.7G32398152L819049M044592M053772M444718M569352M580795M336417L571034
$$ 732398152 736217201 740261793 744315565 748760283 753329635 757910430 762246847 765817881
1754G65817881L380715L498495L133774K788722K551616K414524K378047K445996K234160
$$ 765817881 769198596 772697091 775830865 778619587 781171203 783585727 785963774 788409770 790643930
1772.4G90643930J510799J338184J649618J606644J506269J600682J443804J421213
$$ 790643930 792154729 793492913 795142531 796749175 798255444 799856126 801299930 802721143
1788.7H02721143J700759J470864R88185J151442J270652J051426R56655Q76188P90656
$$ 802721143 804421902 805892766 806880951 808032393 809303045 810354471 811311126 812187314 812977970
1807H12977970R76205J003563O61671O65784Q15451O54280O71566R44674Q43227O78360
$$ 812977970 813954175 814957738 815619409 816285193 817100644 817754924 818426490 819371164 820214391 820892751
1827.4H20892751P35104M22061K38955N10335N57363M68135P34269P73430K98143K30372
$$ 820892751 821627855 822049916 822288871 822799206 823356569 823824704 824558973 825332403 825630546 825860918
1847.8H25860918M03821L17752L65436M97580L21686K58386M46141M67003M92751N37098
$$ 825860918 826264739 826582491 826947927 827445507 827767193 828025579 828471720 828938723 829431474 829968572
1868.2H29968572J49071o7890K51591L21210J42157K54214L18110J51515K57849L85046
$$ 829968572 830117643 830049753 830301344 830622554 830764711 831018925 831337035 831488550 831746399 832131445
1888.6H32131445J10865O1333K44439R0361L1650K46644J90794R6917K53022J65760
$$ 832131445 832242310 832303643 832548082 832638443 832670093 832916737 833107531 833204448 833457470 833623230
1909H33623230o1810P7129K43187J45554Q9825M6908j22070p1824R0004k2173n7340
$$ 833623230 833561420 833638549 833881736 834027290 834117115 834164023 834041953 833970129 834060133 834037960 833980620
1931.5H33980620O7055m8101r0897J14083M7088j93655j44184j38700k27451n2691
$$ 833980620 834047675 833999574 833908677 834022760 834069848 833876193 833732009 833593309 833365858 833313167
1951.9H33313167O795k00689j88887q2254j65463j03533M649j85907k49445q7321j63734
$$ 833313167 833319962 833119273 832930386 832848132 832682669 832579136 832583785 832397878 832148433 832061112 831897378
1974.3H31897378k28584m2081o4492j93596q8930q9347j95802n6386o2763l01779k08437
$$ 831897378 831668794 831626713 831562221 831368625 831279695 831190348 830994546 830938160 830875397 830573618 830365181
1996.7H30365181q0943k47955k18690p3314k40802k92063j31548k05338k38001r3996
$$ 830365181 830284238 830036283 829817593 829744279 829503477 829211414 829079866 828874528 828636527 828542531
2017.1H28542531k12431l44217j49668j35838k89381j62065j32620l13938k01941q3267
$$ 828542531 828330100 827985883 827836215 827700377 827410996 827248931 827116311 826802373 826600432 826517165
2037.5H26517165k34485j65105l9518k20954k49505p3791j46031j77026j3530r8229
$$ 826517165 826282680 826117575 826078057 825857103 825607598 825533807 825387776 825210750 825197220 825098991
2057.9H25098991k06112m7505p3195k24292n3585K1339j64569r7930M172j36018n7339
$$ 825098991 824892879 824845374 824772179 824547887 824494302 824515641 824351072 824253142 824257314 824121296 824063957
2080.3H24063957Q2850r4652r8169O1035q3983j32024N1797k6167q6427J07885L0219
$$ 824063957 824146807 824052155 823953986 824015021 823931038 823799014 823850811 823824644 823738217 823846102 823876321
2102.8H23876321j35779M3750O7413j09137Q464N9069p9632Q3089K23517K0802K2113
$$ 823876321 823740542 823784292 823851705 823742568 823751032 823810101 823730469 823813558 824037075 824057877 824079990
2125.2H24079990J79470L4630j371J68503N5253j3888J76907J13487J8180K16126J90437
$$ 824079990 824259460 824294090 824292719 824461222 824516475 824502587 824679494 824792981 824811161 825027287 825217724
2147.7H25217724J3590J62601K11120K4974J17541K11298N5194J15156K36809P8261
$$ 825217724 825231314 825393915 825605035 825630009 825747550 825958848 826014042 826129198 826366007 826444268
2168H26444268P4804K22743J11699R0360K43485J17302K0445K04920J50264k444J59740
$$ 826444268 826519072 826741815 826853514 826943874 827187359 827304661 827325106 827530026 827680290 827677846 827837586
2190.5H27837586J68384j8836R0898J54018r835Q3804J66059l6955P987J73092J4305
$$ 827837586 828005970 827987134 828078032 828232050 828222215 828306019 828472078 828435123 828443110 828616202 828630507
2212.9H28630507k7418J49429M9233n1677J04725O0380n8115P7069N6148j08004J5557
$$ 828630507 828603089 828752518 828801751 828750074 828854799 828915179 828857064 828934133 828990281 828882277 828897834
2235.4H28897834R0420n8055j1384N5015p3970m3034L4809j05143q2791P8857l1292
$$ 828897834 828988254 828930199 828918815 828973830 828899860 828856826 828891635 828786492 828703701 828782558 828751266
2257.8H28751266j03652M4763l994p8738P9573O9320l1293J13488J26123j5557J27197
$$ 828751266 828647614 828692377 828688383 828609645 828689218 828758538 828727245 828840733 828966856 828951299 829078496
2280.2H29078496K08318K265m18R7335n1201p8737O9558K6763K980R4295j5796j01685
$$ 829078496 829286814 829289079 829288661 829385996 829334795 829256058 829325616 829352379 829355359 829449654 829433858 829332173
2304.7H29332173M5657r54j60813m8995L099j34706j34409r3579j11520J371K5153
$$ 829332173 829377830 829376876 829216063 829167068 829170167 829035461 828901052 828807473 828695953 828697324 828722477
2327.1H28722477j14143j6987R9718r8586j53005j2398L8743L03507P41840O50704
$$ 828722477 828608334 828591347 828691065 828592479 828439474 828427076 828465819 828769326 829511166 830161870
2347.5H30161870J20937k80440m77492m70579j91808j5735Q2850M08948N88595M96924
$$ 830161870 830282807 830002367 829524875 829054296 828862488 828846753 828929603 829338551 829927146 830424070
2367.9H30424070O19889P75575O65129O31392O47127N17607M74632M97698L19362J41621
$$ 830424070 831043959 831819534 832484663 833116055 833763182 834280789 834755421 835253119 835572481 835714102
2388.3H35714102J46389Q4042L934J06097J18970K683M2140O6996k7120K6166Q7678
$$ 835714102 835860491 835944533 835948467 836054564 836173534 836176217 836218357 836285353 836258233 836284399 836372077
2410.8H36372077m0054o4254L398q8990j07586N662n1975j20223m0948p0393j33038
$$ 836372077 836332023 836267769 836271167 836182177 836074591 836080253 836028278 835908055 835867107 835796714 835663676
2433.2H35663676o2287p4505j52409r4533p3493j40786q7798n7757j57475j31428m7267
$$ 835663676 835601389 835526884 835374475 835279942 835206449 835065663 834977865 834920108 834762633 834631205 834583938
2455.6H34583938j36375j64986q2791j46985k00331j22964j32561j80721j28329j36376
$$ 834583938 834447563 834282577 834199786 834052801 833852470 833729506 833596945 833416224 833287895 833151519
2476H33151519k02596j60098j36554j99199j66655r8288j44898j72139j39773j54793
$$ 833151519 832948923 832788825 832652271 832453072 832286417 832188129 832043231 831871092 831731319 831576526
2496.4H31576526j46866j21295j84119j98781j19090j43886j94371j26242j20223j92583
$$ 831576526 831429660 831308365 831124246 830925465 830806375 830662489 830468118 830341876 830221653 830029070
2516.8H30029070j68204j60396j99318j21713p8380j91986k52307j98662j60992j22190
$$ 830029070 829860866 829700470 829501152 829379439 829301059 829109073 828856766 828658104 828497112 828374922
2537.2H28374922j17361k20239k38419j57595j85966k20895j51694j47283k01404j88112
$$ 828374922 828257561 828037322 827798903 827641308 827455342 827234447 827082753 826935470 826734066 826545954
2557.6H26545954k02358k35558j95562k12193k86221k50042j94549k66195l37362l23713
$$ 826545954 826343596 826108038 825912476 825700283 825414062 825164020 824969471 824703276 824365914 824042201
2578H24042201l16560l10481l13580l75807l63529l05951l96788m79340m17352l82721
$$ 824042201 823725641 823415160 823101580 822725773 822362244 822056293 821659505 821180165 820762813 820380092
2598.4H20380092m26770m57942m62294m72963m65691m55498m73142m64797m63724n12183
$$ 820380092 819953322 819495380 819033086 818560123 818094432 817638934 817165792 816700995 816237271 815725088
2618.8H15725088n22435m78386m84050n02527m76658m83990m94718m48704m34339m78983
$$ 815725088 815202653 814724267 814240217 813737690 813261032 812777042 812282324 811833620 811399281 810920298
2639.2H10920298m77612m55081m84348m94361m56094m39704m54545m62413m61280m37141
$$ 810920298 810442686 809987605 809503257 809008896 808552802 808113098 807658553 807196140 806734860 806297719
2659.6H06297719m01616m03702m21107l98159l68297l97920m39883m49121m53651m44770
$$ 806297719 805896103 805492401 805071294 804673135 804304838 803906918 803467035 803017914 802564263 802119493
2680H02119493m51803m84168m64797m28617m45485m71116m82559n25236n62072n57780
$$ 802119493 801667690 801183522 800718725 800290108 799844623 799373507 798890948 798365712 797803640 797245860
2700.4G97245860n64694n64337n34892n36502n86390o16849o20961o35087o18279o04749
$$ 797245860 796681166 796116829 795581937 795045435 794459045 793842196 793221235 792586148 791967869 791363120
2720.8G91363120o30498o05464n79119o32226o22153n28336n09024n56826n89132n99027
$$ 791363120 790732622 790127158 789548039 788915813 788293660 787765324 787256300 786699474 786110342 785511315
2741.2G85511315n67615n24938n49019o01112o03378n83411n96880o28114o56069p00235
$$ 785511315 784943700 784418762 783869743 783268631 782665253 782081842 781484962 780856848 780200779 779500544
2761.6G79500544p39753p34389p27117p42734p39693p63953q14915q33630q57771q72492
$$ 779500544 778760791 778026402 777299285 776556551 775816858 775052905 774237990 773404360 772546589 771674097
2782G71674097q62360r04441r66728r66132r61303j015842j070559j105249j169801
$$ 771674097 770811737 769907296 768940568 767974436 767013133 765997291 764926732 763821483 762651682
2800.3G62651682j208305j182676j188278j231670j284898j384973j435757j402974
$$ 762651682 761443377 760260701 759072423 757840753 756555855 755170882 753735125 752332151
2816.6G52332151j442313j528740j569212j672387j835227j929343k030670k274275
$$ 752332151 750889838 749361098 747791886 746119499 744284272 742354929 740324259 738049984
2832.9G38049984k638638l091157l653883m334689n151569o011904o495535o107211
$$ 738049984 735411346 732320189 728666306 724331617 719180048 713168144 706672609 700565398
2849.3G00565398m783452k914369j093209J25587N30482K32339n29349j382053j983941
$$ 700565398 695781946 692867577 691774368 691899955 692430437 692662776 692133427 690751374 688767433
2867.6F88767433k193808k016366j627684j276910j082003j051366j199842j515269
$$ 688767433 686573625 684557259 682929575 681652665 680570662 679519296 678319454 676804185
2883.9F76804185j848400k100587k324760k505540k594233k648473k710879k780318
$$ 676804185 674955785 672855198 670530438 668024898 665430665 662782192 660071313 657290995
2900.2F57290995k905786l155291l527939m033566m706979n464136o044269o035626
$$ 657290995 654385209 651229918 647701979 643668413 638961434 633497298 627453029 621417403
2916.6F21417403n263030m031897k672493j321733j20819P98047J471340K054096K629339
$$ 621417403 616154373 612122476 609449983 608128250 608007431 608805478 610276818 612330914 614960253
2934.9F14960253L117919L378034L390550L159762K631426J891434J161754N99265
$$ 614960253 618078172 621456206 624846756 628006518 630637944 632529378 633691132 634290397
2951.2F34290397K13742O9738K80201P27892J193643J518905J673400J765430J827062
$$ 634290397 634504139 634573877 634854078 635581970 636775613 638294518 639967918 641733348 643560410
2969.6F43560410J826345J780391J719654J675725J619160J463056J255512J123607
$$ 643560410 645386755 647167146 648886800 650562525 652181685 653644741 654900253 656023860
2985.9F56023860J031816Q85844N99742J90139j13368l34382n89073p32899q00907
$$ 656023860 657055676 657941520 658541262 658731401 658618033 658283651 657694578 656961679 656160772
3004.3F56160772q90732q91328q16762q42274j023352j257002j378477j393854j452625
$$ 656160772 655270040 654378712 653561950 652719676 651696324 650439322 649060845 647666991 646214366
3022.6F46214366j563191j630187j596571j543283j589477j743197j891077j888633
$$ 646214366 644651175 643020988 641424417 639881134 638291657 636548460 634657383 632768750
3038.9F32768750j832902j895726k011120k089858k116740k099633k098859k152443
$$ 632768750 630935848 629040122 627029002 624939144 622822404 620722771 618623912 616471469
3055.3F16471469k231896k218544k092898j994908j968682j981914k024769k050281
$$ 616471469 614239573 612021029 609928131 607933223 605964541 603982627 601957858 599907577
3071.6E99907577k011478j910984j829029j906514k063155k118945k122462k107501
$$ 599907577 597896099 595985115 594156086 592249572 590186417 588067472 585945010 583837509
3087.9E83837509k079546k127350k216696k230168k162754k150417k252936k322793
$$ 583837509 581757963 579630613 577413917 575183749 573020995 570870578 568617642 566294849
3104.2E66294849k303541k333939k461195k495944k383232k368033k510667k697528
$$ 566294849 563991308 561657369 559196174 556700230 554316998 551948965 549438298 546740770
3120.5E46740770k863228k905548k836465k757609k749205k851367k932250k866209
$$ 546740770 543877542 540971994 538135529 535377920 532628715 529777348 526845098 523978889
3136.8E23978889k820849k958835l087699l084242l074527l041983k988696l067702
$$ 523978889 521158040 518199205 515111506 512027264 508952737 505910754 502922058 499854356
3153.2D99854356l232866l292799l254027l223478l209651l177196l161669l213346
$$ 499854356 496621490 493328691 490074664 486851186 483641535 480464339 477302670 474089324
3169.5D74089324l269463l259868l221541l217906l206402l176958l187358l220499
$$ 474089324 470819861 467559993 464338452 461120546 457914144 454737186 451549828 448329329
3185.8D48329329l226667l192425l158957l151416l151328l136307l101796l048748
$$ 448329329 445102662 441910237 438751280 435599864 432448536 429312229 426210433 423161685
3202.1D23161685l015369l003359k968728k923757k864361k824306k814055k767354
$$ 423161685 420146316 417142957 414174229 411250472 408386111 405561805 402747750 399980396
3218.4C99980396k723575k731382k734483k679348k591967k530754k490610k479821
$$ 399980396 397256821 394525439 391790956 389111608 386519641 383988887 381498277 379018456
3234.7C79018456k483696k450287k402664k331614k239615k206474k230049k207398
$$ 379018456 376534760 374084473 371681809 369350195 367110580 364904106 362674057 360466659
3251.1C60466659k107054k055108k108932k103239k001226j972884k009362j956523
$$ 360466659 358359605 356304497 354195565 352092326 350091100 348118216 346108854 344152331
3267.4C44152331j855045j864046j944810j975060j951754j929432j922101j907289
$$ 344152331 342297286 340433240 338488430 336513370 334561616 332632184 330710083 328802794
3283.7C28802794j881242j849532j807183j784295j855760j972437j988828j920909
$$ 328802794 326921552 325072020 323264837 321480542 319624782 317652345 315663517 313742608
3300C13742608j877159j854390j880944j998633k106517k120436k056986k015888k025933
$$ 313742608 311865449 310011059 308130115 306131482 304024965 301904529 299847543 297831655 295805722
3318.4B95805722k011835j984894k004832k085269k133667k104849k076924k016991
$$ 295805722 293793887 291808993 289804161 287718892 285585225 283480376 281403452 279386461
3334.7B79386461j925022j957982k086997k120734k092838k041578j918853j909554
$$ 279386461 277461439 275503457 273416460 271295726 269202888 267161310 265242457 263332903
3351B63332903k074062k149642k030909j882821j844883j859635j755313j627534j705527
$$ 263332903 261258841 259109199 257078290 255195469 253350586 251490951 249735638 248108104 246402577
3369.3B46402577j867474j820549j599848j448900j379162j333043j236915j044214
$$ 246402577 244535103 242714554 241114706 239665806 238286644 236953601 235716686 234672472
3385.7B34672472p95439n87717o52387q92088q40441m65274k68995n10618p59527n79015
$$ 234672472 233877033 233289316 232636929 231744841 230904400 230439126 230170131 229659513 228899986 228320971
3406.1B28320971k49535q8930r1225j54540r7155P0974J73435K32964L79339N61476
$$ 228320971 228071436 227982506 227891281 227736741 227639586 227710560 227883995 228116959 228496298 229057774
3426.5B29057774P07015P44731P99357R43617R05886P23362P79554J056448J304984
$$ 229057774 229764789 230509520 231308877 232252494 233158380 233881742 234661296 235717744 237022728
3444.8B37022728J457453J451358J450762J575947J712203J853794J981243J943365
$$ 237022728 238480181 239931539 241382301 242958248 244670451 246524245 248505488 250448853
3461.1B50448853J949280K242178K456278K209872J796186J807361K126426K415836
$$ 250448853 252398133 254640311 257096589 259306461 261102647 262910008 265036434 267452270
3477.4B67452270K530426K392143K288997K432018K562464K557009K609730K738267
$$ 267452270 269982696 272374839 274663836 277095854 279658318 282215327 284825057 287563324
3493.8B87563324K858251K844721K836049K948910K879977K687365K799630L109515
$$ 287563324 290421575 293266296 296102345 299051255 301931232 304618597 307418227 310527742
3510.1C10527742L314584L301531L147781L171385L414780L695279L661215L453404
$$ 310527742 313842326 317143857 320291638 323463023 326877803 330573082 334234297 337687701
3526.4C37687701L529906L699810L807008M025638M130810L984005M084050M435659
$$ 337687701 341217607 344917417 348724425 352750063 356880873 360864878 364948928 369384587
3542.7C69384587M602015M397034M181773M361600M639476M660607M729300M979402
$$ 369384587 373986602 378383636 382565409 386927009 391566485 396227092 400956392 405935794
3559D05935794N046487M968435N254864N918592N856067N317569N392462N775571O002009
$$ 405935794 410982281 415950716 421205580 427124172 432980239 438297808 443690270 449465841 455467850
3577.4D55467850O188273O354601O415486O626099O964416O771147O356358O603778
$$ 455467850 461656123 468010724 474426210 481052309 488016725 494787872 501144230 507748008
3593.7E07748008P010340P101000P160902P127940O945909O995618P469058P587671
$$ 507748008 514758348 521859348 529020250 536148190 543094099 550089717 557558775 565146446
3610E65146446P302582P172406O971479P233023P591486O838382O090700O299198P501006
$$ 565146446 572449028 579621434 586592913 593825936 601417422 608255804 614346504 620645702 628146708
3628.4F28146708P686853O216944N800128N974412N868554N754888N571246N355179
$$ 628146708 635833561 642050505 647850633 653825045 659693599 665448487 671019733 676374912
3644.7F76374912N544305O072939N499839M084528L819585M377901M180014L632367
$$ 676374912 681919217 687992156 693491995 697576523 701396108 705774009 709954023 713586390
3661G13586390L493190L478050L457964L610610L454090K846896K713919K452016J949072
$$ 713586390 717079580 720557630 724015594 727626204 731080294 733927190 736641109 739093125 741042197
3679.4G41042197J986921K232432K451837K801061K679109J824796J439572J548946
$$ 741042197 743029118 745261550 747713387 750514448 753193557 755018353 756457925 758006871
3695.7G58006871J553833J536489J585006J420439J274824J431405J543045J300097
$$ 758006871 759560704 761097193 762682199 764102638 765377462 766808867 768351912 769652009
3712G69652009R10759P41959Q36908R62973Q87275P24673O75142P03156Q74042J213491
$$ 769652009 770562768 771304727 772141635 773104608 773991883 774716556 775391698 776094854 776968896 778182387
3732.4G78182387J201570P39277N04970N07653N28872O83904P54773N93186M16219
$$ 778182387 779383957 780123234 780628204 781135857 781664729 782348633 783103406 783696592 784112811
3750.7G84112811K48671K67625L98576M23789L36706L68298N26845M86672K63810J66893
$$ 784112811 784361482 784629107 785027683 785451472 785788178 786156476 786683321 787169993 787433803 787600696
3771.1G87600696K17378L54469N60343N00083J36733O7234K11239J99795K66373M24564
$$ 787600696 787818074 788172543 788732886 789232969 789369702 789436936 789648175 789847970 790114343 790538907
3791.5G90538907M49777M38332L86894K93076L24965K60412L3081o2585J6928J96397
$$ 790538907 790988684 791427016 791813910 792106986 792431951 792692363 792725444 792662859 792679787 792876184
3811.9G92876184L68178M69625M23670K08676k3783j32560l3498J31130J80542K17200
$$ 792876184 793244362 793713987 794137657 794346333 794322550 794189990 794156492 794287622 794468164 794685364
3832.3G94685364L58283L43740N8770q1479p6056j51395p0155K67267M69208K56777
$$ 794685364 795043647 795387387 795446157 795364678 795288622 795137227 795067072 795334339 795803547 796060324
3852.7G96060324j13070k03848r1911J10507K11299J22309M6193L2187j6868j11997
$$ 796060324 795947254 795743406 795651495 795762002 795973301 796095610 796141803 796173990 796157122 796045125
3873.1G96045125j11223L7492K32160K43008L1113m9412m0769o2466k4200n3286m8816
$$ 796045125 795933902 795971394 796203554 796446562 796477675 796428263 796387494 796325028 796300828 796247542 796198726
3895.5G96198726J74403L25680J10447j68323k04266j87456k07603r9957Q4221J28091
$$ 796198726 796373129 796698809 796809256 796640933 796436667 796249211 796041608 795941651 796025872 796153963
3915.9G96153963R3102P2479j3530l2186K6166J9848Q6010J74999K0266j46568n8830
$$ 796153963 796247065 796319544 796306014 796273828 796299994 796319842 796405852 796580851 796601117 796454549 796395719
3938.4G96395719N3048O1453R2387J60038J70768O3478p3730q8931K802O2764O1631
$$ 796395719 796448767 796510220 796602607 796762645 796933413 796996891 796923161 796834230 796837032 796899796 796961427
3960.8G96961427O8187O5029L9637J01090J86324J45137O4016J8656N185J09017K33472
$$ 796961427 797029614 797094643 797134280 797235370 797421694 797566831 797630847 797649503 797654688 797763705 797997177
3983.2G97997177J32143j9133K1398P4029N9784R5427J28746
$$ 797997177 798129320 798110187 798131585 798205614 798265398 798360825 798489571
3997.5G98489571
$$ 798489571
##END=$$ End of the data block
