##TITLE=$$ Begin of the data block
##JCAMP-DX=5.00 $$ ACD/SpecManager v 10.08
##SPECTROMETER/DATA SYSTEM=Alpha
##DATE=10 Apr 2014 11:00:52
##DATA TYPE=INFRARED SPECTRUM
##DATA CLASS=XYDATA
##ORIGIN=
##OWNER=
##NPOINTS=1765
##FIRSTX=399.75695801
##LASTX=3997.56933594
##MAXX=3997.56933594
##MINX=399.75695801
##MAXY=0.85805118
##MINY=0.24869667
##XFACTOR=1.0000000000
##YFACTOR=1.000000000000000e-9
##FIRSTY=0.61406541
##DELTAX=2.03957629
##XUNITS=1/CM
##YUNITS=ARBITRARY UNITS
##XYDATA=(X++(Y..Y))
399.8F14065409L34620p92920j480043p35998j259387j116633M43100j20043j342178
$$ 614065409 614400029 613607109 612127066 611391068 610131681 609015048 609458148 609338105 607995927
418.1F07995927j98185l54111j129926k50160k69115o48260j312p01189j398623N5075
$$ 607995927 607797742 607443631 606313705 606063545 605794430 605146170 605144858 604443669 603045046 603100121
438.5F03100121L99470l47674J13130k67982p50542L99887L3319j144111r5904L5346
$$ 603100121 603499591 603151917 603265047 602997065 602246523 602646410 602679729 601535618 601439714 601475060
458.9F01475060j185119k40326O0260j512527j200378m55797j472473j091421m17947
$$ 601475060 600289941 600049615 600109875 598597348 597396970 596941173 595468700 594377279 593959332
477.3E93959332j133383n48065N2274j241863j053214r8109j153827j273572m05729
$$ 593959332 592825949 592277884 592330158 591088295 590035081 589936972 588783145 587509573 587103844
495.6E87103844j381457j488626l34978j130879j504779m15206j020014j490355m19497
$$ 587103844 585722387 584233761 583898783 582767904 581263125 580847919 579827905 578337550 577918053
514E77918053j012206k057672j174211j255930k005517j217783j257121k095283j288890
$$ 577918053 576905847 574848175 573673964 572418034 570412517 569194734 567937613 565842330 564553440
532.3E64553440j015306j753151r14812m54843j477480j104474n27561j580775j597404
$$ 564553440 563538134 561784983 560870171 560415328 558937848 557833374 557305813 555725038 554127634
550.7E54127634r11832j631260j758576j057922j673401k062797j505614k222419k950429
$$ 554127634 553215802 551584542 549825966 548768044 547094643 545031846 543526232 541303813 538353384
569E38353384k280832k273857k553106j819908j844585k468884j966596j885056k396048
$$ 538353384 536072552 533798695 531245589 529425681 527581096 525112212 523145616 521260560 518864512
587.4E18864512j958906k015710k788603k178669j498223k447962l117502k879918
$$ 518864512 516905606 514889896 512101293 509922624 508424401 505976439 502858937 499979019
603.7D99979019k672940j618237k50607n17905p77751O80506K200335L374249M597306
$$ 499979019 497306079 495687842 495437235 494919330 494141579 494822085 497022420 500396669 504993975
622.1E04993975M549265L836274M187048M189014L420115L594458L646374K530038
$$ 504993975 509543240 513379514 517566562 521755576 525175691 528770149 532416523 534946561
638.4E34946561K049267J749754J012445K149105L792405K597511L77476k00331J260578
$$ 534946561 536995828 538745582 539758027 541907132 545699537 548297048 548674524 548474193 549734771
656.7E49734771M874826P605791O320655L582120L465891N090594M157305L919959
$$ 549734771 554609597 562215388 568536043 572118163 575584054 580674648 584831953 588751912
673.1E88751912L935158L020347L299236L484011K401173K511918K952099J915872
$$ 588751912 592687070 595707417 599006653 602490664 604891837 607403755 610355854 612271726
689.4F12271726J766920K330244J375794R19283J785993J532138J360237K412260K258718
$$ 612271726 614038646 616368890 617744684 618663967 620449960 621982098 623342335 625754595 628013313
707.7F28013313J794457K835512K886713K010345K729714L120780K319098K769947
$$ 628013313 629807770 632643282 635529995 637540340 640270054 643390834 645709932 648479879
724F48479879L187418K192914K260328K827823J928806J767159K426326J667380J346171
$$ 648479879 651667297 653860211 656120539 658948362 660877168 662644327 665070653 666738033 668084204
742.4F68084204K264738J800955J268446K214015K058327J281559K013564K191246
$$ 668084204 670348942 672149897 673418343 675632358 677690685 678972244 680985808 683177054
758.7F83177054J445174K025426K290189J333356J552820J874745P25329M25756O78539
$$ 683177054 684622228 686647654 688937843 690271199 691824019 693698764 694424093 694849849 695528388
777.1F95528388n01335j015544l08811o74188p44820P25567J405776J842201L568649
$$ 695528388 695027053 694011509 693702698 693028510 692283690 693009257 694415033 696257234 699825883
795.4F99825883M407585M367947N427420N698979M522860M368603M125119K561331
$$ 699825883 704233468 708601415 714028835 719727814 724250674 728619277 732744396 735305727
811.7G35305727K079963K090991N60283m24444n44429j990855l184914l042221l669620
$$ 735305727 737385690 739476681 740036964 739612520 739068091 737077236 733892322 730850101 727180481
830.1G27180481m348815l692925l680825m116177l252626k853930l238261k189219
$$ 727180481 722831666 719138741 715457916 711341739 708089113 705235183 701996922 699807703
846.4F99807703q15451j16229J812220M152715N122185O334424P818520P649422P313192
$$ 699807703 698992252 698876023 700688243 704840958 709963143 716297567 724116087 731765509 739078701
864.8G39078701P608354O471753N022347M808485L756523K123654J850724J099945
$$ 739078701 746687055 753158808 758181155 762989640 766746163 768869817 770720541 771820486
881.1G71820486m97282p32243j019359k216935j994669j185775j362920o39021O85453
$$ 771820486 771323204 770590961 769571602 767354667 765359998 764174223 762811303 762172282 762857735
899.4G62857735N90503O54519J370847O54638k93314k85924j368165k877295l002465
$$ 762857735 763448238 764102757 765473604 766128242 765834928 765549004 764180839 761303544 758301079
917.8G58301079l465116m258632l348351k202034j829565n84185M91739J59144K99037
$$ 758301079 754835963 750577331 747228980 745026946 743197381 742613196 743104935 743264079 743563116
936.2G43563116P14600P987k29478J65641n94139j405835j517952k639949m073799
$$ 743563116 744277716 744285703 744056225 744221866 743627727 742221892 740703940 738063991 733990192
954.5G33990192m603266n782843p456720q340597r771109j1880040j2889564j3383865
$$ 733990192 729386926 723604083 716147363 707806766 698035657 686155617 673266053 659882188
970.8F59882188j3944209j3130367j1561095j0686994r522617q030236p524073p155776
$$ 659882188 645937979 632807612 621246517 610559523 601036906 593006670 585482597 578326821
987.1E78326821o173074n594551n129278m086137l424704l196418k570093k377570
$$ 578326821 572153747 566559196 561429918 557343781 553919077 550722659 548152566 545774996
1003.5E45774996l089726l744781m509687n627513o051898n947948o106913n847692
$$ 545774996 542685270 538940489 534430802 528803289 522751391 516803443 510696530 504848838
1019.8E04848838n135387m897356m710555m184247m059910m067421l521055l068775
$$ 504848838 499713451 494816095 490105540 485921293 481861383 477793962 474272907 471204132
1036.1D71204132k912730k417982k071798k166271k028554j924038k091378j685918
$$ 471204132 468291402 465873420 463801622 461635351 459606797 457682759 455591381 453905463
1052.4D53905463p59601j3203Q59738J662820J493693O82592k87920j844615l453583
$$ 453905463 453145862 453132659 453992397 455655217 457148910 457831502 457543582 455698967 452245384
1070.8D52245384m175782m455983m551232m157067l863245m098236m439533m967183
$$ 452245384 448069602 443613619 439062387 434905320 431042075 426943839 422504306 417537123
1087.1D17537123n652547n600899m558564l073096j317680L51459J187444J395821
$$ 417537123 411884576 406283677 401725113 398652017 397334337 397685796 398873240 400269061
1103.4D00269061J426071J013965K79218l65973j317501k803028m516452o458312p474989
$$ 400269061 401695132 402709097 402988315 402622342 401304841 398501813 393985361 387527049 380052060
1121.8C80052060n581796j840383N57989R47147J99467q37713n14299J318544K826661
$$ 380052060 374470264 372629881 373187870 374135017 374334484 373496771 372982472 374301016 377127677
1140.1C77127677L297299L235311K698242K012819J763225J713634J678466K091527
$$ 377127677 380424976 383660287 386358529 388371348 390134573 391848207 393526673 395618200
1156.4C95618200K870769L698408M920542O459296P729382Q745253R449780R446442
$$ 395618200 398488969 402187377 407107919 413567215 421296597 430041850 439491630 448938072
1172.7D48938072R110361Q794129Q125961P297009O603122N466282L841400K366424
$$ 448938072 458048433 466842562 474968523 482265532 488868654 494334936 498176336 500542760
1189.1E00542760R17733m38154q89540m58956M23134J927793L560662M385591M589319
$$ 500542760 501460493 501022339 500132799 499673843 500096977 502024770 505585432 509971023 514560342
1207.4E14560342M421890L631770K808094K492547K182663J923442K097308K223373
$$ 514560342 518982232 522614002 525422096 527914643 530097306 532020748 534118056 536341429
1223.7E36341429K274692K737641L181994L331483L733038M131616M097104M166543
$$ 536341429 538616121 541353762 544535756 547867239 551600277 555731893 559828997 563995540
1240.1E63995540M230976L757179L259242K951324K323806J732051J551867J292228
$$ 563995540 568226516 571983695 575242937 578194261 580518067 582250118 583801985 585094213
1256.4E85094213J120270J484573J867354K150833K810776L388584L595471M026175
$$ 585094213 586214483 587699056 589566410 591717243 594528019 597916603 601512074 605538249
1272.7F05538249M472315M491926M678666N102158N163669N302847N733430N740702
$$ 605538249 610010564 614502490 619181156 624283314 629446983 634749830 640483260 646223962
1289F46223962N606532N718291N429864M911721M732430M339754L660083L368199L032148
$$ 646223962 651830494 657548785 662978649 667890370 672622800 676962554 680622637 683990836 687022984
1307.4F87022984K293289J895666J673758J142800J026809J252115J104295J172960
$$ 687022984 689316273 691211939 692885697 694028497 695055306 696307421 697411716 698584676
1323.7F98584676J593709J501202J174927J118243P17699J74284J58131M4764k03669
$$ 698584676 700178385 701679587 702854514 703972757 704690456 704864740 705022871 705067635 704863966
1342G04863966K02894N75483M06801M35353N06579N9546k39015j80185n20408j120210
$$ 704863966 705066860 705642343 706049144 706484497 706991076 707050622 706811607 706631422 706111014 704990804
1362.4G04990804j404702j635373j771331j379609j320362k000451k405584l389835
$$ 704990804 703586102 701950729 700179398 698799789 697479427 695478976 693073392 689683557
1378.7F89683557n753160o495893l097355J618623L114760J720667K00510r01282j587569
$$ 689683557 683930397 677434504 674337149 675955772 679070532 680791199 680991709 680090427 678502858
1397.1F78502858k519548k995551k784848l120184l235340k586901k244115k062619
$$ 678502858 675983310 672987759 670202911 667082727 663847387 661260486 659016371 656953752
1413.4F56953752j354873r77099j409292j083076n09262o62327o21379m47690o24836
$$ 656953752 655598879 654621780 653212488 652129412 651620150 650957823 650336444 649888754 649263918
1431.8F49263918m48107Q34o2644m7386N21779Q59737J174331K046704K799929L101945
$$ 649263918 648815811 648816645 648754001 648706615 649228394 650088131 651262462 653309166 656109095 659211040
1452.2F59211040L953456O476939Q434594O696224O187975P262350P585465O976784
$$ 659211040 663164496 669641435 678076029 684772253 690960228 698222578 705808043 712784827
1468.5G12784827P449090R198368Q743465O206989M663527M081309L297269K078176
$$ 712784827 720233917 729432285 738175750 744382739 749046266 753127575 756424844 758503020
1484.8G58503020J501679P11441r10341j307607j302540k464176l279030k891839k527833
$$ 758503020 760004699 760716140 759805799 758498192 757195652 754731476 751452446 748560607 746032774
1503.2G46032774l116726n800248o227493m742324l972948l635764l516972k699256
$$ 746032774 742916048 737115800 730888307 726145983 722173035 718537271 715020299 712321043
1519.5G12321043k576947k840162k286851k236962k068699j520276j429379j257300
$$ 712321043 709744096 706903934 704617083 702380121 700311422 698791146 697361767 696104467
1535.8F96104467m89175k10762j074493r85504k75015J18851L87848R11057J254081
$$ 696104467 695615292 695404530 694330037 693344533 693069518 693188369 693576217 694487274 695741355
1554.1F95741355J264334J182199j44363q73208p27475r06050j975894l344536l256142
$$ 695741355 697005689 698187888 698043525 697170317 696442842 695536792 693560898 690216362 686960220
1572.5F86960220l791570o308973o737411o314814p219196p739126q171022q720517
$$ 686960220 683168650 676859677 670122266 663807452 656588256 648849130 640678108 631957591
1588.8F31957591q860767q977950r438336r349108r030520r254396r304643q946240
$$ 631957591 623096824 614118874 604680538 595331430 586300910 577046514 567741871 558795631
1605.1E58795631r008408r337723q921623q081257q552075r900987p908404o371617
$$ 558795631 549787223 540449500 531527877 523446620 514894545 504993558 497085154 490713537
1621.4D90713537p028699o612837n641938m720986l093719j998633j669973o24210
$$ 490713537 483684838 477072001 471430063 466709077 463615358 461616725 459946752 459322542
1637.8D59322542N95659J604348K617777M014373M824131M004926N272507Q262873
$$ 459322542 459918201 461522549 464140326 468154699 472978830 476983756 482256263 490519136
1654.1D90519136O353617N373806O353914P923007Q399904P306099Q300901J0056316
$$ 490519136 496872753 502246559 508600473 516523480 524923384 532229483 540530384 550586700
1670.4E50586700Q738041Q881987J0011672Q840263Q146823R708404J2670398J0482967
$$ 550586700 559324741 568206728 578218400 587058663 595205486 604913890 617584288 628067255
1686.7F28067255Q627534R136736Q297980R241998J0739506J0512232J1698246R580136
$$ 628067255 636694789 645831525 654129505 663371503 674111009 684623241 696321487 705901623
1703G05901623P981181Q139431P046342N968571N479693N663574N736530M419982L584803
$$ 705901623 713882804 722022235 729068577 735037148 740516841 746180415 751916945 756336927 759921730
1721.4G59921730L461062L226102L211558L412068L108859L323853L215074K408147
$$ 759921730 763382792 766608894 769820452 773232520 776341379 779665232 782880306 785288453
1737.7G85288453K777457L278435L109157L176510L611624L492296K933443K726793
$$ 785288453 788065910 791344345 794453502 797630012 801241636 804733932 807667375 810394168
1754H10394168K645373K343774K268672K191484J622915J670778K003610J770854J531124
$$ 810394168 813039541 815383315 817651987 819843471 821466386 823137164 825140774 826911628 828442752
1772.4H28442752J323700Q96573J039088J429796J159072R07839J163125J165151R75549
$$ 828442752 829766452 830663025 831702113 833131909 834290981 835198820 836361945 837527096 838502645
1790.7H38502645J096964R09806O40094Q71897R46164N09620N38826Q34763O55889
$$ 838502645 839599609 840509415 841149509 842021406 842967570 843477190 844016016 844850779 845506668
1809.1H45506668N20229O23525M55081L31163N76914N60105M34637O60121O27816K36988
$$ 845506668 846026897 846650422 847105503 847436666 848013580 848573685 849008322 849668443 850296259 850533247
1829.5H50533247K16484L52621K14100L27706N47588M11332L28779L71337J03295N8949
$$ 850533247 850749731 851102352 851316452 851644158 852191746 852603078 852931857 853303194 853406489 853465438
1849.9H53465438L63827K74956O9320K90871L40998J32561L55780N38170J53840k8551
$$ 853465438 853829265 854104221 854173541 854464412 854805410 854937971 855293751 855831921 855985761 855957210
1870.3H55957210J14560J5855Q6188L13342J05023k6762K49505K59817R0599J76966
$$ 855957210 856071770 856087625 856173813 856487155 856592178 856565416 856814921 857074738 857165337 857342303
1890.7H57342303R8049r7274P3492J62959j9490Q1241K02298l2544l5405J37507l7014
$$ 857342303 857440352 857343078 857416570 857579529 857560039 857641280 857843578 857811034 857775629 857913136 857876122
1913.1H57876122m5717J91212K9564j29521O5029j4067j86265P213L6001j91629o2704
$$ 857876122 857830405 858021617 858051181 857921660 857986689 857972622 857786357 857793570 857829571 857637942 857575238
1935.5H57575238J21295k8670l3915o795k97784l16203k5034p3791j86264n3108j73032
$$ 857575238 857696533 857667863 857633948 857627153 857329369 857013166 856988132 856914341 856728077 856674969 856501937
1958H56501937k98262l5822Q702k24948j38044o5923k85447k08318o616j43945j67966
$$ 856501937 856203675 856167853 856176555 855951607 855813563 855747640 855462193 855253875 855247259 855103314 854935348
1980.4H54935348k8789j86741k45512j4126r8169k99811j11223p4207k88666j72376
$$ 854935348 854906559 854719818 854474306 854460180 854362011 854062200 853950977 853876770 853588104 853415728
2000.8H53415728p3731k49625j94609r7155k72930k09212J073j83404k96116j17421
$$ 853415728 853341997 853092372 852897763 852800608 852527678 852318466 852319539 852136135 851840019 851722598
2021.2H51722598j98364l07918j09732j11401k46048q0466n1379k78116j86681k3962
$$ 851722598 851524234 851216316 851106584 850995183 850749135 850668669 850617290 850339174 850152493 850128531
2041.6H50128531j78337j63912n2214j92404j70529J7703j14978k22444p808j4842
$$ 850128531 849950194 849786282 849734068 849541664 849371135 849388838 849273860 849051416 849043608 849028766
2062H49028766j71244l6657J2040j39773m0769M2617j35183j05262M8697o5148r4712
$$ 849028766 848857522 848820865 848832905 848693132 848652363 848694980 848559797 848454535 848503232 848438084 848343372
2084.4H48343372O0976m1127j39535J8358l933j07885M6969O5624q6546K9683J09554
$$ 848343372 848404348 848363221 848223686 848242044 848238111 848130226 848177195 848242819 848156273 848185956 848295510
2106.9H48295510o1274m0591O0082n7340l0577J25468L0756l0935J28388R6143K324
$$ 848295510 848234236 848193645 848253727 848196387 848165810 848291278 848322034 848291099 848419487 848515630 848517954
2129.3H48517954J25051R9957L58J17003J10388n1200N9843J99735O1154N3645J87635
$$ 848517954 848643005 848742962 848743320 848860323 848970711 848919511 848979354 849179089 849240243 849293888 849481523
2151.7H49481523R4295K3484J46031J17421L6598J21176Q9466P16J32918J96993Q4699
$$ 849481523 849575818 849599302 849745333 849862754 849899352 850020528 850109994 850110710 850243628 850440621 850525320
2174.2H50525320J10447J37269K7240P7188J97828R0122N722Q3208M9829J3829J20997
$$ 850525320 850635767 850773036 850800276 850877464 851075292 851165414 851171136 851254344 851304173 851318002 851438999
2196.6H51438999Q6129l0577O0796Q9407l0279L5763J01805k7180j6510Q7916l695
$$ 851438999 851525128 851494551 851555347 851644754 851614475 851650238 851752043 851724863 851708353 851796269 851792574
2219H51792574l3319Q2374K3245n9187K0385J6689l6538L7492M5359m3035k7835j8954
$$ 851792574 851759255 851841629 851864874 851805687 851826072 851842761 851806223 851843715 851889074 851846039 851818204 851799250
2243.5H51799250p5102O854Q0228o3360j29818k3962m3571r4294j550n9m9472N7816
$$ 851799250 851724148 851731002 851811230 851747870 851618052 851594090 851550519 851456225 851454675 851454616 851405144 851462960
2268H51462960Q0228l8743K0266J16706L0934N4539J54793O5565k0206J788m6313p2360
$$ 851462960 851543188 851504445 851524711 851641417 851672351 851726890 851881683 851947248 851927042 851928830 851882517 851810157
2292.5H51810157J7226J729p6652k7478j7822j13487j27792j33932j89006j05977j4126
$$ 851810157 851827383 851829112 851752460 851724982 851707160 851593673 851465881 851331949 851142943 851036966 851022840
2314.9H51022840j49787l05951k81870k03848r9599m0174j46389j38879J5140q0407
$$ 851022840 850873053 850567102 850285232 850081384 849981785 849941611 849795222 849656343 849671483 849591076
2335.3H49591076k19524j35839k2470K32100P44700Q23319K10464m33385o45995n59747
$$ 849591076 849371552 849235713 849213243 849445343 850190043 851013362 851223826 850790441 850144446 849584699
2355.7H49584699m18425k11358L8564L78490O57260O54638O50108Q01563P93755O86824
$$ 849584699 849166274 848954916 848993480 849371970 850029230 850683868 851333976 852135539 852929294 853616118
2376.1H53616118P21336P20739N74649M72188L82483J84536P5578J14143O4671J9908
$$ 853616118 854337454 855058193 855632842 856105030 856487513 856672049 856747627 856861770 856926441 856946349
2396.5H56946349R0540N6266m232P6354N7220p0214l5465J7226m5478k5332L695j13248
$$ 856946349 857036889 857093155 857088923 857165277 857222497 857152283 857116818 857134044 857088566 857063234 857066929 856953681
2421H56953681j67490j01268p7128j2875Q1301K086j09553p3195n6267q5532l8982
$$ 856953681 856786191 856684923 856607795 856594920 856676221 856678307 856568754 856495559 856439292 856353760 856314778
2443.4H56314778k3901r0242r4950q3983j29163r5069m6611r7931j00016p8142j40428
$$ 856314778 856290877 856200635 856105685 856021702 855892539 855797470 855750859 855652928 855552912 855474770 855334342
2465.8H55334342j15097l1054j04368j82450j35719j53363j93954j12593n9187r7573
$$ 855334342 855219245 855188191 855083823 854901373 854765654 854612291 854418337 854305744 854246557 854148984
2486.2H54148984j01388j18911j69039j07288m5955j23978j71721j38938j25051r9659
$$ 854148984 854047596 853928685 853759646 853652358 853606403 853482425 853310704 853171766 853046715 852947056
2506.6H52947056q0406j29581j46389j00195j19925j56939j20044j09315j35660j29342
$$ 852947056 852866650 852737069 852590680 852490485 852370560 852213621 852093577 851984262 851848602 851719260
2527H51719260j50084j77980j32739r8408j17182j30475j53005j66476j22189j03116
$$ 851719260 851569176 851391196 851258457 851160049 851042867 850912392 850759387 850592911 850470722 850367606
2547.4H50367606j60098j83463j41383j32501j69873j92821j80781j57535j54793j76370
$$ 850367606 850207508 850024045 849882662 849750161 849580288 849387467 849206686 849049151 848894358 848717988
2567.8H48717988k08140k13325k06411k32160k46525k51770k84135k94089k60771k46405
$$ 848717988 848509848 848296523 848090112 847857952 847611427 847359657 847075522 846781433 846520662 846274257
2588.2H46274257k50876k52903l06666l56793l21627k94029l37303l86715m10020l96789
$$ 846274257 846023381 845770478 845463812 845107019 844785392 844491363 844154060 843767345 843357325 842960536
2608.6H42960536l22282k92837l55602l85284l77119m30465m66942l80576l27229m00901
$$ 842960536 842638254 842345417 841989815 841604531 841227412 840796947 840330005 839949429 839622200 839221299
2629H39221299m25816l88205l95238l82841l46243l41535l31819l43740l98457l92318
$$ 839221299 838795483 838407278 838012040 837629199 837282956 836941421 836609602 836265862 835867405 835475087
2649.4H35475087l41773l38733l34561l21507l44277l66211l34561k87950l07858l47376
$$ 835475087 835133314 834794581 834460020 834138513 833794236 833428025 833093464 832805514 832497656 832150280
2669.8H32150280l65257l88443l55780k89023k99454l67701m31538m64439m25995l44395
$$ 832150280 831785023 831396580 831040800 830751777 830452323 830084622 829653084 829188645 828762650 828418255
2690.2H28418255l25143l87431m25398m18544m21166m07040m02332m36961m58062m90069
$$ 828418255 828093112 827705681 827280283 826861739 826440573 826033533 825631201 825194240 824736178 824246109
2710.6H24246109n29588m90367m19140m15564m41372m41432m71294n48899n59151m91798
$$ 824246109 823716521 823226154 822807014 822391450 821950078 821508646 821037352 820488453 819929302 819437504
2731H19437504m50850m22537m18305m77434m86135m23134m01198m08531m20868n07355
$$ 819437504 818986654 818564117 818145812 817668378 817182243 816759109 816357911 815949380 815528512 815021157
2751.4H15021157n90563n36322m95076n31674n11765n35727o18517n87106n22256n53310
$$ 815021157 814430594 813894272 813399196 812867522 812355757 811820030 811201513 810614407 810092151 809538841
2771.8H09538841n81562o17087p28548p46190o82056p16388p15733o32584p15375q65519
$$ 809538841 808957279 808340192 807611644 806865454 806183398 805467010 804751277 804118693 803403318 802537799
2792.2H02537799q49664q30651q88228r01878r36031j023293j005947r30191r89258
$$ 802537799 801688135 800857484 799969256 799067378 798131347 797108054 796102107 795171916 794182658
2810.5G94182658j112461j160860j200914j215160j190603j267672j364529j367449
$$ 794182658 793070197 791909337 790708423 789493263 788302660 787034988 785670459 784303010
2826.8G84303010j432002j576245j667917j842796k144158k500832l039718l647387
$$ 784303010 782871008 781294763 779626846 777784050 775639892 773139060 770099342 766451955
2843.1G66451955m077971m348457m401863l836751k630353j431822o24240k68817m60028
$$ 766451955 762373984 758025527 753623664 749786913 747156560 745724738 745100498 744831681 744371653
2861.5G44371653r68099j472235j922965k146184j968205j698613j549721j335025
$$ 744371653 743403554 741931319 740008354 737862170 735893965 734195352 732645631 731310606
2877.8G31310606j176476j270533j393259j501143j708686j848638j893401k013862
$$ 731310606 730134130 728863597 727470338 725969195 724260509 722411871 720518470 718504608
2894.1G18504608k150894k204358k258420k338708k416372k620876k964973l297150
$$ 718504608 716353714 714149356 711890936 709552228 707135856 704514980 701550007 698252857
2910.4F98252857l738463m309893m552185m291296l735423k840341j743555p78675
$$ 698252857 694514394 690204501 685652316 681361020 677625597 674785256 673041701 672263026
2926.8F72263026K7240O03497J004934J554012K198577K594292K767325K817511K492547
$$ 672263026 672290266 672893763 673898697 675452709 677651286 680245578 683012903 685830414 688322961
2945.1F88322961J813412J259506R14037M76420J76191K47240M22597O42062Q38875
$$ 688322961 690136373 691395879 692309916 692786336 692962527 693209767 693632364 694274426 695113301
2963.5F95113301Q52347Q60095R67443J033365J050413J083016J123608J132011J031518
$$ 695113301 695965648 696825743 697793186 698826551 699876964 700959980 702083588 703215599 704247117
2981.8G04247117Q18133O70553P26461P71582M96686M9770k25604m75168p47681p69138
$$ 704247117 705065250 705735803 706462264 707233846 707730532 707780302 707554698 707079530 706331849 705562711
3002.2G05562711p53641q41618p89761p06852q24332j019657j185477j321673j345754
$$ 705562711 704809070 703967452 703177691 702470839 701646507 700626850 699441373 698119700 696773946
3020.6F96773946j358926j475573j518428j434147j443863j496911j564026j781583
$$ 696773946 695415020 693939447 692421019 690986872 689543009 688046098 686482072 684700489
3036.9F84700489j831889j680315j784563k058923k128601k061844k075255k102911
$$ 684700489 682868600 681188285 679403722 677344799 675216198 673154354 671079099 668976188
3053.2F68976188k108217k172410k182543k116382k074540j967251j919747k117276
$$ 668976188 666867971 664695561 662513018 660396636 658322096 656354845 654435098 652317822
3069.5F52317822k221346k057016j889586j848877j965403k163947k249062k225578
$$ 652317822 650096476 648039460 646149874 644300997 642335594 640171647 637922585 635697007
3085.8F35697007k215743k239048k276302k330303k335310k219438k212883k471923
$$ 635697007 633481264 631242216 628965914 626635611 624300301 622080863 619867980 617396057
3102.2F17396057k588332k402663k353430k556264k598703k479375k530992k694964
$$ 617396057 614807725 612405062 610051632 607495368 604896665 602417290 599886298 597191334
3118.5E97191334k918303l153324l145099k970576k916336l002525l098964l116787
$$ 597191334 594273031 591119707 587974608 585004032 582087696 579085171 575986207 572869420
3134.8E72869420l026783l010631l251016l445208l378153l300667l218889l127277
$$ 572869420 569842637 566832006 563580990 560135782 556757629 553456962 550238073 547110796
3151.1E47110796l322303l660441l710687l581345l544331l569305l581583l568113
$$ 547110796 543788493 540128052 536417365 532836020 529291689 525722384 522140801 518572688
3167.4E18572688l534317l523052l570079l616214l619015l605694l589273l567338
$$ 518572688 515038371 511515319 507945240 504329026 500710011 497104317 493515044 489947706
3183.7D89947706l562837l579140l579676l572822l577590l571153l539443l489851
$$ 489947706 486384869 482805729 479226053 475653231 472075641 468504488 464965045 461475194
3200.1D61475194l411025l354878l356397l368348l343403l287136l202796l107906
$$ 461475194 458064169 454709291 451352894 447984546 444641143 441354007 438151211 435043305
3216.4D35043305l125131l182501l131657l055573l000826k908438k809346k775043
$$ 435043305 431918174 428735673 425604016 422548443 419547617 416639179 413829833 411054790
3232.7D11054790k809465k820581k750278k651810k560646k504497k493114k500146
$$ 411054790 408245325 405424744 402674466 400022656 397462010 394957513 392464399 389964253
3249C89964253k469212k375186k309888k361119k427161k386063k291828k237380k207905
$$ 389964253 387495041 385119855 382809967 380448848 378021687 375635624 373343796 371106416 368898511
3267.4C68898511k140790k137333k205134k229899k248347k234727k177358k180069
$$ 368898511 366757721 364620388 362415254 360185355 357937008 355702281 353524923 351344854
3283.7C51344854k196670k125859k040327k058685k150178k233415k281249k225697
$$ 351344854 349148184 347022325 344981998 342923313 340773135 338539720 336258471 334032774
3300C34032774k108753k043783k061636k207696k406925k455831k335608k220779k194554
$$ 334032774 331924021 329880238 327818602 325610906 323203981 320748150 318412542 316191763 313997209
3318.4C13997209k206296k188891k158224k209485k287894k278001k199471k066254
$$ 313997209 311790913 309602022 307443798 305234313 302946419 300668418 298468947 296402693
3334.7B96402693j957000j993566k094299k151370k178699k076327j894355j956493
$$ 296402693 294445693 292452127 290357828 288206458 286027759 283951432 282057077 280100584
3351B80100584k162635k142310j932204j805961j825393j790702j576811j434445j564652
$$ 280100584 277937949 275795639 273863435 272057474 270232081 268441379 266864568 265430123 263865471
3369.3B63865471j795411j801998j533895j321316j263440j249671j139670q82864
$$ 263865471 262070060 260268062 258734167 257412851 256149411 254899740 253760070 252877206
3385.7B52877206n78493l36677m08322p31408p19130k33174N6818k48164o01202l80784
$$ 252877206 252298713 251962036 251553714 250822306 250103176 249870002 249926820 249678656 249077454 248696670
3406.1B48696670M7728J85177J33753K1934K3380K72543M71353M72009N95361R03219
$$ 248696670 248744398 248929575 249063328 249085262 249108642 249381185 249852538 250324547 250919908 251823127
3426.5B51823127J157552J159221J181245J385450J304001R54032R41843J325160J668066
$$ 251823127 252980679 254139900 255321145 256706595 258010596 258964628 259906471 261231631 262899697
3444.8B62899697J788914J755655J791745J938433K112686K326459K479971K371370
$$ 262899697 264688611 266444266 268236011 270174444 272287130 274613589 277093560 279464930
3461.1B79464930K360881K759933K955437K574324K125919K183676K548039K920270
$$ 279464930 281825811 284585744 287541181 290115505 292241424 294425100 296973139 299893409
3477.4B99893409L060281K831668K750397K978772L016322K931178L089488L318458
$$ 299893409 302953690 305785358 308535755 311514527 314530849 317462027 320551515 323869973
3493.8C23869973L429354L348380L314108L449797L354878L106474L269434L697425
$$ 323869973 327299327 330647707 333961815 337411612 340766490 343872964 347142398 350839823
3510.1C50839823L929854L819078L584057L658951M010438M388988M321695L935367
$$ 350839823 354769677 358588755 362172812 365831763 369842201 374231189 378552884 382488251
3526.4C82488251L938704M212261M410475M678875M804403M580230M671454N096793
$$ 382488251 386426955 390639216 395049691 399728566 404532969 409113199 413784653 418881446
3542.7D18881446N233348M869490M640848M947305N237579N171388N206198N532980
$$ 418881446 424114794 428984284 433625132 438572437 443810016 448981404 454187602 459720582
3559D59720582N666494N458385N585402O425321O494671N784631N712867O151915O503641
$$ 459720582 465387076 470845461 476430863 482856184 489350855 495135486 500848353 507000268 513503909
3577.4E13503909O750703O871223O734968O792724P154226P001102O522715O758571
$$ 513503909 520254612 527125835 533860803 540653527 547807753 554808855 561331570 568090141
3593.7E68090141P234931P306635P260978P150948O866813O792724P251978P380963
$$ 568090141 575325072 582631707 589892685 597043633 603910446 610703170 617955148 625336111
3610F25336111P161378P090927O772160O930828P334471O521106N646825N711674O802142
$$ 625336111 632497489 639588416 646360576 653291404 660625875 667146981 672793806 678505480 685307622
3628.4F85307622P106066N847752N426466N379081N243659N184889M912257M584611
$$ 685307622 692413688 698261440 703687906 709066987 714310646 719495535 724407792 728992403
3644.7G28992403M740119N314648M873454L685177L463804L889025L679037L068506
$$ 728992403 733732522 739047170 743920624 747605801 751069605 754958630 758637667 761706173
3661G61706173K723992K676368K691150K707541K628445K267301K022207J796544J652956
$$ 761706173 764430165 767106533 769797683 772505224 775133669 777400970 779423177 781219721 782872677
3679.4G82872677J710415J855731K080619K346695K091944J415729J272619J345813
$$ 782872677 784583092 786438823 788519442 790866137 792958081 794373810 795646429 796992242
3695.7G96992242J318693J213611J097381J093089J135290J088858R90390Q37267P65026
$$ 796992242 798310935 799524546 800621927 801715016 802850306 803939164 804929554 805766821 806531847
3714H06531847P91847P72596P15553O69122N83530M50372N12719P25031R07362Q82864
$$ 806531847 807323694 808096290 808811843 809480965 810064495 810514867 811027586 811752617 812659979 813542843
3734.4H13542843O85871M80830K18809j7762Q1539N33879N69462K80023K52664M70698
$$ 813542843 814228714 814709544 814928353 814910591 814992130 815526009 816095471 816375494 816628158 817098856
3754.8H17098856M37438K25187J68085K58148L12566L20554K74956J87576K31028L31640
$$ 817098856 817536294 817761481 817929566 818187714 818500280 818820834 819095790 819283366 819514394 819846034
3775.2H19846034L87192K97248J13309R4533J43051J86383K18571J99258K38299L10123
$$ 819846034 820233226 820530474 820643783 820738316 820881367 821067750 821286321 821485579 821723878 822034001
3795.6H22034001K62916J21713j4365M4346J39773N9009K2888J67429K87593K76923
$$ 822034001 822296917 822418630 822404265 822448611 822588384 822647393 822670281 822837710 823125303 823402226
3816H23402226K86579Q9884k60651j26720J43111J57178P0571J35839L51191K85923
$$ 823402226 823688805 823778689 823518038 823391318 823534429 823691607 823762178 823898017 824249208 824535131
3836.4H24535131j39057k71440j14381K5392J60157K08497L6836m17888l75748J77622
$$ 824535131 824396074 824124634 824010253 824035645 824195802 824404299 824441135 824023247 823647499 823825121
3856.8H23825121K69771J77681P2598P153L5226j0669l4749L6716K5928N9188R9480
$$ 823825121 824094892 824272573 824345171 824352324 824387550 824376881 824342132 824378848 824404776 824463964 824563444
3879.2H24563444P6294J02698L815j54734q5651k5571p8142k3186P4685P3790k5689
$$ 824563444 824639738 824742436 824746251 824591517 824505866 824480295 824402153 824378967 824453652 824527442 824501753
3901.7H24501753j41561j66297j23799o4313N0962J63436J00374q4520p8499M1187
$$ 824501753 824360192 824193895 824070096 824005783 824056745 824220181 824320555 824236035 824157536 824198723
3922.1H24198723K1219k1577L2485O4373J8060o0439p5519N3823J60157O0857m709
$$ 824198723 824219942 824198365 824230850 824295223 824313283 824252844 824177325 824231148 824391305 824452162 824447453
3944.5H24447453P5936O0320m2259l9876L3021N2452L8982O2823Q2254K6763r895N2512
$$ 824447453 824523389 824583709 824541450 824501574 824534595 824587047 824626029 824688852 824771106 824797869 824787974 824840486
3969H24840486Q7023J6689k742O5804O3658R9241J90974J10149l7432o3598j9133L3736
$$ 824840486 824927509 824944198 824941456 825007260 825070918 825170159 825361133 825471282 825433850 825370252 825351119 825384855
3993.4H25384855J18435J44005
$$ 825384855 825503290 825647295
3997.5H25647295
$$ 825647295
##END=$$ End of the data block
