##TITLE=$$ Begin of the data block
##JCAMP-DX=5.00 $$ ACD/SpecManager v 10.08
##SPECTROMETER/DATA SYSTEM=Alpha
##DATE=10 Apr 2014 11:00:52
##DATA TYPE=INFRARED SPECTRUM
##DATA CLASS=XYDATA
##ORIGIN=
##OWNER=
##NPOINTS=1765
##FIRSTX=399.75695801
##LASTX=3997.56933594
##MAXX=3997.56933594
##MINX=399.75695801
##MAXY=0.85808927
##MINY=0.24906057
##XFACTOR=1.0000000000
##YFACTOR=1.000000000000000e-9
##FIRSTY=0.61334080
##DELTAX=2.03957629
##XUNITS=1/CM
##YUNITS=ARBITRARY UNITS
##XYDATA=(X++(Y..Y))
399.8F13340795l97086j000404j446963o71029p73966p49469P9453n88834j250983
418.1F06541514K97010n1915r54330l01898n84662o62029L51131m97043j547575k84731
438.5F02305472J04129l90410M65870K27570o57975K0563j66535j060307k97010j43111
458.9F00408256r05096j63973k89619j674294r53377n5849j231969j072585l76880
477.3E93684614j192451q59737j52827r99689o39259n2691j459956j463711l58463
495.6E86505830j301229j432299j98365j064896j690626n48899r41873j443803m06564
514E77477276r30786j983166j174986j414359k211689j229644j149714k101302j315833
532.3E63965797q97944j786947j197874n90027j342118q56101l70801j609921j628160
$$ plain form
399.8 613340795 612943709 611943305 610496342 609825313 609051347 608301878 608381331 607792497 606541514
418.1 606541514 606838524 606786609 605832279 605530381 604945719 604283690 604634821 604137778 602590203 602305472
438.5 602305472 602409601 602019191 602485061 602712631 602054656 602075219 601908684 600848377 600551367 600408256
458.9 600408256 599503160 599339187 599049568 597375274 596421897 596366048 595134079 594061494 593684614
477.3 593684614 592492163 591632426 591479599 590479910 589840651 589787960 588328004 586864293 586505830
495.6 586505830 585204601 583772302 583573937 582509041 580818415 580269516 579327643 577883840 577477276
514 577477276 576546490 574563324 573388338 571973979 569762290 568532646 567382932 565281630 563965797
532.3 563965797 563067853 561280906 560083032 559493005 558150887 557294786 556923985 555314064 553685904
550.7E53685904q58844j600921j724422j063168j758039k035677j415432k252400k980411
569E37996590k278387k363563k625287j768350j704216k294898j800955j787841k515793
587.4E18857300k123356j966238k722859k248526j618802k569974l136575k765983
603.7D99704987k628178j721561l49879n10245o73354P75605K226949L324747M506648
622.1E04655719M583835L978670M224181M110873L392279L663302L753841K620935
638.4E34983635K053142J651227Q83162K174377L975511K636015K44678k57969J295089
656.7E49638867M896284P607638O305457L513097L328264N065084M294872M024684
673.1E88674247L990948L040314L335774L589213K477229K491891K967060J993000
$$ plain form
550.7 553685904 552827060 551226139 549501717 548438549 546680510 544644833 543229401 540977001 537996590
569 537996590 535718203 533354640 530729353 528961003 527256787 524961889 523160934 521373093 518857300
587.4 518857300 516733944 514767706 512044847 509796321 508177519 505607545 502470970 499704987
603.7 499704987 497076809 495355248 495005369 494495124 493821770 494597375 496824324 500149071 504655719
622.1 504655719 509239554 513218224 517442405 521553278 524945557 528608859 532362700 534983635
638.4 534983635 537036777 538688004 539571166 541745543 545721054 548357069 548601747 548343778 549638867
656.7 549638867 554535151 562142789 568448246 571961343 575289607 580354691 584649563 588674247
673.1 588674247 592665195 595705509 599041283 602630496 605107725 607599616 610566676 612559676
689.4F12559676J791179K283335J317203R01878J776636J499056J314104K345085K247334
707.7F28035486J893401K940655K954423K046704K698779L093184K338588K769351
724F48770571L136396K158344K268255K760827J826704J774668K484441J697719J386643
742.4F68264568K295434J780212J252711K214611K045989J287996K024234K142548
758.7F83308303J362563J968264K289236J431405J630783J825333O88910M42088O40631
777.1F95587516n01156q93593k81334p94291p85291P67707J344204J687885L505408
795.4F99637055M472435M466593N482018N664349M452050M340350M139304K607942
811.7G35262096K118826K088368N86808l64483n35428k036989l214181l045439l709734
$$ plain form
689.4 612559676 614350855 616634190 617951393 618853271 620629907 622128963 623443067 625788152 628035486
707.7 628035486 629928887 632869542 635823965 637870669 640569448 643662632 646001220 648770571
724 648770571 651906967 654065311 656333566 659094393 660921097 662695765 665180206 666877925 668264568
742.4 668264568 670560002 672340214 673592925 675807536 677853525 679141521 681165755 683308303
758.7 683308303 684670866 686639130 688928366 690359771 691990554 693815887 694504797 694946885 695587516
777.1 695587516 695086360 694192767 693911433 693117142 692331851 693099558 694443762 696131647 699637055
795.4 699637055 704109490 708576083 714058101 719722450 724174500 728514850 732654154 735262096
811.7 735262096 737380922 739469290 740056098 739691615 739156187 737119198 733905017 730859578 727149844
830.1G27149844m411638l712892l625035m036367l242016k883911l234625k175570
846.4F99827790q06212j17004J792133M191875N214453O356776P756471P592678P279516
864.8G39088476P569313O467104N067050M824281L718614K114773J873017J104235
881.1G71826863n05268p47145j004338k175390k034009j300633j415372o26325O99698
899.4G62718081O20723O93619J405776O92725k73943l20077j418054k887368l008902
917.8G58222580l486514m259765l356636k216399j795947n59330M67121J36972K79129
936.2G43431211P03036K0922k01166K00093n99742j438678j526475k628684m070222
954.5G33890295m632413n818844p473409q345724r774267j1867583j2830973j3301968
$$ plain form
830.1 727149844 722738206 719025314 715400279 711363912 708121896 705237985 702003360 699827790
846.4 699827790 699021578 698904574 700696707 704888582 710103035 716459811 724216282 731808960 739088476
864.8 739088476 746657789 753124893 758191943 763016224 766734838 768849611 770722628 771826863
881.1 771826863 771321595 770574450 769570112 767394722 765360713 764060080 762644708 762018383 762718081
899.4 762718081 763338804 764032423 765438199 766130924 765856981 765536904 764118850 761231482 758222580
917.8 758222580 754736066 750476301 747119665 744903266 743107319 742547989 743015110 743152082 743431211
936.2 743431211 744134247 744155169 743954003 744154096 743554354 742115676 740589201 737960517 733890295
954.5 733890295 729257882 723439038 715965629 707619905 697845638 685978055 673147082 659845114
970.8F59845114j3889373j3146042j1634112j0739267r520948q014798p510662p112265
987.1E78277647o129086n619227n202294m139960l455758l206074k564430k410114
1003.5E45550704l142714l740430m454732n593598o050229n938888o079256n830348
1019.8E04720509n152643m926711m717648m163682m011602l988802l455311l058195
1036.1D71245915k923668k422899k074301k173960k066970j956225k076715j672178
1052.4D53878999p58589j6421Q06034J589537J497656P32094k82198j861334l444910
1070.8D52140868m164458m467547m550904m140675l854394m091888m434496m952163
1087.1D17484343n630344n581468m555822l098011j331150L66002J224816J444399
$$ plain form
970.8 659845114 645955741 632809699 621175587 610436320 600915372 592900574 585389912 578277647
987.1 578277647 572148561 566529334 561327040 557187080 553731322 550525248 547960818 545550704
1003.5 545550704 542407990 538667560 534212828 528619230 522569001 516630113 510550857 504720509
1019.8 504720509 499567866 494641155 489923507 485759825 481748223 477759421 474304110 471245915
1036.1 471245915 468322247 465899348 463825047 461651087 459584117 457627892 455551177 453878999
1052.4 453878999 453120410 453103989 453910023 455499560 456997216 457729310 457447112 455585778 452140868
1070.8 452140868 447976410 443508863 438957959 434817284 430962890 426871002 422436506 417484343
1087.1 417484343 411853999 406272531 401716709 398618698 397287548 397653550 398878366 400322765
1103.4D00322765J434356R99063L06845l31163j320660k821357m534989o481260p500321
1121.8C80073279n584121j826524N52952R29803K03520p92861m79013J311660K821386
1140.1C77210081L293931L203958K650053J980543J762628J722813J684547K087414
1156.4C95595968K840221L677934M945338O487965P729829Q734047R420187R395509
1172.7D48826998R069205Q785814Q140534P303745O612926N482555L845811K373010
1189.1E00440598R14871m50492q92877m64589M41462J977384L572822M346430M561365
1207.4E14446974M426420L650724K819956K483487K178192J934111K105177K227187
1223.7E36272228K274692K732754L180980L351748L751278M118323M081369M161894
$$ plain form
1103.4 400322765 401757121 402756184 403063029 402731866 401411206 398589849 394054860 387573600 380073279
1121.8 380073279 374489158 372662634 373215586 374145389 374348909 373556048 373077035 374388695 377210081
1140.1 377210081 380504012 383707970 386358023 388338566 390101194 391824007 393508554 395595968
1156.4 395595968 398436189 402114123 407059461 413547426 421277255 430011302 439431489 448826998
1172.7 448826998 457896203 466682017 474822551 482126296 488739222 494221777 498067588 500440598
1189.1 500440598 501355469 500904977 500012100 499547511 499988973 501966357 505539179 509885609 514446974
1207.4 514446974 518873394 522524118 525344074 527827561 530005753 531939864 534045041 536272228
1223.7 536272228 538546920 541279674 544460654 547812402 551563680 555682003 559763372 563925266
1240.1E63925266M240215L787816L306329L000975K339422J711428J525939J272142
1256.4E85109532J104236J477062J863241K138555K794326L373384L605843M060626
1272.7F05526805M470944M453779M647314N080700N163610N315244N737663N740523
1289F46136582N586862N694867N398750M860163M728913M389882L696323L386020L049255
1307.4F86927617K323508J936734J690387J129330J000881J233935J101315J168430
1323.7F98512137J583636J503169J193703J126527P16985J89900J54853P987k08378
1342G04780519K25961N83410M23790M72247N16713L7610k40266j69396n57900j168728
1362.4G04903960j384496j585663j738071j380503j364768k035975k398611l370165
$$ plain form
1240.1 563925266 568165481 571953297 575259626 578260601 580600023 582311451 583837390 585109532
1256.4 585109532 586213768 587690830 589554071 591692626 594486952 597860336 601466179 605526805
1272.7 605526805 609997749 614451528 619098842 624179542 629343152 634658396 640396059 646136582
1289 646136582 651723444 657418311 662817061 667677224 672406137 676796019 680492342 683878362 686927617
1307.4 686927617 689251125 691187859 692878246 694007576 695008457 696242392 697343707 698512137
1323.7 698512137 700095773 701598942 702792645 703919172 704636157 704826057 704980910 704988897 704780519
1342 704780519 705006480 705589890 706013680 706485927 707002640 707040250 706799984 706630588 706072688 704903960
1362.4 704903960 703519464 701933801 700195730 698815227 697450459 695414484 693015873 689645708
1378.7F89645708n723596o461024l093899J598120L105641J718699K09392q99971j593709
1397.1F78505361k489746k962350k805353l175735l264904k582073k216697k044559
1413.4F56963944j383304j008690j384258j044869m87745o33657o11842m76241o53863
1431.8F49279475m71890p093j7464q404N14269Q35657J166820K031565K744198L049433
1452.2F59116566L909588O404221Q442044O785393O219924P248818P587374O985426
1468.5G12699354P420897R163499Q766711O245911M713714M126966L301323K060592
1484.8G58498967J460313O30379r41515j264632j282691k479375l278077k885043k557576
1503.2G45900750l232896n906940o144523m637242l919959l614843l499627k677917
$$ plain form
1378.7 689645708 683922112 677461088 674367189 675965309 679070950 680789649 680999041 680099070 678505361
1397.1 678505361 676015615 673053265 670247912 667072177 663807273 661225200 659008503 656963944
1413.4 656963944 655580640 654571950 653187692 652142823 651655078 651021421 650409579 649933338 649279475
1431.8 649279475 648807585 648800492 648783028 648774624 649288893 650124550 651291370 653322935 656067133 659116566
1452.2 659116566 663026154 669430375 677872419 684657812 690877736 698126554 705713928 712699354
1468.5 712699354 720120251 729283750 738050461 744296372 749010086 753137052 756438375 758498967
1484.8 758498967 759959280 760589659 759648144 758383512 757100821 754621446 751343369 748458326 745900750
1503.2 745900750 742667854 736760914 730616391 725979149 722059190 718444347 714944720 712266803
1519.5G12266803k566576k838731k270877k193630k030015j539528j466454j255452
1535.8F96105540n25177k92420j065850r03845j86563J72079L89516Q93474J240313
1554.1F95827067J224577J115382j11639p89166o76572q90434j983225l333807l233374
1572.5F87148809l799140o312490o700038o288469p210851p731318q169175q722424
1588.8F32214904q877635r026468r462774r326398r021700r274363r318769q949161
1605.1E58957636r023547r352028q918703q099615q604169r929419p906794o388218
1621.4D90735143p042735o608189n636900m710108l091455k015799j673043o01709
1637.8D59355205N96315J577258K576500L981561M845917M027605N221695Q240670
$$ plain form
1519.5 712266803 709700227 706861496 704590619 702396989 700366974 698827446 697360992 696105540
1535.8 696105540 695580363 695287943 694222093 693318248 693131685 693303764 693693280 694586754 695827067
1554.1 695827067 697051644 698167026 698055387 697266221 696589649 695699215 693715990 690382183 687148809
1572.5 687148809 683349669 677037179 670337141 664048672 656837821 649106503 640937328 632214904
1588.8 632214904 623337269 614310801 604848027 595521629 586499929 577225566 567906797 558957636
1605.1 558957636 549934089 540582061 531663358 523563743 514959574 505030155 497123361 490735143
1621.4 490735143 483692408 477084219 471447319 466737211 463645756 461629957 459956914 459355205
1637.8 459355205 459951520 461528778 464105278 468086839 472932756 476960361 482182056 490422726
1654.1D90422726O435573N443930O398797P967473Q440911P302463Q248270J0017037
1670.4E50677180Q749843Q902013J0035932Q878529Q180797R702981J2626827J0465383
1686.7F28219485Q615315R107590Q261442R216428J0714471J0457158J1710167R655834
1703G05957890Q009791Q136272P034719N954802N486727N648732N685032M458666L664076
1721.4G60036707L490984L218532L174245L348649L059864L322124L248692K410829
1737.7G85310626K775431L304243L089189L120602L593087L492653K944589K771675
1754H10402095K678097K315282K213002K198517J683235J692772J977742J752794J555442
1772.4H28468978J346291Q93235J029610J426936J180708R32932J157343J140476R52959
$$ plain form
1654.1 490422726 496858299 502302229 508701026 516668499 525109410 532411873 540660143 550677180
1670.4 550677180 559427023 568329036 578364968 587243497 595424294 605127275 617754102 628219485
1686.7 628219485 636834800 645942390 654203832 663420260 674134731 684591889 696302056 705957890
1703 705957890 713967681 722103953 729138672 735093474 740580201 746228933 751913965 756372631 760036707
1721.4 760036707 763527691 766746223 769920468 773269117 776328981 779651105 782899797 785310626
1737.7 785310626 788086057 791390300 794479489 797600091 801193178 804685831 807630420 810402095
1754 810402095 813080192 815395474 817608476 819806993 821490228 823183000 825160742 826913536 828468978
1772.4 828468978 829815269 830708504 831738114 833165050 834345758 835278690 836436033 837576509 838529468
1790.7H38529468J080274R08137O71744Q98361R18150M89712N72979Q64744O50108
1809.1H45583677N16951O18816M32670L37183N97597N36620L99232O60956O23822K13444
1829.5H50520968K29598L87966K44856L55899N47052L70979K73883L67225J55508R2089
1849.9H53546023L62814K78592Q9884L02374L20733J00136L22937M99309J39296j0431
1870.3H55951667J37210M8935J07825K94566J01328J8358K62380K21908P3612J82628
1890.7H57400417J03474q9943P2896J47879l5822P8380K02536k5212k4379J40071k0802
1913.1H57949495l1054J68920J907j34825O5088n901j82390Q762N7280j81496q1659
1935.5H57634127J01149l9875m5359j9312l04878l02255P033n8591k02060n8293j48893
$$ plain form
1790.7 838529468 839609742 840517879 841189623 842087984 843006134 843495846 844068825 844933569 845583677
1809.1 845583677 846100628 846719444 847152114 847489297 848086894 848623514 849022746 849683702 850307524 850520968
1829.5 850520968 850750566 851138532 851383388 851739287 852286339 852657318 852931201 853298426 853453934 853546023
1849.9 853546023 853908837 854187429 854277313 854579687 854900420 855000556 855323493 855822802 855962098 855951667
1870.3 855951667 856088877 856137812 856245637 856540203 856641531 856659889 856922269 857144177 857217789 857400417
1890.7 857400417 857503891 857413948 857486844 857634723 857598901 857677281 857879817 857854605 857830226 857970297 857949495
1913.1 857949495 857918441 858087361 858089268 857954443 858019531 858013630 857831240 857840002 857897282 857715786 857634127
1935.5 857634127 857735276 857695401 857650042 857630730 857325852 857023597 857030630 856972039 856769979 856711686 856562793
1958H56562793k97010o8843j073j97232j07407p5460l19004k01464J8180j59204j95861
1980.4H54958415k6047j71244k45333j0789o4611k57313j12474j30832l41654j70469
2000.8H53427649l7671k22444j94013j10626k74599j93715J0729j88411l01301j23262
2021.2H51792336k08974l18289r3758o6579k27153j07884q9586l03269j83045J4066
2041.6H50207865j45316j66297n7041j87040j84893j0908j19448j96934k503m2200
2062H49095285j70946j788J4245j75655o3061J5378j67787r0421Q3328m6313p0453
2084.4H48421812P0989o0201j49846J7226M471p0155P0095N2512r1970K1159O6400
2106.9H48352492r8586l0339Q0466n9962l3081J20819N3406M3869J72615P7307l2723
$$ plain form
1958 856562793 856265783 856196940 856195867 855998635 855891228 855815768 855496764 855295300 855313480 855154276 854958415
1980.4 854958415 854932368 854761124 854515791 854505002 854440391 854183078 854070604 853939772 853598118 853427649
2000.8 853427649 853389978 853167534 852973521 852862895 852588296 852394581 852405310 852216899 851915598 851792336
2021.2 851792336 851583362 851265073 851171315 851104736 850877583 850769699 850680113 850376844 850193799 850207865
2041.6 850207865 850062549 849896252 849839211 849652171 849467278 849456370 849336922 849139988 849137485 849095285
2062 849095285 848924339 848922551 848936796 848761141 848698080 848713458 848545671 848455250 848538578 848492265 848421812
2084.4 848421812 848492801 848432600 848282754 848299980 848304451 848234296 848304391 848356903 848264933 848286092 848352492
2106.9 848352492 848253906 848223567 848304033 848244071 848210990 848331809 848385215 848429084 848601699 848679006 848646283
2129.3H48646283R1136O5028k9206J18494J49906j8537O5088J91092M6015N2750K06232
2151.7H49584281J08839J6033J19806R4890M1366J30653P9930J1384J70351K09271
2172.1H50566804O8725J12652J47403J9967P5340K04623J01626K5094R7572L7611l2663
2194.6H51424754O1571N1081n185J16289J17123l6776P450Q2731k920M172M5121m1425
2219H51823986N066J22130J7762n0604M2915K325p5579J3351M3273k7001J7107L6478
2243.5H51971209o8366o2705k38p4506q1062K1219k5153j00434m8101l8087l0279Q2910
2268H51546407Q4460k5750L7074J09375K4319O6101J66178Q3506m947p987p5340r5547
2292.5H51907849M888j7285q5891J7166M8638j11282j71423j52707j86145j06454n484
$$ plain form
2129.3 848646283 848737419 848802447 848773241 848891735 849041641 849023104 849088192 849279284 849325299 849378049 849584281
2151.7 849584281 849693120 849709153 849828959 849923849 849965215 850095868 850175798 850187182 850357533 850566804
2172.1 850566804 850635529 850748181 850895584 850915551 850990891 851195514 851297140 851322234 851419806 851457417 851424754
2194.6 851424754 851486325 851537406 851532221 851648510 851765633 851728857 851736307 851819038 851816118 851820290 851865411 851823986
2219 851823986 851829052 851951182 851968944 851918340 851961255 851963580 851888001 851901352 851944625 851917624 851934731 851971209
2243.5 851971209 851902843 851840138 851839900 851765394 851684332 851705551 851680398 851579964 851531863 851493776 851463497 851546407
2268 851546407 851630867 851605117 851642191 851751566 851775885 851841986 852008164 852091670 852086723 852078736 852003396 851907849
2292.5 851907849 851912737 851895452 851809561 851826727 851875365 851764083 851592660 851439953 851253808 851147354 851141870
2314.9H51141870j30117l06487l18944k50817j19805n3227j97709k14457k563l100
2335.3H49544644j25825q5950j6749K00689P10845Q00252J95205m72307p23958n30005
2355.7H49496841k67028k34247j76608L05891P94887P56562O44982Q11398Q33750P02202
2376.1H53668630P40230P58410N87225M55320L69131J96517J08361J26660N6326K2411
2396.5H57089221Q3805M9114m053N7399N8353l4809k0385J5199m6551m6611j4365j02341
2421H57083976j42157q1658p6235l4570L9279k6345r2685l5405m3095r2446m9413l4868
2445.4H56414378q4699q2731q3804j44601j17421o6042j13904j09554o9499j20699
2465.8H55421424j20461n7221j05977j54018j28269j53661j51336q4281j01745j41084
$$ plain form
2314.9 851141870 851011753 850705266 850386322 850135505 850015700 849962473 849764764 849550307 849547744 849544644
2335.3 849544644 849418819 849332869 849316120 849516809 850227654 851027906 851223111 850750804 850026846 849496841
2355.7 849496841 849229813 848995566 848818958 849124849 849919736 850676298 851321280 852132678 852966428 853668630
2376.1 853668630 854408860 855167270 855754495 856209815 856578946 856775463 856883824 857010484 857066810 857089221
2396.5 857089221 857173026 857222140 857218087 857275486 857333839 857299030 857278645 857293844 857247293 857200682 857186317 857083976
2421 857083976 856941819 856860161 856783926 856749356 856788635 856762290 856669605 856634200 856591105 856498659 856449246 856414378
2445.4 856414378 856329679 856246948 856163144 856018543 855901122 855835080 855721176 855611622 855542123 855421424
2465.8 855421424 855300963 855243742 855137765 854983747 854855478 854701817 854550481 854466200 854364455 854223371
2486.2H54223371j04428j10686j40488q9884o2942j31309j86741j68443j42276j27316
2506.6H52958858r5546j00911j18792j00553j32561j66356j28269j12474j25230j09494
2527H51768672j10864j51694j46866j14441j23977j35482j48773j68204j31905p7725
2547.4H50458741j07229j64985j61886j70887k06172j89305j66654j76430j57595j46627
2567.8H48810971j99557k14517j98185k43306k53141k26975k63035k98500k81036k60532
2588.2H46372187k37226k32041l07143l72410l39806l21090l70264l82364l62098l81291
2608.6H43066454l91126l62932l48509l37302l33548l99888m35769l62694l30568l95000
2629H39369118m25756m19557m22239l73483l24786l31282l31700l41177l89695m10795
$$ plain form
2486.2 854223371 854118943 854008257 853867769 853777885 853714943 853583634 853396893 853228450 853086174 852958858
2506.6 852958858 852863312 852762401 852643609 852543056 852410495 852244139 852115870 852003396 851878166 851768672
2527 851768672 851657808 851506114 851359248 851244807 851120830 850985348 850836575 850668371 850536466 850458741
2547.4 850458741 850351512 850186527 850024641 849853754 849647582 849458277 849291623 849115193 848957598 848810971
2567.8 848810971 848611414 848396897 848198712 847955406 847702265 847475290 847212255 846913755 846632719 846372187
2588.2 846372187 846134961 845902920 845595777 845223367 844883561 844562471 844192207 843809843 843447745 843066454
2608.6 843066454 842675328 842312396 841963887 841626585 841293037 840893149 840457380 840094686 839764118 839369118
2629 839369118 838943362 838523805 838101566 837728083 837403297 837072015 836740315 836399138 836009443 835598648
2649.4H35598648l99352l76045l17812k84553l34680l76880l18170k65717l11911l63112
2669.8H32250416l63767l63052l42905k92540l11553l95716m37796m37855m02153l36587
2690.2H28566492l46423l96192l94523m23193m72545m30346l67939l92437m42863m94122
2710.6H24405909n46456n13136m20273m10676m61995m70400m79519n34594n48184m97818
2731H19522858m57764m01676l87191m76659m97162m17411l93153m15206m52578n48899
2751.4H15075159n78821m85181m80652n48363n16772n30064o15359n90443n29945n39840
2771.8H09659719n51700n97716p11619p42317p01606p18415o91950o28829p30634q58426
2792.2H02726507q27133q42393r34660r29654r34362j009286r84907r34601j022696
$$ plain form
2649.4 835598648 835199296 834823251 834505439 834220886 833886206 833509326 833191156 832925439 832613528 832250416
2669.8 832250416 831886649 831523597 831180692 830888152 830576599 830180883 829743087 829305232 828903079 828566492
2690.2 828566492 828220069 827823877 827429354 827006161 826533616 826103270 825735331 825342894 824900031 824405909
2710.6 824405909 823859453 823346317 822926044 822515368 822053373 821582973 821103454 820568860 820020676 819522858
2731 819522858 819065094 818663418 818276227 817799568 817302406 816884995 816491842 816076636 815624058 815075159
2751.4 815075159 814496338 814011157 813530505 812982142 812465370 811935306 811319947 810729504 810199559 809659719
2771.8 809659719 809108019 808510303 807798684 807056367 806354761 805636346 804944396 804315567 803584933 802726507
2792.2 802726507 801899374 801056981 800122321 799192667 798258305 797249019 796264112 795329511 794306815
2810.5G94306815j123727j160919j205981j203835j181603j254618j323223j357615
2826.8G84495294j470029j598776j686155j848102k111971k472640l036320l666937
2843.1G66604364m108369m381299m404963l780365k593934j462340o42896k56658m66108
2861.5G44507432r92358j482248j915932k135873j949787j685500j538038j314402
2877.8G31493294j167774j275599j405716j522183j737535j871348j896441k001345
2894.1G18615353k118766k172530k271175k370179k424359k633810k987564l292501
2910.4F98344469l724217m310012m542589m256189l697813k826571j742304p93755
2926.8F72451019m232O13034J040638J544177K149224K559126K772450K861142K552152
$$ plain form
2810.5 794306815 793183088 792022169 790816188 789612353 788430750 787176132 785852909 784495294
2826.8 784495294 783025265 781426489 779740334 777892232 775780261 773307621 770271301 766604364
2843.1 766604364 762495995 758114696 753709733 749929368 747335434 745873094 745230198 744973540 744507432
2861.5 744507432 743515074 742032826 740116894 737981021 736031234 734345734 732807696 731493294
2877.8 731493294 730325520 729049921 727644205 726122022 724384487 722513139 720616698 718615353
2894.1 718615353 716496587 714324057 712052882 709682703 707258344 704624534 701636970 698344469
2910.4 698344469 694620252 690310240 685767651 681511462 677813649 674987078 673244774 672451019
2926.8 672451019 672446787 673059821 674100459 675644636 677793860 680352986 683125436 685986578 688538730
2945.1F88538730J850665J238525Q60512M58658J83224K61486M57883O79910Q64565
2963.5F95394158Q43108Q38101R63747J018823J038611J091003J119256J113176J016975
2981.8G04436958Q31842P21634P61389P55132M61816N5969j73628m56035p78437q14378
3002.2G05802262q17895q83758p36952n91576p51376j031757j245498j369477j346051
3020.6F97027922j305521j416206j512289j458705j444816j490355j609325j838088
3036.9F84952617j811266j635254j799047k069056k094924k056182k084255k081990
3053.2F69320643k105236k211154k210795k083600k013743j947820j933873k123058
3069.5F52691364k221584k058744j895488j859784j955032k135873k242148k249122
$$ plain form
2945.1 688538730 690389395 691627920 692488432 692947090 693130314 693391800 693849683 694529593 695394158
2963.5 695394158 696237266 697075367 698039114 699057937 700096548 701187551 702306807 703419983 704436958
2981.8 704436958 705268800 705990434 706751823 707506955 707968771 708024740 707851112 707395077 706616640 705802262
3002.2 705802262 704984367 704100609 703363657 702772081 702020705 700988948 699743450 698373973 697027922
3020.6 697027922 695722401 694306195 692793906 691335201 689890385 688400030 686790705 684952617
3036.9 684952617 683141351 681506097 679707050 677637994 675543070 673486888 671402633 669320643
3053.2 669320643 667215407 665004253 662793458 660709858 658696115 656748295 654814422 652691364
3069.5 652691364 650469780 648411036 646515548 644655764 642700732 640564859 638322711 636073589
3085.8F36073589k242446k238571k262831k314687k327859k261460k264977k458751
3102.2F17702007k540409k387822k387226k608537k616048k430379k448738k643705
3118.5E97639143k936184l211379l184974k983689k891303k940416l068328l133535
3134.8E73289335l014565k947151l249348l548085l448665l284753l220141l173828
3151.1E47402799l330231l612101l656149l552615l548563l578782l576159l572405
3167.4E18975794l576100l577470l590644l590822l556907l556967l614724l620147
3183.7D90292013l578872l576338l587723l599107l590465l546476l510833l472358
3200.1D61829841l392279l366947l405482l389597l299325l224016l219604l186196
$$ plain form
3085.8 636073589 633831143 631592572 629329741 627015054 624687195 622425735 620160758 617702007
3102.2 617702007 615161598 612773776 610386550 607778013 605161965 602731586 600282848 597639143
3118.5 597639143 594702959 591491580 588306606 585322917 582431614 579491198 576422870 573289335
3134.8 573289335 570274770 567327619 564078271 560530186 557081521 553796768 550576627 547402799
3151.1 547402799 544072568 540460467 536804318 533251703 529703140 526124358 522548199 518975794
3167.4 518975794 515399694 511822224 508231580 504640758 501083851 497526884 493912160 490292013
3183.7 490292013 486713141 483136803 479549080 475949973 472359508 468813032 465302199 461829841
3200.1 461829841 458437562 455070615 451665133 448275536 444976211 441752195 438532591 435346395
3216.4D35346395l145874l147959l093005l017306k987713k946555k864123k793848
3232.7D11350012k804846k816975k743006k649158k573758k521515k476454k470106
3249C90294194k485662k424390k343386k360374k402872k351790k295643k283872k204597
3267.4C69141608k107024k148986k232283k227724k228289k235175k184242k166926
3283.7C51610959k204150k158553k033829k018303k137244k228200k255977k215504
3300C34359199k109796k042592k078443k208561k371103k428144k314538k210557k226263
3318.4C14369202k240926k190769k156407k236366k299398k209187k133459k080440
3334.7B96822250j964718j986265k135337k184659k155632k035618j870423j952529
$$ plain form
3216.4 435346395 432200521 429052562 425959557 422942251 419954538 417007983 414143860 411350012
3232.7 411350012 408545166 405728191 402985185 400336027 397762269 395240754 392764300 390294194
3249 390294194 387808532 385384142 383040756 380680382 378277510 375925720 373630077 371346205 369141608
3267.4 369141608 367034584 364885598 362653315 360425591 358197302 355962127 353777885 351610959
3283.7 351610959 349406809 347248256 345214427 343196124 341058880 338830680 336574703 334359199
3300 334359199 332249403 330206811 328128368 325919807 323548704 321120560 318806022 316595465 314369202
3318.4 314369202 312128276 309937507 307781100 305544734 303245336 301036149 298902690 296822250
3334.7 296822250 294857532 292871267 290735930 288551271 286395639 284360021 282489598 280537069
3351B80537069k184332k202302j980543j780868j777291j774072j575232j426071j551568
3369.3B64284790j799465j815617j533031j298756j229465j228690j160800r57698
3385.7B53261268o58125l55094l72291o98566p17402k43515O6758k27005n97447l98010
3406.1B49060571N961J53482J71721P9214P704K15456M42266N11170O85632R60589
3426.5B52293766J147300J147002J208752J380086J249522R05752R12666J313180J677245
3444.8B63235271J824975J787871J804233J953929K107412K283663K458989K381981
3461.1B79838324K331316K720684L008366K661943K121776K135784K557188K949417
3477.4C00324798L027498K752066K709687L032416L106803K974212L095656L305197
$$ plain form
3351 280537069 278352737 276150435 274169892 272389024 270611733 268837661 267262429 265836358 264284790
3369.3 264284790 262485325 260669708 259136677 257837921 256608456 255379766 254218966 253261268
3385.7 253261268 252603143 252248049 251875758 251177192 250459790 250216275 250283033 250056028 249458581 249060571
3406.1 249060571 249066532 249220014 249391735 249470949 249478653 249694109 250136375 250647545 251333177 252293766
3426.5 252293766 253441066 254588068 255796820 257176906 258426428 259332180 260244846 261558026 263235271
3444.8 263235271 265060246 266848117 268652350 270606279 272713691 274997354 277456343 279838324
3461.1 279838324 282169640 284890324 287898690 290560633 292682409 294818193 297375381 300324798
3477.4 300324798 303352296 306104362 308814049 311846465 314953268 317927480 321023136 324328333
3493.8C24328333L431708L370523L289044L392100L294856L048658L236532L698945
3510.1C51090699L983200L921181L681898L698140L974945M291892M223138L919899
3526.4C82784992L987492M263281M480452M750460M805893M530132M626244N059689
3542.7D19288635N229146M895269M627765M903465N230278N231053N261570N497515
3559D60164696N601943N429118N550951O426096O598055N912096N767345O119788O441176
3577.4E14011264O700218O848931O731272O779134P155597P046282O575168O806910
3593.7E68654776P288932P362962P292092P125616O799460O725668P232726P403135
3610F25885367P155121P075667O799460O954252P301152O462395N580545N661726O836116
$$ plain form
3493.8 324328333 327760041 331130564 334419608 337811708 341106564 344155222 347391754 351090699
3510.1 351090699 355073899 358995080 362676978 366375118 370350063 374641955 378865093 382784992
3526.4 382784992 386772484 391035765 395516217 400266677 405072570 409602702 414228946 419288635
3542.7 419288635 424517781 429413050 434040815 438944280 444174558 449405611 454667181 460164696
3559 460164696 465766639 471195757 476746708 483172804 489770859 495682955 501450300 507570088 514011264
3577.4 514011264 520711482 527560413 534291685 541070819 548226416 555272698 561847866 568654776
3593.7 568654776 575943708 583306670 590598762 597724378 604523838 611249506 618482232 625885367
3610 625885367 633040488 640116155 646915615 653869867 661171019 667633414 673213959 678875685 685711801
3628.4F85711801P164121N856931N459249N419135N260348N207897M929721M558921
3644.7G29568124M644751N198062M843712L701985L427386L833055L732860L145814
3661G62095749K699733K638638K697945K650261K508163K192438K005458J891494J758396
3679.4G83138275J746595J886606K109230K310097J992703J346349J304627J453995
3695.7G97288477J361609J124859J019954J127482J194239J114785J004815Q13246
3712H06049466P08997P86722P91490O93321O29902N32449L80635N13971P90238R09090
3732.4H12786281Q24690O66738M68254K47299P1168J29342N19991N68331K93493K20716
3752.8H16796303L98934M14252K72691K58446L57568L82066L13759J78039J13785K25306
$$ plain form
3628.4 685711801 692875922 698732853 704192102 709611237 714871585 720079482 725009203 729568124
3644.7 729568124 734212875 739410937 744254649 747956634 751384020 755217075 758949935 762095749
3661 762095749 764795482 767434120 770132065 772782326 775290489 777482927 779488385 781379879 783138275
3679.4 783138275 784884870 786771476 788880706 791190803 793183506 794529855 795834482 797288477
3695.7 797288477 798650086 799774945 800794899 801922381 803116620 804231405 805236220 806049466
3712 806049466 806758463 807545185 808336675 809029996 809659898 810192347 810572982 811086953 811877191 812786281
3732.4 812786281 813610971 814277709 814745963 814993262 815064430 815193772 815713763 816282094 816575587 816796303
3752.8 816796303 817195237 817609489 817882180 818140626 818498194 818880260 819194019 819372058 819485843 819711149
3773.2H19711149L51488M45307L55899J40667Q6188Q4818J37269K30432K03132J95265
3793.6H21941614L08335L17454J40846l6597p15M7862N6982J64926K30849K10464J87099
3816H23569119K23160L2604j82152P510J29700P4565K0027R7394L73364L37779j25348
3838.4H24557722k44201j13904K2232J98901K06590m0353m93943l03447L03447K98083
3858.8H24391127J00195k4319K981O1929l3200n5075K5213L2246J11580J35005L4213
3881.3H24781895K1577p153o5327k9444l5584n1916J7285P1705K4318j41680k04384
3903.7H24381292n0962L2306j9670l1054L1591N2750M947j0252k980l7611n4061o855
3928.2H24289441N7042R2029N8174l039J2815O9916K8550l0398K0146P7725N8651J311
$$ plain form
3773.2 819711149 820062637 820507944 820863843 821004510 821090698 821175516 821312785 821543217 821746349 821941614
3793.6 821941614 822249949 822567403 822708249 822671652 822670937 822718799 822775781 822940707 823171556 823382020 823569119
3816 823569119 823792279 823824883 823642731 823650241 823779941 823854506 823874533 823971927 824345291 824683070 824557722
3838.4 824557722 824313521 824199617 824221849 824420750 824627340 824586987 824093044 823789597 824093044 824391127
3858.8 824391127 824491322 824467003 824469984 824531913 824498713 824443638 824468851 824501097 824612677 824747682 824781895
3881.3 824781895 824803472 824796319 824730992 824701548 824665964 824614048 824631333 824703038 824727356 824585676 824381292
3903.7 824381292 824330330 824362636 824342966 824311912 824343503 824396253 824401200 824390948 824387968 824350357 824296296 824289441
3928.2 824289441 824346483 824438512 824496686 824493647 824506462 824576378 824604928 824574530 824594676 824672401 824731052 824732363
3952.7H24732363j251N7578O1929K6107L7551K7895K6941R7573R8824K2173L9101R8526
3977.1H25325310N6863M0531R8169R2030M3809m053l2961J6987J29700J55031
3997.5H25921416
$$ plain form
3952.7 824732363 824731112 824788690 824850619 824876726 824914277 824942172 824969113 825066686 825165510 825187683 825226784 825325310
3977.1 825325310 825382173 825422704 825520873 825612903 825656712 825652659 825619698 825636685 825766385 825921416
3997.5 825921416
##END=$$ End of the data block
