##TITLE=$$ Begin of the data block
##JCAMP-DX=5.00 $$ ACD/SpecManager v 10.08
##SPECTROMETER/DATA SYSTEM=Alpha
##DATE=10 Apr 2014 11:00:52
##DATA TYPE=INFRARED SPECTRUM
##DATA CLASS=XYDATA
##ORIGIN=
##OWNER=
##NPOINTS=1765
##FIRSTX=399.75695801
##LASTX=3997.56933594
##MAXX=3997.56933594
##MINX=399.75695801
##MAXY=0.85831070
##MINY=0.24986306
##XFACTOR=1.0000000000
##YFACTOR=1.000000000000000e-9
##FIRSTY=0.61475068
##DELTAX=2.03957629
##XUNITS=1/CM
##YUNITS=ARBITRARY UNITS
##XYDATA=(X++(Y..Y))
399.8F14750683j98364j312017j616359l88801q93593j211166l6717l14116j164258
418.1F07615292m14252p07805r85861J94549n5015p69555r8944n81980j009106M11927
438.5F03599250J39952r50277r6023k22444q95441L63886L12567j126349l16858K16722
458.9F01024985j018762o10411k62082j115799n96583l71635j496374r28104m25816
477.3E94199419j338303p90715o4671j091361q63850k69175j511395j316249j29641
495.6E86824059j151204j507938m38869j154243j450778k27451q27193j601398p52032
514E77712953j123130j866758j086652j363457j963615j034319j281441k342224j437068
532.3E64214289q65280j594007j017631o31511j451790q62777l21329j495421j512349
$$ plain form
399.8 614750683 614552319 613240302 611623943 611235142 610341549 609130383 609093666 608779550 607615292
418.1 607615292 607201040 606493235 605507374 605701923 605646908 604877353 604778409 604196429 603187323 603599250
438.5 603599250 603739202 602788925 602692902 602470458 601575017 601938903 602251470 601125121 600808263 601024985
458.9 601024985 600006223 599395812 599133730 598017931 597421348 597049713 595553339 594625235 594199419
477.3 594199419 592861116 592070401 592005730 590914369 590050519 589781344 588269949 586953700 586824059
495.6 586824059 585672855 584164917 583726048 582571805 581121027 580893576 580066383 578464985 577712953
514 577712953 576589823 574723065 573636413 572272956 570309341 569275022 567993581 565651357 564214289
532.3 564214289 563349009 561755002 560737371 560105860 558654070 557791293 557469964 555974543 554462194
550.7E54462194r15765j773537j832723j066089j789272k210736j558900k191543k747476
569E38376153j934827k121925k696634k016007j945556k468705j824975j713097k352774
587.4E19301653j923919j889705k722562k375960j852989k579511k962350k717734
603.7E00276923k638370j638502k60025m70757p05213O29187K030998L245801M629910
622.1E05099952M719258L985464M255176M202068L402173L609657L756762K645850
638.4E35676360J992881J595617R50038K183080L831625K602339L80516j81318J334131
656.7E50365269M974127P591486O259203L565371L393710N053401M263341L990948
673.1E89456856L965199L042102L310919L572106K544403K534032K877951J913428
$$ plain form
550.7 554462194 553546429 551772892 549940169 548874080 547084808 544874072 543315172 541123629 538376153
569 538376153 536441326 534319401 531622767 529606760 527661204 525192499 523367524 521654427 519301653
587.4 519301653 517377734 515488029 512765467 510389507 508536518 505957007 502994657 500276923
603.7 500276923 497638553 496000051 495740026 495269269 494564056 495193243 497224241 500470042 505099952
622.1 505099952 509819210 513804674 518059850 522261918 525664091 529273748 533030510 535676360
638.4 535676360 537669241 539264858 540214896 542397976 546229601 548831940 549212456 549031138 550365269
656.7 550365269 555339396 562930882 569190085 572755456 576149166 581202567 585465908 589456856
673.1 589456856 593422055 596464157 599775076 603347182 605891585 608425617 611303568 613216996
689.4F13216996J817525K271533J254320R00805J831591J533806J337767K440989K283871
707.7F28889203J776159K851486K948165K084017K753913L076077K336979K875924
724F49591923L202855K103329K230406K840876J905799J770497K473771J689673J300275
742.4F69109404K173007J744449J265466K205193K039790J292765K025903K131104
758.7F83987081J314998J926720K305925J451671J646876J829803O63579M57108P03871
777.1F96287632m92334r85504l56197p79092p52330P80523J413285J821757L527880
795.4G00465620M362881M369795N405307N589723M422009M353345M167855K636730
811.7G35773265K123297K063810N50926m22895n88715k035022l196001l033757l652334
$$ plain form
689.4 613216996 615034521 617306054 618560374 619461179 621292770 622826576 624164343 626605332 628889203
707.7 628889203 630665362 633516848 636465013 638549030 641302943 644379020 646715999 649591923
724 649591923 652794778 654898107 657128513 659969389 661875188 663645685 666119456 667809129 669109404
742.4 669109404 671282411 673026860 674292326 676497519 678537309 679830074 681855977 683987081
758.7 683987081 685302079 687228799 689534724 690986395 692633271 694463074 695126653 695583761 696287632
777.1 696287632 695795298 694809794 694453597 693674505 692922175 693702698 695115983 696937740 700465620
795.4 700465620 704828501 709198296 714603603 720193326 724615335 728968680 733136535 735773265
811.7 735773265 737896562 739960372 740511298 740088403 739499688 737464666 734268665 731234908 727582574
830.1G27582574m282117l625035l712774m159569l227651k835155l252864k184808
846.4G00302601p48456l7849J807690M089952N083084O331920P787228P566452P228911
864.8G39411533P544815O449581N057036M830063L740549K173722J910686J047433
881.1G72165418n87166p80940j007139k171934k007902j269221j414597o13213P24376
899.4G63037682O20722O74665J349748O19828k72870k44081j372278k898514l043294
917.8G58471608l527105m270971l320693k183021j804173n77449M44471R6083K25246
936.2G43553996O52552L0458j55390J99855o09458j417815j547337k703428m092694
954.5G33910739m583597n783915p488013q386969r791672j1860788j2834192j3313531
$$ plain form
830.1 727582574 723300457 719675422 715962648 711803079 708575428 705740273 702487409 700302601
846.4 700302601 699554145 699516296 701323986 705413938 710497022 716828942 724616170 732182622 739411533
864.8 739411533 746956348 753405929 758462965 763293028 767033577 769207299 771117985 772165418
881.1 772165418 771578252 770797312 769790173 767618239 765610337 764341116 762926519 762313306 763037682
899.4 763037682 763658404 764333069 765682817 766302645 766029775 765785694 764413416 761514902 758471608
917.8 758471608 754944503 750673532 747352839 745169818 743365645 742788196 743232667 743328750 743553996
936.2 743553996 744206548 744237006 744081616 744281471 743672013 742254198 740706861 738003433 733910739
954.5 733910739 729327142 723543227 716055214 707668245 697876573 686015785 673181593 659868062
970.8F59868062j3886989j3105750j1575937j0695219r511590q024454p500529p106483
987.1E78461111o150008n630493n173564m122793l503621l270805k579570k389550
1003.5E45640707l131151l743172m476964n625666o055355n918622o063103n832315
1019.8E04794359n144000m884153m676074m166454m041314l989250l439248l068476
1036.1D71385390k937496k401680k043575k180040k061665j911163k042413j658350
1052.4D54149008p80016n1916Q35508J652062J488775O67930l30627j895547l449887
1070.8D52285290m135698m458279m575461m153043l827840m061639m418522m950226
1087.1D17704582n651116n608410m560679l072977j281679M27932J225292J380563
$$ plain form
970.8 659868062 645981073 632875323 621299386 610604167 601092577 593068123 585567594 578461111
987.1 578461111 572311103 566680610 561507046 557384253 553880632 550609827 548030257 545640707
1003.5 545640707 542509556 538766384 534289420 528663754 522608399 516689777 510626674 504794359
1019.8 504794359 499650359 494766206 490090132 485923678 481882364 477893114 474453866 471385390
1036.1 471385390 468447894 466046214 464002639 461822599 459760934 457849771 455807358 454149008
1052.4 454149008 453368992 453317076 454152584 455804646 457293421 457961351 457630724 455735177 452285290
1070.8 452285290 448149592 443691313 439115852 434962809 431134969 427073330 422654808 417704582
1087.1 417704582 412053466 406445056 401884377 398811400 397529721 397957653 399182945 400563508
1103.4D00563508J411230J000136K87622l24726j284927k797872m545808o481439p447690
1121.8C80380034n555898j866012N18024R36776K07692q21411m96864J293241K770693
1140.1C77366275L274470L232479K690882K010464J737029J667529J688182K141476
1156.4C95808786K859354L644467M909068O465912P701069Q711040R426802R414316
1172.7D48940814R078174Q766264Q111566P303834O591350N430341L832132K376228
1189.1E00430703R05454m35650q55982m60059M18097J996279L629803M376293M546582
1207.4E14551520M380107L597975K813101K531409K219558J942456K108454K222300
1223.7E36366880K248645K714634L179669L350794L772676M160285M096151M157245
$$ plain form
1103.4 400563508 401974738 402974874 403262496 402937770 401652843 398854971 394309163 387827724 380380034
1121.8 380380034 374824136 372958124 373476148 374412924 374620616 373799205 373302341 374595582 377366275
1140.1 377366275 380640745 383873224 386564106 388574570 390311599 391979128 393667310 395808786
1156.4 395808786 398668140 402312607 407221675 413687587 421388656 430099696 439526498 448940814
1172.7 448940814 458018988 466785252 474896818 482200652 488792002 494222343 498054475 500430703
1189.1 500430703 501336157 500900507 500044525 499584466 500002563 501998842 505628645 510004938 514551520
1207.4 514551520 518931627 522529602 525342703 527874112 530093670 532036126 534144580 536366880
1223.7 536366880 538615525 541330159 544509828 547860622 551633298 555793583 559889734 564046979
1240.1E64046979M252851L796279L288389K980172K338469J740754J571715J280963
1256.4E85296571J074195J470506J884580K144694K776265L338337L560424M022301
1272.7F05567873M432022M418194M656434N102814N130052N255819N721330N763352
1289F46047890N605400N705118N431116M912316M744172M358590L685773L410101L065109
1307.4F86965585K327680J938641J699627J149773J012624J248538J137257J208722
1323.7F98688447J607955J494050J159012J102567P07388J80483J59919L0637k06232
1342G04924226K19583O08206M48883M67241N07354M0770k43604j82212n40077j137078
1362.4G05113292j394153j607358j750768j404762j385748k024532k370476l351987
$$ plain form
1240.1 564046979 568299830 572096109 575384498 578364670 580703139 582443893 584015608 585296571
1256.4 585296571 586370766 587841272 589725852 591870546 594646811 597985148 601545572 605567873
1272.7 605567873 609999895 614418089 619074523 624177337 629307389 634563208 640284538 646047890
1289 646047890 651653290 657358408 662789524 667701840 672446012 676804602 680490375 683900476 686965585
1307.4 686965585 689293265 691231906 692931533 694081306 695093930 696342468 697479725 698688447
1323.7 698688447 700296402 701790452 702949464 704052031 704759419 704939902 705099821 705130458 704924226
1342 704924226 705143809 705752015 706200898 706668139 707175493 707216263 706972659 706790447 706250370 705113292
1362.4 705113292 703719139 702111781 700361013 698956251 697570503 695545971 693175495 689823508
1378.7F89823508n730450o492197l107071J628399L157556J736700J63496r51946j603782
1397.1F78624213k484978k953767k805770l172517l237426k562940k224803k047002
1413.4F57135010j378298j038671j427054j036406m65273o33717o13272m47631o00278
1431.8F49494410m51982o2585r1672j7822N34475Q37385J144708K012789K757311L056824
1452.2F59213841L891110O382585Q418560O783962O241262P276714P615626O995499
1468.5G12819159P403731R127438Q740724O255686M743874M142761L302515K069533
1484.8G58605421J471817O26981r45568j274943j330972k536654l265620k825141k499222
1503.2G46026099l180802n920351o209194m637540l904521l647387l540457k678096
$$ plain form
1378.7 689823508 684093058 677600861 674493790 676122189 679279745 681016445 681179941 680227995 678624213
1397.1 678624213 676139235 673185468 670379698 667207181 663969755 661406815 659182012 657135010
1413.4 657135010 655756712 654718041 653290987 652254581 651789308 651155591 650542319 650094688 649494410
1431.8 649494410 649042428 648979843 648888171 648870349 649404824 650242209 651386917 653399706 656157017 659213841
1452.2 659213841 663104951 669487536 677906096 684690058 690931320 698208034 705823660 712819159
1468.5 712819159 720222890 729350328 738091052 744346738 749090612 753233373 756535888 758605421
1484.8 758605421 760077238 760704219 759758651 758483708 757152736 754616082 751350462 748525321 746026099
1503.2 746026099 742845297 736924946 730715752 726078212 722173691 718526304 714985847 712307751
1519.5G12307751k553582k826452k247155k168059k031148j549005j433611j207710
1535.8F96291029n12301k96176j052320q79228j60158J87099L97563Q95381J214147
1554.1F96085036J167536J053690n3942o87241o33896r05573k008259l320039l237009
1572.5F87460303l834068o309808o663739o249965p165670p705033q177817q746564
1588.8F32607639q875191q992374r450257r349227r052038r297729r339869q980751
1605.1E59270203r043515r350121q906066q070886q573294r923100p937700o452858
1621.4D91012663p108808o630629n624086m678786l077179k041578j694948n88983
1637.8D59567666O13749J601756K584964L946930M834384M082262N280882Q227885
$$ plain form
1519.5 712307751 709754169 706927717 704680562 702512503 700481355 698932350 697498739 696291029
1535.8 696291029 695778728 695482552 694430232 693551004 693390846 693577945 693975508 694870889 696085036
1554.1 696085036 697252572 698306262 698252320 697565079 696931183 696025610 694017351 690697312 687460303
1572.5 687460303 683626235 677316427 670652688 664402723 657237053 649532020 641354203 632607639
1588.8 632607639 623732448 614740074 605289817 595940590 586888552 577590823 568250954 559270203
1605.1 559270203 550226688 540876567 531970501 523899615 515326321 505403221 497465521 491012663
1621.4 491012663 483903855 477273226 471649140 466970354 463893175 461851597 460156649 459567666
1637.8 459567666 460181415 461783171 464368135 468315065 473149449 477231711 482512593 490740478
1654.1D90740478O398261N430579O391823P964134Q464158P351577Q283913J0015607
1670.4E51040530Q744657Q895576J0001242Q835614Q136869R644091J2601197J0504722
1686.7F28404498Q650243R120703Q250892R155989J0627806J0446131J1769176R669900
1703G06095338P983446Q144796P070660N959213N445898N601108N691409M510343L685176
1721.4G60187387L474236L227830L220498L357649L020823L300965L266633K423048
1737.7G85479069K781331L313005L096879L127098L579259L459453K931953K762556
1754H10530603K668321K339900K239763K188444J665831J680315J968920J754820J549900
1772.4H28586817J341462R00686J030802J424253J184285R47774J177966J147390R53972
$$ plain form
1654.1 490740478 497138739 502569318 508961141 516925275 525389433 532741010 541024923 551040530
1670.4 551040530 559785187 568680763 578682005 587517619 595654488 605298579 617899776 628404498
1686.7 628404498 637054741 646175444 654426336 663582325 674210131 684656262 696425438 706095338
1703 706095338 714078784 722223580 729294240 735253453 740699351 746300459 751991868 756502211 760187387
1721.4 760187387 763661623 766889453 770109951 773467600 776488423 779789388 783056021 785479069
1737.7 785479069 788260400 791573405 794670284 797797382 801376641 804836094 807768047 810530603
1754 810530603 813198924 815538824 817778587 819967031 821632862 823313177 825282097 827036917 828586817
1772.4 828586817 829928279 830828965 831859767 833284020 834468305 835416079 836594045 837741435 838695407
1790.7H38695407J098573R22144O41703Q48413R14693N14566N73576Q43704O25908
1809.1H45678687N16355O39141M48525L42548O06536N66900M18306O40869O00576K22266
1829.5H50680709K58028L98398K36809L42369N46813L89993K74361L34620J48356J28806
1849.9H53739262L79979K52009O5624K83480L06070J24693L67105N16772J36078j2458
1870.3H56158614J35958M0532J02162K91884Q2433r060K56539K38478Q2016J69277
1890.7H57548833R0957o9559J06394J50323n0783P2718K14100j4365k7597J28508l6359
1913.1H58113170k6167J97947K5749j28984N1439k4557j90258j1981L0875j57296l0756
1935.5H57849181J05023o1512m3094j2457k90394k73228O080r0003k10345m6313j47402
$$ plain form
1790.7 838695407 839793980 840716124 841357827 842206240 843120933 843635499 844209075 845052779 845678687
1809.1 845678687 846195042 846834183 847282708 847625256 848231792 848798692 849216998 849857867 850458443 850680709
1829.5 850680709 850938737 851337135 851573944 851916313 852463126 852853119 853127480 853462100 853610456 853739262
1849.9 853739262 854119241 854371250 854436874 854720354 855026424 855151117 855518222 856034994 856171072 856158614
1870.3 856158614 856294572 856335104 856437266 856729150 856811583 856802523 857059062 857297540 857379556 857548833
1890.7 857548833 857639790 857570231 857676625 857826948 857776165 857848883 858062983 858048618 858021021 858149529 858113170
1913.1 858113170 858087003 858284950 858310699 858181715 858233154 858208597 858018339 858006358 858037233 857879937 857849181
1935.5 857849181 857954204 857892692 857849598 857837141 857546747 857273519 857279599 857189596 856979251 856932938 856785536
1958H56785536k77460l6835q882k26020j28627o7950k75373j93000k4259j81019j82986
1980.4H55183125j5080j81139k67386l8505q7261k43247p6890j02877l14117j62065
2000.8H53694558p1108k54810j87278r3758k68638j87397J3113j91212l03745j40965
2021.2H52008760k24233k89142o5088r7096k62678j02758o4969k66493j68025k2352
2041.6H50445926j88172j69396m8339j94014j81436o616j35541k04325K325m1426j75416
2064H49103570k1160J3531j42515m9770J0192j60694q6963P6354m0949n6028P3731
2086.5H48719299o3956j54734L696k9385j09136O2048P2479o9737L0518P8082p0632
2108.9H48468542l4928M6372n0545J7882J61826M1247m649J57952R8526k0086R6261
$$ plain form
1958 856785536 856508076 856471241 856462359 856236339 856107712 856039762 855764389 855571389 855547130 855366111 855183125
1980.4 855183125 855168045 854986906 854719520 854681015 854593754 854350507 854273617 854170740 853856623 853694558
2000.8 853694558 853623450 853368640 853181362 853087604 852818966 852631569 852644682 852453470 852149725 852008760
2021.2 852008760 851784527 851495385 851430297 851333201 851070523 850967765 850902796 850636303 850468278 850445926
2041.6 850445926 850257754 850088358 850040019 849846005 849664569 849657953 849522412 849318087 849320412 849278986 849103570
2064 849103570 849082410 849095941 848953426 848903656 848913848 848753154 848666191 848742545 848701596 848645568 848719299
2086.5 848719299 848655343 848500609 848504305 848474920 848365784 848427832 848500311 848430574 848461092 848539174 848468542
2108.9 848468542 848433614 848479986 848429441 848447323 848609149 848650396 848645747 848803699 848902225 848882139 848978400
2131.3H48978400Q2016r358J10448J10984m2499O5983J97887O5923O9618J79887M7982
2153.8H49857271j8657J31131J19388P1406J79589J20103L279J28746J88589R0599
2174.2H50871444J28031J41382L0219Q2851J76847O5505J2875R3222M3511P629R9778
2196.6H51753294O5208m828R5069R7752l4451N662O4492j4782K2471Q4996l5107m5955
2221.1H52053821Q9288M6432k8849L5823K0265n9604r895K4736j4782L9756L6359r4115
2245.6H52139235o2943K4021o8307q1599R537n6386r7633P16j0372l7729Q4579J05917
2270H51949036J490M3273Q5056j3351N2034J95563R5487l7491l6657o1214o7473k1636
2294.5H52184117o7234q0943M1783L0815j36137j69456j49608j92046r1552M887j73330
$$ plain form
2131.3 848978400 849060416 849051058 849161506 849272490 849229991 849295974 849493861 849559784 849629402 849809289 849857271
2153.8 849857271 849838614 849969745 850089133 850160539 850340128 850460231 850463510 850592256 850780845 850871444
2174.2 850871444 850999475 851140857 851171076 851253927 851430774 851496279 851509154 851602376 851645887 851653516 851753294
2196.6 851753294 851818502 851813674 851908743 852006495 851972044 851977706 852042198 852027416 852049887 852134883 852099776 852053821
2221.1 852053821 852143109 852189541 852160692 852196515 852216780 852157176 852147281 852172017 852157235 852196991 852233350 852139235
2245.6 852139235 852076292 852100313 852032006 851950407 851959944 851903558 851805925 851806641 851796269 851758540 851843119 851949036
2270 851949036 851950526 851993799 852078855 852065504 852117538 852313101 852408588 852371097 852334440 852273226 852205753 852184117
2294.5 852184117 852116883 852035940 852077723 852108538 851972401 851802945 851653337 851461291 851369739 851374626 851201296
2316.9H51201296l40879k91050k17676j22726n8055j56700j41859K6047n1379j60635
2337.3H49686384n0783k9087J02878O74247Q47459K15531m91143p19607n73396l93570
2357.7H49268913k21371l5882L87311Q20100P86364P11381Q42274P60555O47247P62284
2378.1H54729176P60436N68807M68492L69609J67071J04726J38938L3856j5676P8618
2398.5H57404053P0334K4676R3460Q2195l5584m4882l6121p6473k2947m053j22786
2421H57331872j55926r1791q6248n3406J4425j4544l7968n245n3585r9897m9591m6790
2445.4H56651306r9480n2035l4869j42216j40846q0228j16765j17183q3327j12594
2465.8H55671763q9585l9399j07706j53720j24693j69992j83165r5249o9737r2387
$$ plain form
2316.9 851201296 850860417 850569367 850351691 850228965 850170910 850014210 849872351 849898398 849847019 849686384
2337.3 849686384 849635601 849606514 849709392 850383639 851231098 851446629 850955486 850235879 849662483 849268913
2357.7 849268913 849047542 849011660 849398971 850219071 851005435 851716816 852559090 853319645 853966892 854729176
2378.1 854729176 855489612 856058419 856526911 856896520 857063591 857168317 857307255 857341111 857325435 857404053
2398.5 857404053 857474387 857499063 857592523 857674718 857639134 857594252 857558131 857481658 857458711 857454658 857331872
2421 857331872 857175946 857084155 856997907 856944501 856958926 856944382 856906414 856901169 856847584 856747687 856698096 856651306
2445.4 856651306 856551826 856499791 856464922 856322706 856181860 856101632 855984867 855867684 855784357 855671763
2465.8 855671763 855582178 855542779 855435073 855281353 855156660 854986668 854803503 854708254 854638517 854546130
2486.2H54546130r0003j53661k03908j02818l6060j11521j56343j32799j30057j21057
2506.6H53307903p8678p9632j15156j22488j31667j47402j50263j55449j49429j25229
2527H52052510j29700j56760j26243q8334j12414j32680j58250j88470j59204j17660
2547.4H50682795j32620j59979j58370j76251j90913j53721j36017j56522j48714j59025
2567.8H49110663k12848k03073j75238k39551k74003k45690k66254k80917k61902k72572
2588.2H46678615k58208k34961l11196l91781l51072k94387l27408l74854l76344l82483
2608.6H43375921l73304l47256l54469l58701l56197m09603m42207l64185l34084m06086
2629H39629829m16696l92676m12583l92198l42906l45588l47793l47078l91364l99112
$$ plain form
2486.2 854546130 854456127 854302466 854098558 853995740 853959680 853848159 853691816 853559017 853428960 853307903
2506.6 853307903 853229225 853149593 853034437 852911949 852780282 852632880 852482617 852327168 852177739 852052510
2527 852052510 851922810 851766050 851639807 851551473 851439059 851306379 851148129 850959659 850800455 850682795
2547.4 850682795 850550175 850390196 850231826 850055575 849864662 849710941 849574924 849418402 849269688 849110663
2567.8 849110663 848897815 848694742 848519504 848279953 848005950 847760260 847494006 847213089 846951187 846678615
2588.2 846678615 846420407 846185446 845874250 845482469 845131397 844837010 844509602 844134748 843758404 843375921
2608.6 843375921 843002617 842655361 842300892 841942191 841585994 841176391 840734184 840369999 840035915 839629829
2629 839629829 839213133 838820457 838407874 838015676 837672770 837327182 836979389 836632311 836240947 835841835
2649.4H35841835l50297l36170l41892l17514l13044l49998l49999l10242l16560l25919
2669.8H32530200l21626l65436l72291l04997k94924l74615m34637m47214m19199l47197
2690.2H28848064l41296l92795l91364m10616m62413m43757m12643m18067m34756m81307
2710.6H24659050n23389m96864m38631m28319m51982m39524m34518n10633n54204n08368
2731H19872618m63188m15564m09662m72606m67419m05073m01199m08828m37081n48601
2751.4H15443397n97835n15282m91738n36323n11527n20170n96285n96463n61595n64337
2771.8H09951842n60761o12616p36892p42019o61850o79850o85275o19769o96957q49366
2792.2H03106487q41856q17657q98540r37342r67026j036525r93252r45925j040101
$$ plain form
2649.4 835841835 835491538 835155368 834813476 834495962 834182918 833832920 833482921 833172679 832856119 832530200
2669.8 832530200 832208574 831843138 831470847 831165850 830870926 830496311 830061674 829614460 829195261 828848064
2690.2 828848064 828506768 828113973 827722609 827311993 826849580 826405823 825993180 825575113 825140357 824659050
2710.6 824659050 824135661 823638797 823200166 822771847 822319865 821880341 821445823 820935190 820380986 819872618
2731 819872618 819409430 818993866 818584204 818111598 817644179 817239106 816837907 816429079 815991998 815443397
2751.4 815443397 814845562 814330280 813838542 813302219 812790692 812270522 811674237 811077774 810516179 809951842
2771.8 809951842 809391081 808778465 808041573 807299554 806637704 805957854 805272579 804652810 803955853 803106487
2792.2 803106487 802264631 801446974 800548434 799611092 798644066 797607541 796614289 795668364 794628263
2810.5G94628263j112879j133203j189530j212895j204133j254559j320004j387358
2826.8G84813702j504719j587629j630128j828730k149880k501309l030240l618360
2843.1G66962707m048467m356742m406571l815830k652824j481592o16849k29120m71413
2861.5G44883299j016021j483738j903296k109229j912773j697719j604617j361072
2877.8G31794834j161575j257539j405239j516998j715302j850307j884044k002179
2894.1G19001651k132714k178252k276718k387703k430200k618790k968729l282785
2910.4F98725760l715992m282117m536033m314005l744125k818764j738309q02756
2926.8F72773659J2875O50763J051426J503468K113700K584874K798498K832472K534569
$$ plain form
2810.5 794628263 793515384 792382181 791192651 789979756 788775623 787521064 786201060 784813702
2826.8 784813702 783308983 781721354 780091226 778262496 776112616 773611307 770581067 766962707
2843.1 766962707 762914240 758557498 754150927 750335097 747682273 746200681 745583832 745354712 744883299
2861.5 744883299 743867278 742383540 740480244 738371015 736458242 734760523 733155906 731794834
2877.8 731794834 730633259 729375720 727970481 726453483 724738181 722887874 721003830 719001651
2894.1 719001651 716868937 714690685 712413967 710026264 707596064 704977274 702008545 698725760
2910.4 698725760 695009768 690727651 686191618 681877613 678133488 675314724 673576415 672773659
2926.8 672773659 672786534 673437297 674488723 675992191 678105891 680690765 683489263 686321735 688856304
2945.1F88856304J884639J286983Q95858M53294J49190K30074M39286O87599Q78454
2963.5F95761681Q62240Q68857R78887J019955J037777J092314J124978J126111J040161
2981.8G04912961Q31782O65605P09773P66038M89295N2273j95920m54366p45118p93696
3002.2G06238627q06570q61525p61211o64711p61271r66787j204550j373291j362264
3020.6F97476447j319707j425266j512826j442551j443267j505077j591802j798868
3036.9F85437083j794815j622975j733839k004385k118707k117634k122223k105057
3053.2F69817448k099455k180993k195299k110660k076745j974225j904249k111674
3069.5F53164148k227068k039075j860976j812696j925588k156257k265454k241731
$$ plain form
2945.1 688856304 690740943 692027926 692923784 693377078 693526268 693756342 694195628 694883227 695761681
2963.5 695761681 696623921 697492778 698471665 699491620 700529397 701621711 702746689 703872800 704912961
2981.8 704912961 705744743 706410348 707120121 707886159 708375454 708427727 708231807 707777441 707032323 706238627
3002.2 706238627 705432057 704570532 703809321 703144610 702383339 701416552 700212002 698838711 697476447
3020.6 697476447 696156740 694731474 693218648 691776097 690332830 688827753 687235951 685437083
3036.9 685437083 683642268 682019293 680285454 678281069 676162362 674044728 671922505 669817448
3053.2 669817448 667717993 665537000 663341701 661231041 659154296 657180071 655275822 653164148
3069.5 653164148 650937080 648898005 647037029 645224333 643298745 641142488 638877034 636635303
3085.8F36635303k218961k223015k246201k292574k337038k275467k248287k449036
3102.2F18344724k556383k396405k370000k581954k605558k469420k534926k699613
3118.5E98130465k913833l148556l125012k964794k931714k993703l089011l127933
3134.8E73835909l029286l000141l273606l491580l373087l252208l206730l143847
3151.1E48065424l315032l646493l700792l577292l558457l567577l561914l574073
3167.4E19563794l564894l541350l562868l605545l610491l577918l558994l547519
3183.7D90994215l561169l590405l573388l575533l598750l582805l549278l515870
3200.1D62447017l441721l359586l346860l363908l322392l248722l182202l128380
$$ plain form
3085.8 636635303 634416342 632193327 629947126 627654552 625317514 623042047 620793760 618344724
3102.2 618344724 615788341 613391936 611021936 608439982 605834424 603365004 600830078 598130465
3118.5 598130465 595216632 592068076 588943064 585978270 583046556 580052853 576963842 573835909
3134.8 573835909 570806623 567806482 564532876 561041296 557668209 554416001 551209271 548065424
3151.1 548065424 544750392 541103899 537403107 533825815 530267358 526699781 523137867 519563794
3167.4 519563794 515998900 512457550 508894682 505289137 501678646 498100728 494541734 490994215
3183.7 490994215 487433046 483842641 480269253 476693720 473094970 469512165 465962887 462447017
3200.1 462447017 459005296 455645710 452298850 448934942 445612550 442363828 439181626 436053246
3216.4D36053246l148198l152907l076583l022164k993554k940953k878844k811939
3232.7D12028104k782881k786279k742022k674729k603650k518535k477824k511442
3249C90930742k496123k398193k320498k336741k392143k352655k284765k258003k196193
3267.4C69895428k103805k142251k271086k277195k234131k235890k202838k161145
3283.7C52267087k164424k143145k090781k071411k081394k139390k276450k294958
3300C35005134k092719j970798k074122k237737k380401k448261k357632k238273k216429
3318.4C14988762k210349k157271k114981k203673k336204k300382k149790k022684
3334.7B97493428j947999j987308k121389k185404k158404k044231j887351j946062
$$ plain form
3216.4 436053246 432905048 429752141 426675558 423653394 420659840 417718887 414840043 412028104
3232.7 412028104 409245223 406458944 403716922 401042193 398438543 395920008 393442184 390930742
3249 390930742 388434619 386036426 383715928 381379187 378987044 376634389 374349624 372091621 369895428
3267.4 369895428 367791623 365649372 363378286 361101091 358866960 356631070 354428232 352267087
3283.7 352267087 350102663 347959518 345868737 343797326 341715932 339576542 337300092 335005134
3300 335005134 332912415 330941617 328867495 326629758 324249357 321801096 319443464 317205191 314988762
3318.4 314988762 312778413 310621142 308506161 306302488 303966284 301665902 299516112 297493428
3334.7 297493428 295545429 293558121 291436732 289251328 287092924 285048693 283161342 281215280
3351B81215280k157181k181232j974404j774073j754343j764268j565963j379013j563936
3369.3B65100867j895726j853138j516730j340032j281440j197338j113057r68546
3385.7B53934860o65962l14713l06159o40005p03633k86102K0504k31892n76586l67254
3406.1B49863058M0680J68384J37806K9861R120K61277M75705M93407O53624R69917
3426.5B53102839J185656J150935J166434J362294J259505R20117R17763J280516J665801
3444.8B64011860J843691J791984J831323J986444K090305K247005K438993K389252
3461.1B80630857K370059K765030L009319K613902K101779K150566K546370K934217
3477.4C01122099L023893K734721K691149L023803L106624K968490L067673L299206
$$ plain form
3351 281215280 279058099 276876867 274902463 273128390 271374047 269609779 268043816 266664803 265100867
3369.3 265100867 263205141 261352003 259835273 258495241 257213801 256016463 254903406 253934860
3385.7 253934860 253268898 252954185 252648026 252008021 251304388 251018286 251038790 250806898 250230312 249863058
3406.1 249863058 249903738 250072122 250209928 250239789 250248909 250510186 250985891 251479298 252132922 253102839
3426.5 253102839 254288495 255439430 256605864 257968158 259227663 260147780 261065543 262346059 264011860
3444.8 264011860 265855551 267647535 269478858 271465302 273555607 275802612 278241605 280630857
3461.1 280630857 283000916 285765946 288775265 291389167 293490946 295641512 298187882 301122099
3477.4 301122099 304145992 306880713 309571862 312595665 315702289 318670779 321738452 325037658
3493.8C25037658L455341L382474L298879L412187L299236L016591L201783L696382
3510.1C51800531L996819L910423L638386L663391M007131M409254M335135L934532
3526.4C83695602L980190M289418M446537M658222M759908M581183M735648N117447
3542.7D20264155N207151M864842M606872M877955N205125N208730N253941N526334
3559D61015105N638391N398363N467296O390899O614804N913377N773276O177068O511927
3577.4E14900506O734311O848455O716728O806671P186532P025123O583333O812692
3593.7E69614351P214129P269978P263720P156134O864667O803155P260442P347703
3610F26794279P064402P017195O813884P025897P386446O517709N582809N607784O743192
$$ plain form
3493.8 325037658 328492999 331875473 335174352 338586539 341885775 344902366 348104149 351800531
3510.1 351800531 355797350 359707773 363346159 367009550 371016681 375425935 379761070 383695602
3526.4 383695602 387675792 391965210 396411747 401069969 405829877 410411060 415146708 420264155
3542.7 420264155 425471306 430336148 434943020 439820975 445026100 450234830 455488771 461015105
3559 461015105 466653496 472051859 477519155 483910054 490524858 496438235 502211511 508388579 514900506
3577.4 514900506 521634817 528483272 535200000 542006671 549193203 556218326 562801659 569614351
3593.7 569614351 576828480 584098458 591362178 598518312 605382979 612186134 619446576 626794279
3610 626794279 633858681 640875876 647689760 654715657 662102103 668619812 674202621 679810405 686553597
3628.4F86553597P110179N870759N466223N397260N205691N125880M887999M564642
3644.7G30182230M658223N246699M927575L729820L397048L799796L689945L089308
3661G62720644K702713K694846K719521K629817K488136K151072J973748J926244J790165
3679.4G83796906J737595J849949K078474K299249K028048J432598J317739J390457
3695.7G97931015J298249J106739J070857J155079J157701J044690Q95739P87616Q14080
3714H07261765Q46207P69496O90699O47366N46098M44293N45680P38740Q45611P56622
3734.4H14092577O55472N79893L22581K1219L7968M49002N12004L13222L13819M66764
3754.8H17764521M30107K58267K53498L40581L04640K42590K21074K33948L10600L55423
$$ plain form
3628.4 686553597 693663776 699534535 705000758 710398018 715603709 720729589 725617588 730182230
3644.7 730182230 734840453 740087152 745014727 748744547 752141595 755941391 759631336 762720644
3661 762720644 765423357 768118203 770837724 773467541 775955677 778106749 780080497 782006741 783796906
3679.4 783796906 785534501 787384450 789462924 791762173 793790221 795222819 796540558 797931015
3695.7 797931015 799229264 800336003 801406860 802561939 803719640 804764330 805660069 806447685 807261765
3714 807261765 808107972 808877468 809568167 810215533 810761631 811205924 811751604 812490344 813335955 814092577
3734.4 814092577 814748049 815327942 815650523 815671742 815709710 816158712 816670716 816983938 817297757 817764521
3754.8 817764521 818194628 818452895 818706393 819046974 819351614 819594204 819815278 820049226 820359826 820715249
3775.2H20715249L56972K48372J28150J24455J22189J81079K48373K26557K29716K46942
3795.6H22828054J73450P4506K9564Q2612Q0108K3842Q3924J80363K03669K15650K79546
3818H24255288N7280j94133O6221K53976J18017k7955P8976L32713K33055j87517k49207
3840.5H24736714p0512O3002J90497J90615n3346n00739l12328L14772L23892Q0943
3860.9H24963510n8532M5657J24217m3214q9466K3603M8816R4831O4492j1086M6194
3883.3H25209022K0086p1942k5809K5987N663p034N544l2246j27733j50383n2452K6465
3907.8H24825168K2471M1723R7930Q1957k7836q4519m2915m2141n5373M0412J20461
3930.2H24977338Q6189J5378l8684r358N7042P2181P6950L7551j5378j2875k4617k2590
$$ plain form
3775.2 820715249 821072221 821320593 821448743 821573198 821695387 821876466 822124839 822351396 822581112 822828054
3795.6 822828054 823001504 823076010 823105574 823188186 823268294 823292136 823376060 823556423 823760092 823975742 824255288
3818 824255288 824312568 824118435 824184656 824438632 824556649 824528694 824607670 824940383 825173438 824985921 824736714
3840.5 824736714 824666202 824729204 824919701 825110316 825056970 824556231 824243903 824558675 824882567 824963510
3860.9 824963510 824904978 824950635 825074852 825031638 824942172 824965775 825014591 825109422 825173914 825162828 825209022
3883.3 825209022 825229108 825157166 825131357 825157344 825163007 825155973 825161517 825129271 825001538 824851155 824798703 824825168
3907.8 824825168 824847639 824889362 824987292 825069249 825041413 824956894 824913979 824871838 824816465 824856877 824977338
3930.2 824977338 825063527 825078905 825040221 825030863 825087905 825160086 825237036 825274587 825259209 825246334 825221717 825199127
3954.7H25199127P2241J26183P2599L6418J3053L934O0857J05202O9141K5332K7299
3977.1H25811386M9412J13011J54316Q6367L100l0935l5167J9729P7308O2167
3997.5H26310694
$$ plain form
3954.7 825199127 825271368 825397551 825470150 825506568 825519621 825523555 825584412 825689614 825758755 825784087 825811386
3977.1 825811386 825860798 825973809 826128125 826214492 826217592 826186657 826151490 826171219 826248527 826310694
3997.5 826310694
##END=$$ End of the data block
