##TITLE=$$ Begin of the data block
##JCAMP-DX=5.00 $$ ACD/SpecManager v 10.08
##SPECTROMETER/DATA SYSTEM=Alpha
##DATE=10 Apr 2014 11:00:52
##DATA TYPE=INFRARED SPECTRUM
##DATA CLASS=XYDATA
##ORIGIN=
##OWNER=
##NPOINTS=1765
##FIRSTX=399.75695801
##LASTX=3997.56933594
##MAXX=3997.56933594
##MINX=399.75695801
##MAXY=0.85835028
##MINY=0.25054255
##XFACTOR=1.0000000000
##YFACTOR=1.000000000000000e-9
##FIRSTY=0.61428446
##DELTAX=2.03957629
##XUNITS=1/CM
##YUNITS=ARBITRARY UNITS
##XYDATA=(X++(Y..Y))
399.8F14284456M5419q90673j354158l62813r06646j158297P5399l35395j126170j18494
420.2F08152628n14865r65595j19329m93824o81818K82586o96719j748979k55346K16961
440.5F03175700l37899M84765J24990q13066R3340r9301j148164j85371q3327j170337
460.9F00041330l20912j42395j348019p20918j36971j288176r34899m52637j450599
479.3E93245804j044571k84672j077175p08163o7234j266301j271545l43264j314103
497.7E85868776j504243m32252j172305j439213k62320q61109j490175n89133j118123
516E76999903j966000j051664j257181j972497j155496j396238k258242j255691q49545
534.4E63837349j621306r76085o00219j480401j073122n32090j455009j485169j027763
$$ y = [614284456, 614329875, 613439202, 612085044, 611722231, 610815585, 609657288, 609732687, 609397292, 608271122, 608152628, 607637763, 606672168, 606552839, 606059015, 605377197, 605659783, 604963064, 603214085, 602958739, 603175700, 602837801, 603322566, 603447556, 602634490, 602727830, 602628529, 601480365, 601294994, 601211667, 600041330, 599720418, 599578023, 598230004, 597509086, 597372115, 596083939, 595149040, 594696403, 593245804, 592201233, 591916561, 590839386, 590131223, 590063989, 588797688, 587526143, 587182879, 585868776, 584364533, 583932281, 582759976, 581320763, 581058443, 580197334, 578707159, 578118026, 576999903, 575033903, 573982239, 572725058, 570752561, 569597065, 568200827, 565942585, 564686894, 563837349, 562216043, 561239958, 560639739, 559159338, 558086216, 557554126, 556099117, 554613948, 553586185]
552.7E53586185j802266j722037r31740j679182k125979j512944k197505k885103k179444
571.1E36549985k368211k761960j756549j637817k426982j924038j679182k346754
587.4E19648492k091288j944304k551019k104938j730323k761125l183663k817333
603.7E00464499k699524j673609l52770n81950o27399Q47668K205819L322541M622698
622.1E05527973M660607L948152M284441M244626L400087L528237L611446K591610
638.4E35797179K118885J775384J089037K228200L767610K532303K88725l02196J271844
656.7E50566971M994452P699967O358146L597260L394604N026936M318476M059195
673.1E90016007L945113L024220L327072L527105K472579K539814K939105J950681
$$ y = [553586185, 551783919, 550061882, 549130142, 547450960, 545324981, 543812037, 541614532, 538729429, 536549985, 534181774, 531419814, 529663265, 528025448, 525598466, 523674428, 521995246, 519648492, 517557204, 515612900, 513061881, 510956943, 509226620, 506465495, 503281832, 500464499, 497764975, 496091366, 495738596, 495156646, 494529247, 495376915, 497582734, 500905275, 505527973, 510188580, 514136732, 518421173, 522665799, 526065886, 529594123, 533205569, 535797179, 537916064, 539691448, 540780485, 543008685, 546776295, 549308598, 549597323, 549295127, 550566971, 555561423, 563261390, 569619536, 573216796, 576611400, 581638336, 585956812, 590016007, 593961120, 596985340, 600312412, 603839517, 606312096, 608851910, 611791015, 613741696]
689.4F13741696J859128K334118J277209R20593J856804J498878J283109K405286K328873
707.7F29505694J895845K876222K898514K061308K720594L033698K289354K813697
724F50094926L194929K166867K262652K807140J880527J765847K457857J663089J301884
742.4F69595718K232790J824975J299978K154052J969635J316250K109110K172828
758.7F84675336J323879J889348K184212J323402J596153J889646P26819L86476N91219
777.1F96586490m97759q82387k67386p62582p43210P65383J325786J712263L462135
795.4G00698733M378021M476786N528390N619645M364550M295707M142761K633572
811.7G36138165K141595K083838N27859m73142o26683k062798l196835l046036l702939
$$ y = [613741696, 615600824, 617934942, 619212151, 620132744, 621989548, 623488426, 624771535, 627176821, 629505694, 631401539, 634277761, 637176275, 639237583, 641958177, 644991875, 647281229, 650094926, 653289855, 655456722, 657719374, 660526514, 662407041, 664172888, 666630745, 668293834, 669595718, 671828508, 673653483, 674953461, 677107513, 679077148, 680393398, 682502508, 684675336, 685999215, 687888563, 690072775, 691396177, 692992330, 694881976, 695608795, 695995271, 696586490, 696088731, 695206344, 694938958, 694176376, 693433166, 694198549, 695524335, 697236598, 700698733, 705076754, 709553540, 715081930, 720701575, 725066125, 729361832, 733504593, 736138165, 738279760, 740363598, 740891457, 740418315, 739791632, 737728834, 734531999, 731485963, 727783024]
830.1G27783024m298210l588199l616512m057408l250241k914667l239751k132535
846.4G00685501p61747o3420J829565M091501N045235O291330P737696P527352P216632
864.8G39599645P561207O489634N062700M797220L721654K158881J870572J014531
881.1G72276044n54264p24494j031399k229392j996279j229525j391947n76317P50899
899.4G63293326O03497O66380J360774N93364l55124l24428j397074k881229k992808
917.8G58566678l474951m241526l312588k221286j868606o33419M04895R0003K64466
936.2G43573666O82175Q642j62661K30134n90086j433373j581728k703488m068077
954.5G33955204m593849n827307p527829q430361r856463j1865616j2767672j3281048
$$ y = [727783024, 723484814, 719896615, 716280103, 712222695, 708972454, 706057787, 702818036, 700685501, 699923754, 699860334, 701689899, 705781400, 710826635, 717117965, 724855661, 732383013, 739599645, 747160852, 753650486, 758713186, 763510406, 767232060, 769390941, 771261513, 772276044, 771721780, 770997286, 769965887, 767736495, 765740216, 764510691, 763118744, 762542427, 763293326, 763896823, 764563203, 765923977, 766517341, 766162217, 765837789, 764440715, 761559486, 758566678, 755091727, 750850201, 747537613, 745316327, 743447721, 742814302, 743219197, 743309200, 743573666, 744255841, 744264483, 744101822, 744331956, 743741870, 742308497, 740726769, 738023281, 733955204, 729361355, 723534048, 716006219, 707575858, 697719395, 685853779, 673086107, 659805059]
970.8F59805059j3869583j3058007j1533976j0673105r512484q063317p554292p121086
987.1E78419209o115675n598963n176902m126906l508568l305495k608954k388895
1003.5E45588851l136754l765941m464507n580544o060481n961955o068826n788624
1019.8E04761219n092889m876584m678666m134566m023880l994465l437340l092647
1036.1D71430182k955079k359569j987248k141893k070219j973539k075166j612931
1052.4D54254538p19458m4912P98523J607955J448929O19620l76195j885324l416837
1070.8D52286839m151880m474610m544407m108280l821940m078388m394978m913479
1087.1D17798877n631477n588919m548669l061980j268118M32551J249224J418083
$$ y = [659805059, 645935476, 632877469, 621343493, 610670388, 601157904, 593094587, 585540295, 578419209, 572303534, 566704571, 561527669, 557400763, 553892195, 550586700, 547977746, 545588851, 542452097, 538686156, 534221649, 528641105, 522580624, 516618669, 510549843, 504761219, 499668330, 494791746, 490113080, 485978514, 481954634, 477960169, 474522829, 471430182, 468475103, 466115534, 464128286, 461986393, 459916174, 457942635, 455867469, 454254538, 453535080, 453490168, 454288691, 455896646, 457345575, 457965195, 457589000, 455703676, 452286839, 448134959, 443660349, 439115942, 435007662, 431185722, 427107334, 422712356, 417798877, 412167400, 406578481, 402029812, 398967832, 397699714, 398132265, 399381489, 400799572]
1103.4D00799572J436115J033842L03895l64840j362592k858729m567623o509930p478624
1121.8C80431086n537629j825154N29587R23544J72258q48800m79579J327902K798617
1140.1C77491832L283322L214419K662628J986266J730948J670331J663894K130299
1156.4C95833939K914012L693610M878670O416381P699132Q714795R417087R404122
1172.7D48971748R049207Q731783Q082717P254124O541193N431145L859580K383142
1189.1E00304639R07779m26054q57770m50790M50998K005130L617585M385293M563808
1207.4E14500618M400313L639221K833366K498806K180338J928270K103090K223194
1223.7E36307216K267062K728463L173828L347277L769160M155039M119158M191280
$$ y = [400799572, 402235687, 403269529, 403573424, 403208584, 401845992, 398987263, 394419640, 387909710, 380431086, 374893457, 373068303, 373597890, 374521434, 374693692, 373844892, 373365313, 374693215, 377491832, 380775154, 383989573, 386652201, 388638467, 390369415, 392039746, 393703640, 395833939, 398747951, 402441561, 407320231, 413736612, 421435744, 430150539, 439567626, 448971748, 458020955, 466752738, 474835455, 482089579, 488630772, 494061917, 497921497, 500304639, 501212418, 500786364, 499928594, 499477804, 499928802, 501933932, 505551517, 509936810, 514500618, 518900931, 522540152, 525373518, 527872324, 530052662, 531980932, 534084022, 536307216, 538574278, 541302741, 544476569, 547823846, 551593006, 555748045, 559867203, 564058483]
1240.1E64058483M260361L800928L320039L023565K361536J744270J570880J275778
1256.4E85415840J078487J469791J837193K081275K745927L333568L550411L983438
1272.7F05495930M400551M415035M643083N085766N139113N278945N716562N734384
1289F45909369N587101N686522N424916M932225M756093M371226L727138L455639L083288
1307.4F86933517K324343J941502J703978J143157J025141J268267J132310J199662
1323.7F98671877J597703J489401J191795J141250P12752J72079J35958j2577k03430
1342G04896808K59518O03557M33624M95434N20408L5405k19047j66357n68569j153647
1362.4G05137134j381159j604915j735926j385688j400352k038360k359926l356278
$$ y = [564058483, 568318844, 572119772, 575439811, 578463376, 580824912, 582569182, 584140062, 585415840, 586494327, 587964118, 589801311, 591882586, 594628513, 597962081, 601512492, 605495930, 609896481, 614311516, 618954599, 624040365, 629179478, 634458423, 640174985, 645909369, 651496470, 657182992, 662607908, 667540133, 672296226, 676667452, 680394590, 683850229, 686933517, 689257860, 691199362, 692903340, 694046497, 695071638, 696339905, 697472215, 698671877, 700269580, 701758981, 702950776, 704092026, 704804778, 704976857, 705112815, 705100238, 704896808, 705156326, 705759883, 706193507, 706688941, 707209349, 707244754, 707025707, 706859350, 706290781, 705137134, 703755975, 702151060, 700415134, 699029446, 697629094, 695590734, 693230808, 689874530]
1378.7F89874530n752087o493389l117383J583278L144086J759708J75833r32753j561105
1397.1F78680718k455652k939045k797067l177882l237068k549649k218902k054453
1413.4F57251000j390457j056492j421213j006603m58122o33478o07967m63724o25492
1431.8F49587452m47988n1916j08301l9399N20766Q21233J115500J990438K741277
1450.1F56129062L033400L858864O336153Q418381O826341O257892P283210P654488
1466.4G05797791P011772P341504R057879Q775294O327868M768848M138172L301561
1482.8G56520689K058208J428127N77628r35852j237869j326263k538324l239512k822340
1501.1G48484492k550423l260255n913198o109357m575789l867745l621638l547489
$$ y = [689874530, 684122443, 677629054, 674511671, 676094949, 679239035, 680998743, 681174576, 680241823, 678680718, 676225066, 673286021, 670488954, 667311072, 664074004, 661524355, 659305453, 657251000, 655860543, 654804051, 653382838, 652376235, 651918113, 651284635, 650676668, 650212944, 649587452, 649139464, 649087548, 648979247, 648939848, 649460614, 650281847, 651397347, 653387785, 656129062, 659162462, 663021326, 669357479, 677775860, 684602201, 690860093, 698143303, 705797791, 712809563, 720151067, 729208946, 737984240, 744312108, 749080956, 753219128, 756520689, 758578897, 760007024, 760584652, 759648800, 758410931, 757084668, 754546344, 751306832, 748484492, 745934069, 742673814, 736760616, 730651259, 726075470, 722207725, 718586087, 715038598]
1517.4G15038598k742768k619385k808691k195954k114296j963138j501382j464546
1533.7F97628438j283824n88357l59953r91166p68780j03355K17080M29213R17614
1552.1F95096910J205206J120984J001239l8027o56963o09338q64566j979827l301680
1570.5F90973938l207922l831208o319404o646693o238222p149577p679045q171558
1586.8F41730309q740724q870244r022355r488404r363651r037614r253025r303868
1603.1E68650424r000897r094655r379089q915902q082866q603573r968102p942528
1619.4D97662812o432145p104427o650060n657733m717111l113688k082556j729101
1635.7D60175991n79208O43253J625717K602398L962785M852891M078746N266577Q312345
$$ y = [715038598, 712295830, 709676445, 706867754, 704671800, 702557504, 700594366, 699092984, 697628438, 696344614, 695756257, 695396304, 694405138, 693636358, 693533003, 693750083, 694179296, 695096910, 696302116, 697423100, 698424339, 698386312, 697729349, 697120011, 696255445, 694275618, 690973938, 687766016, 683934808, 677615404, 670968711, 664730489, 657580912, 649901867, 641730309, 632989585, 624119341, 615096986, 605608582, 596244931, 587207317, 577954292, 568650424, 559649527, 550554872, 541175783, 532259881, 524177015, 515573442, 505605340, 497662812, 491230667, 484126240, 477476180, 471818447, 467101336, 463987648, 461905092, 460175991, 459596783, 460240036, 461865753, 464468151, 468430936, 473283827, 477362573, 482629150, 490941495]
1654.1D90941495O497264N446225O364107P945359Q477688P354021Q261740J0002434
1670.4E51290333Q759082Q957922J0072947Q815646Q061588R581983J2585282J0550261
1686.7F28675044Q681833R100616Q208514R114086J0584295J0408223J1783838R689510
1703G06245959P956385Q122147P073283N969763N455791N595089N693376M531443L689825
1721.4G60333061L479481L247976L229320L324569K961039L252685L256440K441585
1737.7G85526156K787114L291189L097177L137708L556728L478229L020525K795935
1754H10690761K620279K304733K270162K225101J666665J663328J924395J680613J538276
1772.4H28584313J415074R60291J045644J388609J128197R30548J203418J163721R42945
$$ y = [490941495, 497438759, 502884984, 509249091, 517194450, 525672138, 533026159, 541287899, 551290333, 560049415, 569007337, 579080284, 587895930, 595957518, 605539501, 618124783, 628675044, 637356877, 646457493, 654666007, 663780093, 674364388, 684772611, 696556449, 706245959, 714202344, 722324491, 729397774, 735367537, 740823328, 746418417, 752111793, 756643236, 760333061, 763812542, 767060518, 770289838, 773614407, 776575446, 779828131, 783084571, 785526156, 788313270, 791604459, 794701636, 797839344, 801396072, 804874301, 807894826, 810690761, 813311040, 815615773, 817885935, 820111036, 821777701, 823441029, 825365424, 827046037, 828584313, 829999387, 830959678, 832005322, 833393931, 834522128, 835452676, 836656094, 837819815, 838762760]
1790.7H38762760J090527R42409O86884Q86559R00328M74751N66244Q54910O20663
1809.1H45786035N11229O50287M46081L32057N96643N43356M07517O45459N88059K25186
1829.5H50731909L03567M22716K29478L47554N29588L29673K56658L77118J64092J23918
1849.9H53816271L86059K64347P7486L01957L26812J22726L29912M54366J01328K8670
1870.3H56209934J81198M8160J10507K85626M4763j5736K90633K53081R8765K16722
1890.7H57723653R8348j03712Q3446J39416m2260Q2910J86324n2333m0352J35004l3676
1913.1H58176768m2081J85311L0279j22905O5029K444j57416J2219J8954j97768n6327
1935.5H57914507J00196o6400m4286K503k68638k58028J7225p6651j99854m8578j69575
$$ y = [838762760, 839853287, 840795696, 841482580, 842369139, 843269467, 843744218, 844310462, 845165372, 845786035, 846297264, 846947551, 847393632, 847725689, 848322332, 848865688, 849273205, 849918664, 850506723, 850731909, 851035476, 851458192, 851687670, 852035224, 852564812, 852894485, 853151143, 853528261, 853692353, 853816271, 854202330, 854466677, 854544163, 854846120, 855172932, 855295658, 855625570, 856079936, 856181264, 856209934, 856391132, 856439292, 856549799, 856835425, 856880188, 856864452, 857155085, 857408166, 857506931, 857723653, 857822001, 857718289, 857801735, 857941151, 857898891, 857981801, 858168125, 858115792, 858075440, 858210444, 858176768, 858134687, 858319998, 858350277, 858227372, 858292401, 858294845, 858137429, 858149648, 858168602, 857970834, 857914507, 858014703, 857948303, 857904017, 857906520, 857637882, 857379854, 857397079, 857320428, 857120574, 857071996, 856902421]
1958H56902421l06309l7431J5437k14755j28925p5042l01183k12848k8610j77264j58072
1980.4H55277419n96j91867k49505O258o3002k40922q6009j14322l19004j76490r2804
2002.8H53749156k59817j79708r6738k74539j95622l756j84476k75314j20997k22206
2023.2H51935983l09706r0778j04666k51054q8931p7307k96950j74523p271j67847
2043.6H50366950j46270k6166j75953j90199k7716j36256j97947M470n6564k06530
2064H49207819l2068J9253j38343l4034L1114j51575p8738Q0645n1796n6744Q1301
2086.5H48876834p9274j59562K4200l2127j41979L0101N6624n7578P2181J06573o6578
2108.9H48629415j7881O6220n4895p153J40369M1306L457J43051O0141l9935R9301
$$ y = [856902421, 856596112, 856558681, 856574118, 856359363, 856230438, 856155396, 855854213, 855641365, 855612755, 855435491, 855277419, 855276823, 855084956, 854835451, 854841709, 854778707, 854537785, 854451776, 854337454, 854018450, 853841960, 853749156, 853489339, 853309631, 853212893, 852938354, 852742732, 852738976, 852554500, 852279186, 852158189, 851935983, 851626277, 851535499, 851430833, 851179779, 851090848, 851013541, 850716591, 850542068, 850534797, 850366950, 850220680, 850194514, 850018561, 849828362, 849800646, 849664390, 849466443, 849470913, 849414349, 849207819, 849175751, 849195004, 849056661, 849022627, 849053741, 848902166, 848823428, 848904073, 848852277, 848795533, 848876834, 848797560, 848637998, 848662198, 848630071, 848488092, 848518193, 848574817, 848517239, 848589420, 848695993, 848629415, 848611534, 848677754, 848622859, 848615706, 848756075, 848797381, 848800838, 848943889, 849004030, 848964095, 849063396]
2131.3H49063396Q4043j5140J03295J23084n603R3341J82092M6969P8022J74403L9101
2153.8H49967003J4782J69873J26898O3062J39773P3314J4603J81436K25485P8141
2174.2H51054370Q1480J15037K9683R1374J83105O2049L4511J23084L6299m173R9540
2196.6H51906359M6492j4126J15275R0778n5015K5153R9242j3173p331Q0645J728k6345
2221.1H52249682P4148M3452j4246L9995N961n9009P868O55o2227J0133K9564o2764
2245.6H52263212l2782K6405p2659j01983N364j7941p9393p451n602n6148K5570N5135
2270H52001727n901Q1956J34170K921K2650J51991J06335Q702k8252p5042n6446R775
2294.5H52354586m7922r1255n185j4544j24633j44541j73629k44498j48118j8000j34170
$$ y = [849063396, 849147439, 849132299, 849235594, 849358678, 849353075, 849446416, 849628508, 849675477, 849753499, 849927902, 849967003, 849981785, 850151658, 850278556, 850341618, 850481391, 850554705, 850569308, 850750744, 850976229, 851054370, 851135850, 851250887, 851280570, 851371944, 851555049, 851617098, 851651609, 851774693, 851810992, 851806819, 851906359, 851952851, 851938725, 852054000, 852144778, 852089763, 852114916, 852214158, 852200985, 852193654, 852274299, 852276027, 852249682, 852323830, 852367282, 852353036, 852393031, 852398992, 852339983, 852347851, 852348506, 852286279, 852296412, 852325976, 852263212, 852230430, 852256835, 852184176, 852082193, 852087557, 852069616, 851990223, 851982772, 851977170, 851921022, 851946592, 852001727, 851995826, 852077782, 852211952, 852214873, 852237523, 852389514, 852495849, 852504551, 852476299, 852401257, 852344811, 852354586, 852306664, 852215409, 852210224, 852195680, 852071047, 851926506, 851752877, 851508379, 851360261, 851342261, 851208091]
2316.9H51208091l41058l69489k33293o4969o5446k26617j86681j8239j05381j97232
2337.3H49399686j05202k8789K40624Q08894Q80003K27213m84645p81775o35207l77357
2357.7H49143445k04443j3769L81470P53820P78079P55250Q74102Q21650O88195P49350
2378.1H54727149P84397O37233N10157L83317J75774R6738J33753N7876J1921R1136
2398.5H57609451O9260O0M7565N5730p093%k3604q7976l3736n663j21355j37865n8890
2425H57305884p1704m5478L6120r894p7904o5028q1957r1970n0127o5744j14799p2896
2449.5H56594503m9770j20759j17063p6771j03236r2148p2003j18792q7261k8074j20520
2471.9H55608106j91629j50800j62303j72973q9228m2737p2360r4175j56343j95086
$$ y = [851208091, 850867033, 850497544, 850264251, 850199282, 850133836, 849907219, 849720538, 849702299, 849596918, 849399686, 849294484, 849265695, 849506319, 850315213, 851195216, 851422429, 850937784, 850156009, 849520802, 849143445, 848939002, 848925233, 849306703, 850060523, 850838602, 851593852, 852467954, 853289604, 853977799, 854727149, 855511546, 856148779, 856658936, 857042253, 857218027, 857314765, 857448518, 857506394, 857518315, 857609451, 857678711, 857678771, 857726336, 857782066, 857774973, 857774973, 857751369, 857663393, 857629657, 857623994, 857502639, 857364774, 857305884, 857234180, 857188702, 857224822, 857214928, 857137024, 857071996, 856990039, 856898069, 856847942, 856782198, 856667399, 856594503, 856544733, 856423974, 856306911, 856230140, 856126904, 856034756, 855962753, 855843961, 855756700, 855728626, 855608106, 855416477, 855265677, 855103374, 854930401, 854841173, 854798436, 854726076, 854631901, 854475558, 854280472]
2492.3H54280472q0764k6048j41680j76251j18852j30236j28567q8930j29104j56998
2512.7H53103042j09077j11580j29759j22428j58966j66177j08064j08540j47998j18315
2533.1H51822138r4056j21355j32323j52051j85371j55985j04308j14381j46270j60754
2553.5H50455284j66356j58310j57118j76132j93894j86086j81257j89007j75893j96993
2573.9H48674238k59578k63930k38180k64883k86222k53677k56419k75254k57850l02911
2594.3H46015334l60668l21745l07739l66926l81053l65317l89576l82542l41058l37541
2614.7H42461169l32296l39210m07934m22716l58880l62814m13715m00544l97861m37319
2635.1H38587880m10735l41714l05176k95102l41237m03106l82185l53992l65436l43144
$$ y = [854280472, 854199708, 854173660, 854031980, 853855729, 853736877, 853606641, 853478074, 853389144, 853260040, 853103042, 852993965, 852882385, 852752626, 852630198, 852471232, 852305055, 852196991, 852088451, 851940453, 851822138, 851728082, 851606727, 851474404, 851322353, 851136982, 850980997, 850876689, 850762308, 850616038, 850455284, 850288928, 850130618, 849973500, 849797368, 849603474, 849417388, 849236131, 849047124, 848871231, 848674238, 848414660, 848150730, 847912550, 847647667, 847361445, 847107768, 846851349, 846576095, 846318245, 846015334, 845654666, 845332921, 845025182, 844658256, 844277203, 843911886, 843522310, 843139768, 842798710, 842461169, 842128873, 841789663, 841381729, 840959013, 840600133, 840237319, 839823604, 839423060, 839025199, 838587880, 838177145, 837835431, 837530255, 837235153, 836893916, 836490810, 836108625, 835754633, 835389197, 835046053]
2655.5H35046053l07143l22878l56257l44694l32773l50952l47972l38018l51488l17872
2675.9H31676006k66730l13938m01020m37200m36485m04775l57926l62218l88681l68715
2696.3H27938318l80039m41730m49657m18127m19915m46200m78804n03183m81665m37259
2716.7H23481739m40479m70996m75287m82977n20825n20527m82619m50194l90530l99828
2737.1H18847477n05626m99427l87192l68357m32133n00143n61893n40018m64082m97937
2757.5H14090669n54859n13196n27382n97716n91218n67675n52952n26309n85437p17819
2777.9H08356106p45594p11680p37369p03990o20067o98626q31485q15928q26299r14276
2798.3H00750792r23395r65893j061440r94205q97110r84669j121342j196205j218617
$$ y = [835046053, 834738910, 834416032, 834059775, 833715081, 833382308, 833031356, 832683384, 832345366, 831993878, 831676006, 831409276, 831095338, 830694318, 830257118, 829820633, 829415858, 829057932, 828695714, 828307033, 827938318, 827558279, 827116549, 826666892, 826248765, 825828850, 825382650, 824903846, 824400663, 823918998, 823481739, 823041260, 822570264, 822094977, 821612000, 821091175, 820570648, 820088029, 819637835, 819247305, 818847477, 818341851, 817842424, 817455232, 817086875, 816654742, 816154599, 815592706, 815052688, 814588606, 814090669, 813535810, 813022614, 812495232, 811897516, 811306298, 810738623, 810185671, 809659362, 809073925, 808356106, 807610512, 806898832, 806161463, 805457473, 804837406, 804138780, 803307295, 802491367, 801665068, 800750792, 799827397, 798861504, 797800064, 796805859, 795908749, 794924080, 793802738, 792606533, 791387916]
2816.6G91387916j174450j164019j260341j329422j358866j489103j618147j658619
2832.9G80334949j836240k148807k477050l009796l655433m091084m337967m367530
2849.3G54411042l799856k658188j504958o44624k43247m65214r97126j479447j910388
2867.6G40707994k106727j909017j678884j570404j349151j179934j277208j397192
2883.9G28239477j505375j723945j837552j856089k016246k169311k201438k281487
2900.2G12648034k370417k410650k619565k975941l279387l718794m290938m510343
2916.6F86471999m262865l726721k828121j734912p98941r775N99921J024186J552463
2934.9F76287234K187490K596557K788127K858460K533734J845538J273334Q96633
$$ y = [791387916, 790213466, 789049447, 787789106, 786459684, 785100818, 783611715, 781993568, 780334949, 778498709, 776349902, 773872852, 770863056, 767207623, 763116539, 758778572, 754411042, 750611186, 747952998, 746448040, 745803416, 745560169, 745094955, 744097829, 742618382, 740707994, 738601267, 736692250, 735013366, 733442962, 732093811, 730913877, 729636669, 728239477, 726734102, 725010157, 723172605, 721316516, 719300270, 717130959, 714929521, 712648034, 710277617, 707866967, 705247402, 702271461, 698992074, 695273280, 690982342, 686471999, 682209134, 678482413, 675654292, 673919380, 673120439, 673110664, 673710585, 674734771, 676287234, 678474724, 681071281, 683859408, 686717868, 689251602, 691097140, 692370474, 693267107]
2951.2F93267107M61817J86741K74718M51326O55115Q35836Q41737Q54492R55582J016914
2971.6F99801385J066447J111746J126945J150131J068175Q29756O72161P03693P19428
2990G08249867M77433O7055k04563m57406p38859p70867p59542q30054p50899o65009
3010.4G03617156p89702r86636j171231j344443j382351j368403j465023j509428j436233
3028.7F92163706j444876j482845j568556j783311j778841j632512j786053k042711
3045.1F78644001k095580k069771k080440k073884k113224k227664k196311k049923
3061.4F61737204k002240j936257j910090k122819k253712k100944j898527j789630
3077.7F45722985j890421k157867k301395k275347k228558k206028k212286k282560
$$ y = [693267107, 693728924, 693915665, 694190383, 694641709, 695296824, 696132660, 696974397, 697828889, 698784471, 699801385, 700867832, 701979578, 703106523, 704256654, 705324829, 706154585, 706826746, 707530439, 708249867, 708727300, 708794355, 708589792, 708132386, 707393527, 706622660, 705863118, 705033064, 704282165, 703617156, 702827454, 701840818, 700669587, 699325144, 697942793, 696574390, 695109367, 693599939, 692163706, 690718830, 689235985, 687667429, 685884118, 684105277, 682472765, 680686712, 678644001, 676548421, 674478650, 672398210, 670324326, 668211102, 665983438, 663787127, 661737204, 659734964, 657798707, 655888617, 653765798, 651512086, 649411142, 647512615, 645722985, 643832564, 641674697, 639373302, 637097955, 634869397, 632663369, 630451083, 628168523]
3094F28168523k344310k259910k227545k443910k571940k425492k376914k565861k583682
3112.4F06368959k436161k496839k685845k924263l157795l135800k971589k928734
3128.7E83631933l000677l091514l092170k978742k984941l286362l512859l402889
3145E58281779l278076l202320l123700l321529l656625l678382l534078l526032l571928
3163.4E27389109l592133l617645l603637l532052l525376l580988l583789l570556
3179.7D98782933l603399l595710l576040l601045l580093l563970l596217l568917
3196D70097542l510565l504097l453970l366530l336460l334581l308922l261626l205925
3214.3D39814866l140152l127694l146917l110140l050238l002346k933561k831221
$$ y = [628168523, 625824213, 623564303, 621336758, 618892848, 616320908, 613895416, 611518502, 608952641, 606368959, 603932798, 601435959, 598750114, 595825851, 592668056, 589532256, 586560667, 583631933, 580631256, 577539742, 574447572, 571468830, 568483889, 565197527, 561684668, 558281779, 555003703, 551801383, 548677683, 545356154, 541699529, 538021147, 534487069, 530961037, 527389109, 523796976, 520179331, 516575694, 513043642, 509518266, 505937278, 502353489, 498782933, 495179534, 491583824, 488007784, 484406739, 480826646, 477262676, 473666459, 470097542, 466586977, 463082880, 459628910, 456262380, 452925920, 449591339, 446282417, 443020791, 439814866, 436674714, 433547020, 430400103, 427289963, 424239725, 421237379, 418303818, 415472597]
3230.7D15472597k757967k780705k808929k770215k722412k655447k547860k461523
3247C93967539k454460k441406k386302k331316k329141k396613k384305k296537k240092
3265.3C72707367k166808k090066k139122k251982k275169k252996k227545k204895
3281.6C55098784k221465k201408k103120k028495k046854k121299k210856k283960
3298C37881327k243936k112806k008826k033502k207428k376586k426535k347916k222538
3316.3C17901254k178967k203435k181739k129793k187520k290368k287328k206535
3332.6C00235569k061307j931846j993179k133012k154082k148331k072095j874745
3348.9B83866972j898945k131313k164572j951486j780182j812130j818717j579285
$$ y = [415472597, 412714630, 409933925, 407124996, 404354781, 401632369, 398976922, 396429062, 393967539, 391513079, 389071673, 386685371, 384354055, 382024914, 379628301, 377243996, 374947459, 372707367, 370540559, 368450493, 366311371, 364059389, 361784220, 359531224, 357303679, 355098784, 352877319, 350675911, 348572791, 346544296, 344497442, 342376143, 340165287, 337881327, 335637391, 333524585, 331515759, 329482257, 327274829, 324898243, 322471708, 320123792, 317901254, 315722287, 313518852, 311337113, 309207320, 307019800, 304729432, 302442104, 300235569, 298174262, 296242416, 294249237, 292116225, 289962143, 287813812, 285741717, 283866972, 281968027, 279836714, 277672142, 275720656, 273940474, 272128344, 270309627, 268730342]
3365.3B68730342j397967j573026j855016j823336j511723j303464j258135j259386
3381.6B56748289j171261r25809o07074l10272l27557o66141p04647k39014N9992k71052
3402B51585454o49125l93778N3913J81764J47224O5833L3229K29210M49926N02765
3422.4B52206415O59913R72956J209885J175642J128316J302153J290291J011163R79513
3440.7B61936247J282335J595020J763999J748443J808167K023547K183646K322495
3457B76663899K462268K354682K310991K720386K983242K623767K123087K172024K596199
3475.4B99010545K952814K995104K719491K695114L034890L086596K927482L061891
3491.7C22483927L314048L489047L404260L260642L368199L310859L069848L262609
$$ y = [268730342, 267332375, 265759349, 263904333, 262080997, 260569274, 259265810, 258007675, 256748289, 255577028, 254651219, 254044145, 253733873, 253406316, 252740175, 252035528, 251796514, 251856506, 251585454, 250936329, 250542551, 250596464, 250778228, 250925452, 250991285, 251024514, 251253724, 251703650, 252206415, 252866328, 253839284, 255049169, 256224811, 257353127, 258655280, 259945571, 260956734, 261936247, 263218582, 264813602, 266577601, 268326044, 270134211, 272157758, 274341404, 276663899, 279126167, 281480849, 283791840, 286512226, 289495468, 292119235, 294242322, 296414346, 299010545, 301963359, 304958463, 307677954, 310373068, 313407958, 316494554, 319422036, 322483927, 325797975, 329287022, 332691282, 335951924, 339320123, 342630982, 345700830, 348963439]
3508C48963439L722609L965675L854484L575355L633439M036129M440307M339457L924489
3526.4C84455383L953367M260540M450918M669278M769415M607469M742771N116701
3542.7D21025842N228609M908264M655838M896790N210429N215645N234450N513430
3559D61889297N663782N419940N474359O397515O598145N883515N770087O192505O515801
3577.4E15804946O716192O811977O693780O782591P179499P102847O626010O758094
3593.7E70475936P192850P326782P311463P163882O834627O758511P249832P388294
3610F27702177P144332P068634O764352O904960P306993O526589N595565N579114O742179
3628.4F87334895P188201N895138N415976N373120N230487N157470M925490M570901
$$ y = [348963439, 352686048, 356651723, 360506207, 364081562, 367715001, 371751130, 376191437, 380530894, 384455383, 388408750, 392669290, 397120208, 401789486, 406558901, 411166370, 415909141, 421025842, 426254451, 431162715, 435818553, 440715343, 445925772, 451141417, 456375867, 461889297, 467553079, 472973019, 478447378, 484844893, 491443038, 497326553, 503096640, 509289145, 515804946, 522521138, 529333115, 536026895, 542809486, 549988985, 557091832, 563717842, 570475936, 577668786, 584995568, 592307031, 599470913, 606305540, 613064051, 620313883, 627702177, 634846509, 641915143, 648679495, 655584455, 662891448, 669418037, 675013602, 680592716, 687334895, 694523096, 700418234, 705834210, 711207330, 716437817, 721595287, 726520777, 731091678]
3644.7G31091678M560113N115569M887044L728509L429949L860057L708899L095984
3661G63477802K733112K672374K641618K608180K526283K184690J962840J820326J727700
3679.4G84354925J794756J921594K062082K238691K008557J409233J280188J366020
3695.7G98436046J309394J169801J086235J079798J097739J061141R50754P83920P69735
3714H07744563Q20100P59602O90042O32287N08010M28379N93960P84457Q49604Q00908
3734.4H14611912P09176N40912K41876k4438N7697M98295N23984K90573L36826N14924
3754.8H18301737M27306K00391K04563L37481L32594K91348K38240J62482K30014L50178
3775.2H21076334M13239L27110J66178R1910N9128J32978K37524K32935K07186K31028
$$ y = [731091678, 735651791, 740767360, 745654404, 749382913, 752812862, 756672919, 760381818, 763477802, 766210914, 768883288, 771524906, 774133086, 776659369, 778844059, 780806899, 782627225, 784354925, 786149681, 788071275, 790133357, 792372048, 794380605, 795789838, 797070026, 798436046, 799745440, 800915241, 802001476, 803081274, 804179013, 805240154, 806190908, 806974828, 807744563, 808564663, 809324265, 810014307, 810646594, 811154604, 811582983, 812176943, 812961400, 813811004, 814611912, 815321088, 815862000, 816103876, 816079438, 816137135, 816635430, 817159414, 817449987, 817786813, 818301737, 818729043, 818929434, 819133997, 819471478, 819804072, 820095420, 820333660, 820496142, 820726156, 821076334, 821489573, 821816683, 821982861, 822074771, 822133899, 822266877, 822504401, 822737336, 822944522, 823175550]
3795.6H23175550K52127J42992m0412K7716J12772R0480J70588K26796J72079J32262
3816H24462950J98841J8537k12133J2696J89662J41680Q4758J47224L20494K13325
3836.4H25578034k17795k75970m9233J45137L05295K52604j03891o29663l61741L34621
3856.8H24977398L46482J24812l9518K0564J24514k1279p3016P3016J29640J13964
3877.2H25776577M768n0842K8908P75p1585m9651l696l516l2246j8359q285r9063j15871
3903.7H25357914L4571Q1777j7643n2571L6120M2141n5850n2094K9206L3796j4722
3926.1H25422645r54L874n960L3140M8459N7339O5625K8372K6643M0770J3768p033
3950.6H25726688k7597P391Q2672P1406L9041N7399K7359J0192O9440Q7976Q6963J14978
$$ y = [823175550, 823427677, 823570669, 823530257, 823557973, 823670745, 823761225, 823931813, 824158609, 824330688, 824462950, 824661791, 824680328, 824468195, 824480891, 824670553, 824812233, 824896991, 825044215, 825364709, 825578034, 825360239, 825084269, 825035036, 825180173, 825485468, 825738072, 825634181, 825004518, 824642777, 824977398, 825323880, 825448692, 825409174, 825429738, 825554252, 825532973, 825459957, 825532973, 825662613, 825776577, 825781345, 825730503, 825759411, 825760186, 825688601, 825638950, 825635254, 825631738, 825599492, 825581133, 825572848, 825473785, 825357914, 825392485, 825474262, 825456619, 825404048, 825440168, 825482309, 825426459, 825374365, 825403571, 825437367, 825422645, 825421691, 825425565, 825419605, 825452745, 825501204, 825558543, 825624168, 825652540, 825679183, 825719953, 825733721, 825726688, 825699091, 825706482, 825789154, 825860560, 825899601, 825957000, 825984359, 825994551, 826063991, 826151967, 826238930, 826353908]
3975.1H26353908J05977L8087M3988R5546L6598q703J9551L4332M1723O0916N1558
3997.5H26873481
$$ y = [826353908, 826459885, 826497972, 826541960, 826637506, 826674104, 826665401, 826684952, 826719284, 826761007, 826821923, 826873481]
##END=$$ End of the data block
