##TITLE=$$ Begin of the data block
##JCAMP-DX=5.00 $$ ACD/SpecManager v 10.08
##SPECTROMETER/DATA SYSTEM=Alpha
##DATE=10 Apr 2014 11:00:52
##DATA TYPE=INFRARED SPECTRUM
##DATA CLASS=XYDATA
##ORIGIN=
##OWNER=
##NPOINTS=1765
##FIRSTX=399.75695801
##LASTX=3997.56933594
##MAXX=3997.56933594
##MINX=399.75695801
##MAXY=0.85867327
##MINY=0.25178501
##XFACTOR=1.0000000000
##YFACTOR=1.000000000000000e-9
##FIRSTY=0.61647940
##DELTAX=2.03957629
##XUNITS=1/CM
##YUNITS=ARBITRARY UNITS
##XYDATA=(X++(Y..Y))
399.8F16479397m27365j858473j898885l12388p79510j112937K01046k95758j418472
$$ 616479397 616052032 614193559 612294674 611982286 611202776 610089839 610290885 609995127 608576655
418.1F08576655l01778k97368q40187Q4579j16348o86228j01566r24588j764655k57015
$$ 608576655 608274877 607977509 607137322 607221901 607105553 606419325 606317759 605393171 603628516 603371501
438.5F03371501J81615m14908M05133Q7977p95246J52708J32679r80675m63605k97606
$$ 603371501 603553116 603138208 603543341 603631318 602836072 602988780 603121459 602140784 601677179 601379573
458.9F01379573r22680j0371k5987j347244q56817n14209j665771j112282n20349j365840
$$ 601379573 600456893 600446522 600420535 599073291 598216474 597702265 596036494 594924212 594403863 593038023
479.3E93038023p37787J12891q73506p07805r6798j427769j419068k62797j189828
$$ 593038023 592300236 592413127 591539621 590831816 590735018 589307249 587888181 587625384 586435556
497.7E86435556j503288n79894j255095j394987l31938r64225j451254n45799j181007
$$ 586435556 584932268 584352374 583097279 581702292 581370354 580406129 578954875 578409076 577228069
516E77228069k029121j066446j292527k038359j153648j254380k151310j311899r20057
$$ 577228069 575198948 574132502 572839975 570801616 569647968 568393588 566242278 564930379 564010322
534.4E64010322j640618j042723o66738j404941q99434m65512j473010j340508p86663
$$ 564010322 562369704 561326981 560660243 559255302 558355868 557890356 556417346 555076838 554290175
552.7E54290175j746654j874328j114368j799762k161086j444757k039194k737522
$$ 554290175 552543521 550669193 549554825 547755063 545593977 544149220 542110026 539372504
569E39372504k225876k459288k746880j842618j798510k419293j827240j767636k472519
$$ 539372504 537146628 534687340 531940460 530097842 528299332 525880039 524052799 522285163 519812644
587.4E19812644j982749j739025k492309k239763j826644k634108l004969k736032
$$ 519812644 517829895 516090870 513598561 511358798 509532154 506898046 503893077 501157045
603.7E01157045k732426j781106l22341m66884o55740P81834K207667L304392M574656
$$ 501157045 498424619 496643513 496321172 495854288 495198548 495980382 498188049 501492441 506067097
622.1E06067097M718125M101872M313052M158855L434717L703058L673494K465248
$$ 506067097 510785222 514887094 519200146 523359001 526793718 530496776 534170270 536635518
638.4E36635518K043724J770795R57608K126157L877282K643883L38018j76012J341224
$$ 536635518 538679242 540450037 541407645 543533802 547411084 550054967 550392985 550216973 551558197
656.7E51558197M857003P570029O419420L735780L536642N097449M245698L985942
$$ 551558197 556415200 563985229 570404649 574140429 577677071 582774520 587020218 591006160
673.1E91006160L893137K952814L325999L622949K566278K587378K896189J882911
$$ 591006160 594899297 597852111 601178110 604801059 607367337 609954715 612850904 614733815
689.4F14733815J848340K370358J347780R74774J868487J482069J243711K314090K229751
$$ 614733815 616582155 618952513 620300293 621275067 623143554 624625623 625869334 628183424 630413175
707.7F30413175J887023K890766K857208K079308K826929L085733K275049K800465
$$ 630413175 632300198 635190964 638048172 640127480 642954409 646040142 648315191 651115656
724F51115656L186345K189338K313554K776146J775682J729072K447783J650393J351476
$$ 651115656 654302001 656491339 658804893 661581039 663356721 665085793 667533576 669183969 670535445
742.4F70535445K227187J757384J366675K260804J883149J143217K050877K225756
$$ 670535445 672762632 674520016 675886691 678147495 680030644 681173861 683224738 685450494
758.7F85450494J388908J900077K176702J363039J640379J853108O74189M32431O28174
$$ 685450494 686839402 688739479 690916181 692279220 693919599 695772707 696446896 696879327 697507501
777.1F97507501o02484j021683l60072q43585p60078Q09074J359939J797259L591180
$$ 697507501 696905017 695883334 695523262 694679677 693919599 694728673 696088612 697885871 701477051
795.4G01477051M377663M346907N442262N633712M428565M313290M076064K567053
$$ 701477051 705854714 710201621 715643883 721277595 725706160 730019450 734095514 736662567
811.7G36662567K118051K051949M91023m62055o11842k084136l235519l088355l724277
$$ 736662567 738780618 740832567 741323590 740861535 740249693 738165557 734930038 731841683 728117406
830.1G28117406m281938l544390l613830m065215l155947k806604l229022k175152
$$ 728117406 723835468 720291078 716677248 712612033 709456086 706649482 703420460 701245308
846.4G01245308q07881o5208J860321M097044N047977O257176P630885P457018P191181
$$ 701245308 700437427 700372219 702232540 706329584 711377561 717634737 725265622 732722640 739913821
864.8G39913821P476151O416679N131065M919231L739775K098739J846969J021385
$$ 739913821 747389972 753806651 758937716 763856947 767596722 769695461 771542430 772563815
881.1G72563815n89788p90059j060784k178669j904369j178264j392246o32107O50883
$$ 772563815 771974027 771183968 770123184 767944515 766040146 764861882 763469636 762837529 763488412
899.4G63488412N42760O66499J379132O26981l17335l56137j458347k846182k939462
$$ 763488412 764031172 764697671 766076803 766703784 766386449 766030312 764571965 761725783 758786321
917.8G58786321l486276m243255l295898k237976j907766o37590M14788M4644J80483
$$ 758786321 755300045 751056790 747760892 745522916 743615150 742977560 743392348 743436992 743617475
936.2G43617475O27041L755j63436K24173n72622j419902j611769k768457m108369
$$ 743617475 744244516 744248271 744084835 744309008 743736386 742316484 740704715 737936258 733827889
954.5G33827889m594684n823731p511914q400142r827852j1849583j2767851j3262153
$$ 733827889 729233205 723409474 715897560 707497418 697669566 685819983 673052132 659789979
970.8F59789979j3821482j3033331j1535167j0662437r486854q025050p519424p130384
$$ 659789979 645968497 632935166 621399999 610737562 601250708 593225658 585706234 578575850
987.1E78575850o175638n654335n187630m110873l484666l279329k649903k521694
$$ 578575850 572400212 566745877 561558247 557447374 553962708 550683379 548033476 545511782
1003.5E45511782l231823l775537m471660n574763n988776n903662o071388n767763
$$ 545511782 542279959 538504422 534032762 528457999 522469223 516565561 510494173 504726410
1019.8E04726410n041123m843592m681885m152507l987789l924757l403366l061473
$$ 504726410 499685287 494841695 490159810 486007303 482019514 478094757 474691391 471629918
1036.1D71629918k930046k367496j986653k125918k027542j904249k049029j648068
$$ 471629918 468699872 466332376 464345723 462219805 460192263 458288014 456238985 454590917
1052.4D54590917p54625p8618P29382J550883J455605O69896l19510j867444l442585
$$ 454590917 453836292 453757674 454487056 456037939 457493544 458163440 457843930 455976486 452533901
1070.8D52533901m163742m465729m541964m104197l800511m060954m414022m936784
$$ 452533901 448370159 443904430 439362466 435258269 431457758 427396804 422982782 418045998
1087.1D18045998n619198n558044m519999l026366j229048M28110J211465J432716
$$ 418045998 412426800 406868756 402348757 399322391 398093343 398521453 399732918 401165634
1103.4D01165634J463682R95636K81870l21775j317621k859920m598469o526678p482142
$$ 401165634 402629316 403624952 403906822 403585047 402267426 399407506 394809037 388282359 380800217
1121.8C80800217n555003j876534M53026Q67188K01225p40767m01646J307667K727985
$$ 380800217 375245214 373368680 373821706 374688894 374890119 374149352 373747706 375055373 377783358
1140.1C77783358L240377L209829K661914J994788J754314J675278J664400K124191
$$ 377783358 381023735 384233564 386895478 388890266 390644580 392319858 393984258 396108449
1156.4C96108449K875238L682256M893303O375134P640719Q714140R416580R360284
$$ 396108449 398983687 402665943 407559246 413934380 421575099 430289239 439705819 449066103
1172.7D49066103R008228Q694917Q049041P266850O586253N443782L823846K342374
$$ 449066103 458074331 466769248 474818289 482085139 488671392 494115174 497939020 500281394
1189.1E00281394Q70168m70042q60274m03464N05030K039433L612399M359960M553199
$$ 500281394 501151562 500681520 499821246 499417782 499922812 501962245 505574644 509934604 514487803
1207.4E14487803M390001L623426K846480K531647K204180J945496K106189K214671
$$ 514487803 518877804 522501230 525347710 527879357 530083537 532029033 534135222 536349893
1223.7E36349893K274692K754330L203154L367662L783226M173875M141748M223526
$$ 536349893 538624585 541378915 544582069 547949731 551732957 555906832 560048580 564272106
1240.1E64272106M269004L790199L336907L024339K342046J763642J599550J267552
$$ 564272106 568541110 572331309 575668216 578692555 581034601 582798243 584397793 585665345
1256.4E85665345J066923J472831J824677K061129K736091L310025L511429L954410
$$ 585665345 586732268 588205099 590029776 592090905 594826996 598137021 601648450 605602860
1272.7F05602860M366339M380524M621684N041361N092502N274177N718886N734027
$$ 605602860 609969199 614349723 618971407 624012768 629105270 634379447 640098333 645832360
1289F45832360N607366N704522N415321M921675M780709M401863L731847L448069L074527
$$ 645832360 651439726 657144248 662559569 667481244 672261953 676663816 680395663 683843732 686918259
1307.4F86918259K343833J999140J752317J179933J057744J259685J114845J233161
$$ 686918259 689262092 691261232 693013549 694193482 695251226 696510911 697625756 698858917
1323.7F98858917J644969J479745J145184J114726P16805J98126J72198J7822j87099
$$ 698858917 700503886 701983631 703128815 704243541 704960346 705158472 705330670 705348492 705161393
1342G05161393K60532O04212M37379M72486M95910N7817j80066j63674n92768j151741
$$ 705161393 705421925 706026137 706463516 706936002 707431912 707489729 707309663 707145989 706553221 705401480
1362.4G05401480j353204j599789j756310j406670j405358k020657k353430l382146
$$ 705401480 704048276 702448487 700692177 699285507 697880149 695859492 693506062 690123916
1378.7F90123916n754173o450236l081799J593411L130377J719296J59800r20475j598358
$$ 690123916 684369743 677919507 674837708 676431119 679561496 681280792 681440592 680520117 678921759
1397.1F78921759k511263k949536k772152l125012l173649k518595k234935k079010
$$ 678921759 676410496 673460960 670688808 667563796 664390147 661871552 659636617 657557607
1413.4F57557607j401186j067221j420260j007616m90308o60718o09100m80175o44266
$$ 657557607 656156421 655089200 653668940 652661324 652171016 651510298 650901198 650421023 649776757
1431.8F49776757m32015k3663q0824k9564M90189P84934J111447J988531K716899L017485
$$ 649776757 649344742 649321079 649240255 649210691 649700880 650485814 651597261 653585792 656302691 659320176
1452.2F59320176L871202O330609Q377374O822765O249308P266581P675946P032514
$$ 659320176 663191378 669521987 677899361 684722126 690971434 698238015 705913961 712946475
1468.5G12946475P351279R086013Q776307O296992M761159M149437L319741K074063
$$ 712946475 720297754 729383767 738160074 744457066 749218225 753367662 756687403 758761466
1484.8G58761466J427650N72383r36567j225531j305163k523423l223240k819419k564967
$$ 758761466 760189116 760761499 759824932 758599401 757294238 754770815 751547575 748728156 746163189
1503.2G46163189l266275n937218o137252m560649l861905l646671l547192k701879
$$ 746163189 742896914 736959696 730822444 726261795 722399890 718753219 715206027 712504148
1519.5G12504148k566695k728939k134204k115428j988948j512527j440883j239776
$$ 712504148 709937453 707208514 705074310 702958882 700969934 699457407 698016524 696776748
1535.8F96776748n56946l49581j004577p60555q1122K19345M32491R29535J208126
$$ 696776748 696219802 695870221 694865644 694105089 694023967 694243312 694675803 695605338 696813464
1554.1F96813464J103759R46105m2975n81980n31733q37207k017140l333152l194749
$$ 696813464 697917223 698863328 698820353 698238373 697706640 696869433 694852293 691519141 688324392
1572.5F88324392l782272o237507o608487o252527p172048p706463q192182q737504
$$ 688324392 684542120 678304613 671696126 665443599 658271551 650565088 642372906 633635402
1588.8F33635402q873761r042621r488225r343803r039104r279131r323240r002864
$$ 633635402 624761641 615719020 606230795 596886992 587847888 578568757 569245517 560242653
1605.1E60242653r096801r393633q945584q117557q608818r938240p943183o464958
$$ 560242653 551145852 541752219 532806635 524689078 516080260 506142020 498198837 491733879
1621.4D91733879p147133o703407n701572m734158l114939k070874j709163n83917
$$ 491733879 484586746 477883339 472181767 467447609 464332670 462261796 460552633 459968716
1637.8D59968716O32554J630068K592444L935844M877329M130274N285382Q275330
$$ 459968716 460601270 462231338 464823782 468759626 473636955 477767229 483052611 491327941
1654.1D91327941O458790N445867O403208Q026421Q554459P381797Q256256R993136
$$ 491327941 497786731 503232598 509635806 517662227 526216686 533598483 541854739 551847875
1670.4E51847875Q755267Q944869J0066330Q834183Q087218R569526J2511432J0503531
$$ 551847875 560603142 569548011 579614341 588448524 596535742 606105268 618616700 629120231
1686.7F29120231Q653998R053290Q174479R102166J0591149J0423839J1748076R653389
$$ 629120231 637774229 646827519 655001998 664104164 674695313 685119152 696867228 706520617
1703G06520617P985473Q182227P089317N926132N415798N590379N664944M514933L737331
$$ 706520617 714506090 722688317 729777634 735703766 741119564 746709943 752374887 756889820 760627151
1721.4G60627151L523767L246843L199816L308892K973080L256142L235936K437711
$$ 760627151 764150918 767397761 770597577 773906469 776879549 780135691 783371627 785809338
1737.7G85809338K815187L294289L053725L125131L582835L483296L013491K796710
$$ 785809338 788624525 791918814 794972539 798097670 801680505 805163801 808177292 810974002
1754H10974002K610624K300620K285540K239644J680792J673460J919567J675547J526475
$$ 810974002 813584626 815885246 818170786 820410430 822091222 823764682 825684249 827359796 828886271
1772.4H28886271J386821R47952J059175J405179J152456R73344J215577J144707R29773
$$ 828886271 830273092 831221044 832280219 833685398 834837854 835811198 837026775 838171482 839101255
1790.7H39101255J052976Q84115O69897Q97407R13740N13970N93365Q34465O07371
$$ 839101255 840154231 841038346 841708243 842605650 843519390 844033360 844626725 845461190 846068561
1809.1H46068561N26369O56426M57644L59118O04749N31018L99470O33120N77271K32995
$$ 846068561 846594930 847251356 847709000 848068118 848672867 849203885 849603355 850236475 850813746 851046741
1829.5H51046741K93732L91423K03133L26812N35250L73662K83956L33190J32620J58191
$$ 851046741 851340473 851731896 851935029 852261841 852797091 853170753 853454709 853787899 853920519 854078710
1849.9H54078710M06861K42770Q6546L29733L08275R3401L40521M75407J13964M3153
$$ 854078710 854485571 854728341 854814887 855144620 855452895 855546296 855886817 856362224 856476188 856519341
1870.3H56519341J64748K2232J20402L10421O1452k2233K52188K24352R6321K11894
$$ 856519341 856684089 856706321 856826723 857137144 857198596 857176363 857428551 857652903 857749224 857961118
1890.7H57961118Q4937j04487J24514J75536o2824P1645K04444l7014j4127J48118
$$ 857961118 858046055 857941568 858066082 858241618 858178794 858250439 858454883 858417869 858403742 858551860
1911.1H58551860k5988j7702J65105p928j02043P8678l3975j82688J8299L4332j72973
$$ 858551860 858525872 858508170 858673275 858665347 858563304 858641982 858608007 858425319 858443618 858477950 858304977
1933.5H58304977m3749Q3923q3983n0068M411k56479k38359K2650r4712k21908o9082
$$ 858304977 858261228 858345151 858261168 858211100 858215511 857959032 857720673 857743323 857648611 857426703 857357621
1955.9H57357621j76132k93791l8504J78k06410j02222p7785l05950j77145o259j90913
$$ 857357621 857181489 856887698 856849194 856849372 856642962 856540740 856462955 856157005 855979860 855973601 855782688
1978.4H55782688j73688j7047j99199k40445L815r4474k82287j01984r6857k76089
$$ 855782688 855609000 855591953 855392754 855152309 855156124 855061650 854779363 854677379 854580522 854304433
1998.8H54304433j32024q0109k64585j80364r7215k70128j74880J4126k05636k98262
$$ 854304433 854172409 854092300 853827715 853647351 853550136 853280008 853105128 853119254 852913618 852615356
2019.2H52615356j07348k16424l13044o4075p2240k56241j16467p8559k79069j88887
$$ 852615356 852508008 852291584 851978540 851914465 851842225 851585984 851469517 851390958 851111889 850923002
2039.6H50923002n9188k00271j30356j7166j81973j56104J4603j27971j93298P152
$$ 850923002 850863814 850663543 850533187 850516021 850334048 850177944 850192547 850064576 849871278 849878430
2060H49878430o6638k05457k3365J6570j31666k3485J3292j75237r5606N6445n6088
$$ 849878430 849811792 849606335 849582970 849599540 849467874 849444389 849457681 849282444 849186838 849243283 849187195
2082.4H49187195l6418P2956j10924j60158N0426L57j09255M2498M3929p3851N8115
$$ 849187195 849150777 849223733 849112809 848952651 849003077 849003434 848894179 848936677 848980606 848906755 848964870
2104.8H48964870Q9347q1002j2815Q4221m6432J848J34229J3650r358J51098P1466
$$ 848964870 849054217 848973215 848960400 849044621 848998189 849000037 849134266 849147916 849138558 849289656 849361122
2127.3H49361122k6286J22964J07527J431R1254P9215l6120R5784K07603O1155N9843
$$ 849361122 849334836 849457800 849565327 849566758 849658012 849737227 849701107 849796891 850004494 850065649 850125492
2149.7H50125492J54554M6134K8372J52290J08183P9929J73808R5486l636J28389J77502
$$ 850125492 850280046 850326180 850354552 850506842 850615025 850694954 850868762 850964248 850960612 851089001 851266503
2172.1H51266503R0182J63675J70767J2278N5552J67847O2584K6346J24454N5254k921
$$ 851266503 851356685 851520360 851691127 851703405 851758957 851926804 851989388 852015734 852140188 852195442 852192521
2194.6H52192521R8705P2122P808J07289Q0645n3525J4841P9751Q881N7519J00910
$$ 852192521 852291226 852363348 852371156 852478445 852559090 852505565 852520406 852600157 852609038 852666557 852767467
2217H52767467l0875l3498Q5950K0683o1095o675j3769k3663N2035J3530n5671J7465
$$ 852767467 852736592 852703094 852789044 852809727 852748632 852741957 852728188 852704525 852756560 852770090 852714419 852731884
2241.5H52731884K4199q2552m9651K5451o1989q0526J1862m0114q3924J371r179m3154
$$ 852731884 852756083 852673531 852623880 852649331 852587342 852506816 852518678 852478564 852394640 852396011 852386832 852343678
2265.9H52343678M1783O3300R478O7830R4354J79N4001J66774Q4460k1219l4869p4565
$$ 852343678 852385461 852448761 852458239 852526069 852620423 852620602 852674603 852841377 852925837 852904618 852869749 852795184
2290.4H52795184n9069K8551j5139q7500k1875j0550j15454j46687j73092k22027j17958
$$ 852795184 852736115 852764666 852749527 852662027 852640152 852629602 852514148 852367461 852194369 851972342 851854384
2312.9H51854384n5432k07603k98560k50876k36332j42217l4690j36435j47104N305
$$ 851854384 851798952 851591349 851292789 851041913 850805581 850663364 850628674 850492239 850345135 850350440
2333.3H50350440r4772k10404j13189l2008K27272P55132Q07762J72019n06819p35104
$$ 850350440 850255668 850045264 849932075 849900067 850127339 850882471 851690233 851862252 851355433 850620329
2353.6H50620329n50866l15904j82391p6711L45290Q27134P87139O89744Q65222Q35597
$$ 850620329 850069463 849753559 849571168 849494457 849839747 850666881 851454020 852143764 853008986 853844583
2374H53844583O81639P39991P58946O18399N19573L70920J33455O7234J09434L3677
$$ 853844583 854526222 855266213 856025159 856643558 857163131 857534051 857667506 857734740 857844174 857877851
2394.4H57877851K3067J27315Q6367O974N0664K5511n5075k0564M709m0769l3796n0783
$$ 857877851 857900918 858028233 858114600 858121574 858172238 858197749 858142674 858122110 858126819 858086050 858052254 858001471
2418.9H58001471j39654j17481n4896q9228m6134N2273O020o6518n3525q9228j25349
$$ 858001471 857861817 857744336 857689440 857600212 857554078 857606351 857612371 857545853 857492328 857403100 857277751
2441.3H57277751o1750l4273o7890n3942p8321j48653j09017o6340j02401r4652r6858
$$ 857277751 857216001 857181728 857113838 857059896 856981575 856832922 856723905 856657565 856555164 856460512 856363654
2463.8H56363654j44541j03176m8995j07884j46449j22547j41799j50443j09374j11163
$$ 856363654 856219113 856115937 856066942 855959058 855812609 855690062 855548263 855397820 855288446 855177283
2484.2H55177283j12176o6340j12056k00212j41979o3419r4116j14500j25528j64628
$$ 855177283 855065107 854998767 854886711 854686499 854544520 854481101 854386985 854272485 854146957 853982329
2504.6H53982329j40011r7692j30355j27912q3148j15812j41800j30236j48177j44541
$$ 853982329 853842318 853744626 853614271 853486359 853403211 853287399 853145599 853015363 852867186 852722645
2525H52722645j16289j37508j91569j65284r3102p7307r2566j35005j70887j42991
$$ 852722645 852606356 852468848 852277279 852111995 852018893 851941586 851849020 851714015 851543128 851400137
2545.4H51400137j19984j57416j86622j63675j47104j56164j59621j58012j47939j34230
$$ 851400137 851280153 851122737 850936115 850772440 850625336 850469172 850309551 850151539 850003600 849869370
2565.8H49869370j64866k24233k23875j92225k20418k56240k57075k79486k88785k52127
$$ 849869370 849704504 849480271 849256396 849064171 848843753 848587513 848330438 848050952 847762167 847510040
2586.2H47510040k66195k97129k58386k69890l49044l58642l30984l43859l62456l77715
$$ 847510040 847243845 846946716 846688330 846418440 846069396 845710754 845379770 845035911 844673455 844295740
2606.6H44295740l83317l41118l29375l82960l93450l59178l80814m03404l53456l72231
$$ 844295740 843912423 843571305 843241930 842858970 842465520 842106342 841725528 841322124 840968668 840596437
2626.9H40596437m51147m06444l52562m01854l89815l19182l19243l30865l37005l84450
$$ 840596437 840145290 839738846 839386284 838984430 838594615 838275433 837956190 837625325 837288320 836903870
2647.3H36903870m00603l78728l76165l43442l04460l45945l77596l27229k95341l20554
$$ 836903870 836503267 836124539 835748374 835404932 835100472 834754527 834376931 834049702 833754361 833433807
2667.7H33433807l27110l27289l65794l37422k63214l06308l92914m21286m44889m22418
$$ 833433807 833106697 832779408 832413614 832076192 831812978 831506670 831113756 830692470 830247581 829825163
2688.1H29825163l52144l63410m05669l92735m07517m44114m28558m15623m22716m25100
$$ 829825163 829473019 829109609 828703940 828311205 827903688 827459574 827031016 826615393 826192677 825767577
2708.5H25767577m80414n41091m91976m09484m15504m48943m49538m77969n44608n47409
$$ 825767577 825287163 824746072 824254096 823844612 823429108 822980165 822530627 822052658 821508050 820960641
2728.9H20960641m81010m25100l80695m06325n02109m84109m00722m14789m02868m07159
$$ 820960641 820479631 820054531 819673836 819267511 818765402 818281293 817880571 817465782 817062914 816655755
2749.3H16655755n49614o01769n04494m75585n06043m93289n39124o24299n92291n40078
$$ 816655755 816106141 815504372 814999878 814524293 814018250 813524961 812985837 812361538 811769247 811229169
2769.7H11229169n68807n84066o14106p06971p31885p05183p29561p10726o51657p23481
$$ 811229169 810660362 810076296 809462190 808755219 808023334 807318151 806588590 805877864 805226207 804502726
2790.1H04502726q36552q27729q29101q82089q94368r50753j042903r84371r07361
$$ 804502726 803666174 802838445 802009344 801127255 800232887 799282134 798239231 797254860 796347499
2808.5G96347499j013935j130819j167655j200199j179993j169801j248360j300752
$$ 796347499 795333564 794202745 793035090 791834891 790654898 789485097 788236737 786935985
2824.8G86935985j347721j508891j643419j662434j811027k121747k480626l027320
$$ 786935985 785588264 784079373 782435954 780773520 778962493 776840746 774360120 771332800
2841.1G71332800l652036m070997m330456m383922l825009k669453j483858o17504
$$ 771332800 767680764 763609767 759279311 754895389 751070380 748400927 746917069 746299565
2857.4G46299565k48075m85420j007616j468838j899063k118290j920283j675427j563489
$$ 746299565 746051490 745566070 744558454 743089616 741190553 739072263 737151980 735476553 733913064
2875.8G33913064j354098j203597j287818j362681j470864j729190j870096j885295
$$ 733913064 732558966 731355369 730067551 728704870 727234006 725504816 723634720 721749425
2892.1G21749425j988173k098620k159357k260089k348005k425254k675414l028154
$$ 721749425 719761252 717662632 715503275 713243186 710895181 708469927 705794513 702766359
2908.4G02766359l295124l688335m244030m507005m308641l748953k822161j749873
$$ 702766359 699471235 695782900 691538870 687031865 682723224 678974271 676152110 674402237
2924.7F74402237q00729L1650O42300J040399J547038K151132K555609K776205K848506
$$ 674402237 673601508 673633158 674275458 675315857 676862895 679014027 681569636 684345841 687194347
2943.1F87194347K525688J869499J320720R36747M58181J61230K73049M45902O29127
$$ 687194347 689720035 691589534 692910254 693847001 694305182 694466412 694739461 695185363 695814490
2961.4F95814490Q28982Q74877R12010R98438J015186J044571J115025J145958J136542
$$ 695814490 696643472 697518349 698430359 699428797 700443983 701488554 702603579 703749537 704886079
2979.8G04886079J035690Q13604O70373P36713P79093N12600Q1956j98245m71711p37131
$$ 704886079 705921769 706735373 707405746 708142459 708921552 709434152 709516108 709317863 708846152 708109021
3000.2G08109021p53760p90298q84950p52688o22272p64609j000881j199543j346171
$$ 708109021 707355261 706564963 705680013 704927325 704305053 703540444 702539563 701340020 699993849
3018.5F99993849j351476j328528j430452j505613j472771j472414j442015j519740
$$ 699993849 698642373 697313845 695883393 694377780 692905009 691432595 689990580 688470840
3034.9F88470840j810312j822471j620591j737118k013564k102137k099335k128243
$$ 688470840 686660528 684838057 683217466 681480348 679466784 677364647 675265312 673137069
3051.2F73137069k110064k094448k160966k166331k075553k022505j961887j949370
$$ 673137069 671027005 668932557 666771591 664605260 662529707 660507202 658545315 656595945
3067.5F56595945k127289k221704k060831j879334j826406j939713k142132k214551
$$ 656595945 654468656 652246952 650186121 648306787 646480381 644540668 642398536 640183985
3083.8F40183985k172827k181232k232075k265811k294123k314151k255261k241253
$$ 640183985 638011158 635829926 633597851 631332040 629037917 626723766 624468505 622227252
3100.1F22227252k419770k526522k415836k385616k561748k622664k493799k492010
$$ 622227252 619807482 617280960 614865124 612479508 609917760 607295096 604801297 602309287
3116.4F02309287k669156k931118l151417l122449k972841k938688k992689l079296
$$ 602309287 599640131 596709013 593557596 590435147 587462306 584523618 581530929 578451633
3132.8E78451633l099858k951205k923846l272295l537834l433585l323078l243506
$$ 578451633 575351775 572400570 569476724 566204429 562666595 559233010 555909932 552666426
3149.1E52666426l124059l277957l594756l642023l564238l562391l550768l563106
$$ 552666426 549542367 546264410 542669654 539027631 535463393 531901002 528350234 524787128
3165.4E24787128l600240l574312l536283l577173l620208l606796l564954l536969
$$ 524787128 521186888 517612576 514076293 510499120 506878912 503272116 499707162 496170193
3181.7D96170193l552526l588110l600091l585607l591925l580779l513396l476649
$$ 496170193 492617667 489029557 485429466 481843859 478251934 474671155 471157759 467681110
3198D67681110l481239l428489l363639l340900l339440l326565l279984l239989l189355
$$ 467681110 464199871 460771382 457407743 454066843 450727403 447400838 444120854 440880865 437691510
3216.4D37691510l145665l126890l074616l027528l001064k911211k802103k782703
$$ 437691510 434545845 431418955 428344339 425316811 422315747 419404536 416602433 413819730
3232.7D13819730k846896k875477k788306k655476k554089k498865k501726k539694
$$ 413819730 410972834 408097357 405309051 402653575 400099486 397600621 395098895 392559201
3249C92559201k490879k366513k297729k344459k424389k377481k282977k259403k195567
$$ 392559201 390068322 387701809 385404080 383059621 380635232 378257751 375974774 373715371 371519804
3267.4C71519804k086759k120345k228022k259821k281546k261550k178788k160787
$$ 371519804 369433045 367312700 365084678 362824857 360543311 358281761 356102973 353942186
3283.7C53942186k178282k127618k053171k025217k067417k164662k262830k254725
$$ 353942186 351763904 349636286 347583115 345557898 343490481 341325819 339062989 336808264
3300C36808264k110600j993090k052575k227456k378881k413899k331048k251148k197176
$$ 336808264 334697664 332704574 330651999 328424543 326045662 323631763 321300715 319049567 316852391
3318.4C16852391k157063k148866k144903k218127k309800k265930k179146k077549
$$ 316852391 314695328 312546462 310401559 308183432 305873632 303607702 301428556 299351007
3334.7B99351007j919806j916945k108187k200126k158761k064944j906454j905680
$$ 299351007 297431201 295514256 293406069 291205943 289047182 286982238 285075784 283170104
3351B83170104k086043k144456j998246j816899j773595j779139j571596j372576j537949
$$ 283170104 281084061 278939605 276941359 275124460 273350865 271571726 270000130 268627554 267089605
3369.3B67089605j829594j828224j556932j327068j196057j159042j138836r91017
$$ 267089605 265260011 263431787 261874855 260547787 259351730 258192688 257053852 256062835
3385.7B56062835o99758l57539l50594o84410o82235j86712Q7500k79903o82354m41820
$$ 256062835 255363077 255005538 254654944 253970534 253288299 253101587 253189087 252909184 252226830 251785010
3406.1B51785010M7773K50072K14487N9843O944K28882M44561N00768O71685R79930
$$ 251785010 251832783 252082855 252297342 252357185 252364129 252593011 253037572 253538340 254210025 255189955
3426.5B55189955J200855J177877J198828J394779J277625R25780R49532J308262J646161
$$ 255189955 256390810 257568687 258767515 260162294 261439919 262365699 263315231 264623493 266269654
3444.8B66269654J805574J720965J756161K006650K170295K292126K449572K375841
$$ 266269654 268075228 269796193 271552354 273559004 275729299 278021425 280470997 282846838
3461.1B82846838K342195K754479L008515K593189K074004K146899K540797K909929
$$ 282846838 285189033 287943512 290952027 293545216 295619220 297766119 300306916 303216845
3477.4C03216845L024161K736479K659529L020108L129721K971738L060103L279090
$$ 303216845 306241006 308977485 311637014 314657122 317786843 320758581 323818684 327097774
3493.8C27097774L418028L340751L272086L411323L336340L092528L282457L738255
$$ 327097774 330515802 333856553 337128639 340539962 343876302 346968830 350251287 353989542
3510.1C53989542L964245L837019L614366L700644M001737M349797M321158L954590
$$ 353989542 357953787 361790806 365405172 369105816 373107553 377457350 381778508 385733098
3526.4C85733098L943622M227340M464865M731983M822403M604399M710764N079061
$$ 385733098 389676720 393904060 398368925 403100908 407923311 412527710 417238474 422317535
3542.7D22317535N174994M904777M733562M951805N176962N147010N208641N537599
$$ 422317535 427492529 432397306 437130868 442082673 447259635 452406645 457615286 463152885
3559D63152885N651534N368561N490034O452173O619901N890161N753904O184936O543815
$$ 463152885 468804419 474172980 479663014 486115187 492735088 498625249 504379153 510564089 517107904
3577.4E17107904O723762O812095O723106O832838P209897P021189O536424O781161
$$ 517107904 523831666 530643761 537366867 544199705 551409602 558430791 564967215 571748376
3593.7E71748376P239640P327556P330001P212400O865144O738186P188260P349074
$$ 571748376 578988016 586315572 593645573 600857973 607723117 614461303 621649563 628998637
3610F28998637P151306P106900O792307O884933P232010O450832N598306N639852O746292
$$ 628998637 636149943 643256843 650049150 656934083 664166093 670616925 676215231 681855083 688601375
3628.4F88601375P088124N847514N440652N362452N165636N073071M846870M554332
$$ 688601375 695689499 701537013 706977665 712340117 717505753 722578824 727425694 731980026
3644.7G31980026M636049N177200M824042L646791L410161L907025L741324L071308
$$ 731980026 736616075 741793275 746617317 750264108 753674269 757581294 761322618 764393926
3661G64393926K717614K695024K651930K566337K476156K127171J882553J833439J747548
$$ 764393926 767111540 769806564 772458494 775024831 777500987 779628158 781510711 783344150 785091698
3679.4G85091698J733661J886308K099514K285838K021194J436948J327038J385987
$$ 785091698 786825359 788711667 790811181 793097019 795118213 796555161 797882199 799268186
3695.7G99268186J281738J109779J086951J138269J108468J015365Q87692P88748Q28863
$$ 799268186 800549924 801659703 802746654 803884923 804993391 806008756 806896448 807685196 808514059
3714H08514059Q49366P40766O39320O57022O09517M71532N53608P11501P53760O85334
$$ 808514059 809363425 810104191 810743511 811400533 812010050 812481582 813035190 813746691 814500451 815185785
3734.4H15185785O30200N48780L26038L4630K5153M97758N77152L03984L18289N01573
$$ 815185785 815815985 816364765 816690803 816725433 816750586 817248344 817825496 818129480 818447769 818949342
3754.8H18949342M02570J86741K36034L93629L43323K40386K51472K54571K62082L11196
$$ 818949342 819351912 819538653 819774687 820168316 820511639 820752025 821003497 821258068 821520150 821831346
3775.2H21831346L72231K80261R5307N3347R9182K25782L02374K15173J53184K07544
$$ 821831346 822203577 822483838 822579145 822632492 822731674 822957456 823259830 823475003 823628187 823835731
3795.6H23835731J97649L7193o1870R3878J25765N1976J65999K53260J93655J43945
$$ 823835731 824033380 824070573 824008703 824102581 824228346 824280322 824446321 824699581 824893236 825037181
3816H25037181K22683O7950j53661L5822J71721J12117O4909J55270L06010J40012
$$ 825037181 825259864 825327814 825174153 825209975 825381696 825493813 825558722 825713992 826020002 826160014
3836.4H26160014k18809j71602K1577J18971J99437J71840o4432n69463m11511L04819
$$ 826160014 825941205 825769603 825791180 825910151 826109588 826281428 826216996 825647533 825236022 825540841
3856.8H25540841L39329J07646k9147K6703Q5652o2943j06751L7789J20163J65284
$$ 825540841 825880170 825987816 825958669 825985372 826071024 826008081 825901330 825939119 826059282 826224566
3877.2H26224566Q2671P570J18256P1406q6844q4102p4327m9293N6028Q6427k4259
$$ 826224566 826307237 826314807 826433063 826504469 826417625 826333523 826259196 826209903 826265931 826352358 826328099
3899.6H26328099j65045j35899J1563L8326J192J9610O4373O2466r775o0201l3915
$$ 826328099 826163054 826027155 826038718 826077044 826078236 826097846 826162219 826224685 826214910 826154709 826120794
3922.1H26120794J1325j2338o3301m6849J3292N1141L9518K5749K2650j848J8477O2764
$$ 826120794 826132119 826119781 826056480 826009631 826022923 826074064 826113582 826139331 826161981 826160133 826178610 826241374
3946.5H26241374N0485L6001L7015K9981N7995Q7858Q0168O7472K0743j5974N1081
$$ 826241374 826291859 826327860 826364875 826394856 826452851 826540709 826620877 826688349 826709092 826693118 826744199
3969H26744199J08778L5703k2351M9412J21176J40906J22845K9862m6254l5703J1027
$$ 826744199 826852977 826888680 826866329 826915741 827036917 827177823 827300668 827330530 827284276 827248573 827259600
3991.4H27259600Q1062J32859R6262
$$ 827259600 827340662 827473521 827569783
3997.5H27569783
$$ 827569783
##END=$$ End of the data block
