##TITLE=$$ Begin of the data block
##JCAMP-DX=5.00 $$ ACD/SpecManager v 10.08
##SPECTROMETER/DATA SYSTEM=Alpha
##DATE=10 Apr 2014 11:00:52
##DATA TYPE=INFRARED SPECTRUM
##DATA CLASS=XYDATA
##ORIGIN=
##OWNER=
##NPOINTS=1765
##FIRSTX=399.75695801
##LASTX=3997.56933594
##MAXX=3997.56933594
##MINX=399.75695801
##MAXY=0.84436488
##MINY=0.17538957
##XFACTOR=1.0000000000
##YFACTOR=1.000000000000000e-9
##FIRSTY=0.56624943
##DELTAX=2.03957629
##XUNITS=1/CM
##YUNITS=ARBITRARY UNITS
##XYDATA=(X++(Y..Y))
399.8E66249430j670360k426684k201915j344323j175404j596510j362622k16901L92735
$$ 566249430 564579070 562152386 559950471 558606148 557430744 555834234 554471612 554254711 554647446
418.1E54647446p72298j394927r28045q81135q18074m00245l80039j163542j851619
$$ 554647446 553875148 552480221 551552176 550671041 549852967 549452722 549072683 547909141 546057522
436.5E46057522r80496K43127p4029n32031j10984l33368r11415n17488R7990n18679
$$ 546057522 545077026 545320153 545246124 544714093 544603109 544269741 543358326 542840838 542938828 542420149
456.9E42420149j493097j089155n12660r22620j409829j080990r87052j694203j719832
$$ 542420149 540927052 539837897 539325237 538402617 536992788 535911798 534924746 533230543 531510711
475.2E31510711j063049q52347r45866n89192k14397o71804j227200j147867r53972
$$ 531510711 530447662 529595315 528649449 528060257 527845860 527174056 525946856 524798989 523845017
493.6E23845017j275957j485467j013398q14974j214445j183748q92937j057327j328886
$$ 523845017 522569060 521083593 520070195 519255221 518040776 516857028 515964091 514906764 513577878
511.9E13577878j348316j263321j440525j780152j661122j425981j753748k103805
$$ 513577878 512229562 510966241 509525716 507745564 506084442 504658461 502904713 500800908
528.3E00800908j766503j369894j451880j542836j287550j076817j140356r81152o37204
$$ 500800908 499034405 497664511 496212631 494669795 493382245 492305428 491165072 490183920 489546716
546.6D89546716q55654j422912j557171j410008j514763j758873j756102j849294k457857
$$ 489546716 488691062 487268150 485710979 484300971 482786208 481027335 479271233 477421939 474964082
565D74964082k915114k775848k690524k798795k678156k546311k604097k618998k457351
$$ 474964082 472048968 469273120 466582596 463783801 461105645 458559334 455955237 453336239 450878888
583.3D50878888k317190k445757k741069k800733k658128k689720k807974k970279
$$ 450878888 448561698 446115941 443374872 440574139 437916011 435226291 432418317 429448038
599.6D29448038l350556l595233k995938j737743p82639o40064o04839K46466J881778
$$ 429448038 426097482 422502249 419506311 417768568 416985929 416345865 415741026 415987492 417869270
618D17869270L453165M357189M640430M453719M281044M266441M135459L821433L413230
$$ 417869270 421322435 425679624 430320054 434773773 439054817 443321258 447456717 451278150 454691380
636.3D54691380K808094J922936J003533J032233K414525L441542K646983N95778p30246
$$ 454691380 457499474 459422410 460425943 461458176 463872701 467314243 469961226 470557004 469826758
654.7D69826758J107037N365252P612020O456703M379541M097700N291373L987193
$$ 469826758 470933795 476299047 483911067 490367770 494747311 498845011 504136384 508123577
671E08123577L177583L481090L283441K924263K830744K783716K495408K101183K062678
$$ 508123577 511301160 514782250 518065691 520989954 523820698 526604414 529099822 531201005 533263683
689.4E33263683K041877J590013J281023J340568J317024J229644J569212K112210
$$ 533263683 535305560 536895573 538176596 539517164 540834188 542063832 543633044 545745254
705.7E45745254K232909K123475K376079K789259K790928K644956K811849K990425
$$ 545745254 547978163 550101638 552477717 555266976 558057904 560702860 563514709 566505134
722E66505134K818287K705693K761721K591789K232134K091945K216577K191782K006293
$$ 566505134 569323421 572029114 574790835 577382624 579614758 581706703 583923280 586115062 588121355
740.4E88121355K048254K240061K170623K052068K151192K264142K189397K137483
$$ 588121355 590169609 592409670 594580293 596632361 598783553 601047695 603237092 605374575
756.7F05374575K324223K372384K128542K007663K110541J992166J583218J191318
$$ 605374575 607698798 610071182 612199724 614207387 616317928 618310094 619893312 621084630
773F21084630Q43108K67685m42982q26180q86738q07703m42982M06206J591265K839208
$$ 621084630 621927738 622195423 621752441 620926261 620039523 619231820 618788838 619195044 620786309 623625517
793.4F23625517M049122N184770O095230O560028O531119O186426N614340M797995
$$ 623625517 627674639 632859409 638954639 645514667 652045786 658232212 663846552 668644547
809.7F68644547L896595L061652K287745J371205K32518r87947k251923l462017m276931
$$ 668644547 672541142 675602794 677890539 679261744 679494262 678506315 676254392 672792375 668515444
828.1F68515444m616797m776716m827261m679561m324496l946721l716588l408313
$$ 668515444 663898647 659121931 654294670 649615109 645290613 641343892 637627304 634218991
844.4F34218991k631664j252473P14541L202438N785286P846773R225071J0118842
$$ 634218991 631587327 630334854 631049395 634251833 640037119 647883892 657108963 667227805
860.7F67227805J0471761J0124504R331167Q437097P282615N791604M416883L334106
$$ 667227805 677699566 687824070 697155237 705592334 712874949 718666553 723083436 726417542
877G26417542K248525J011133q4936q17895j469553k115547k304852j913667j238227
$$ 726417542 728666067 729677200 729592264 728774369 727304816 725189269 722884417 720970750 719732523
895.4G19732523l30329Q11279J748144K058328J879096J509547Q97646j80900j541794
$$ 719732523 719402194 720213473 721961617 724019945 725899041 727408588 728306234 728125334 726583540
913.7G26583540k733171l704130m473806m616022l826320k463281j074374J72079J145363
$$ 726583540 723850369 720146239 715672433 711056411 707230091 704766810 703692436 703864515 705009878
932.1G05009878J478851J199841Q89540P77542N25952N2154l97444r33886j911163
$$ 705009878 706488729 707688570 708578110 709355652 709881604 709933758 709536314 708602428 706691265
950.4G06691265l188670m312157n386055o860673q564651j0161042j1929214j3975084
$$ 706691265 703502595 699190438 693804383 686943710 678379059 668218017 656288803 642313719
966.8F42313719j5707791j6533434j6347051j5253127j3417184j1332810r578884q354127
$$ 642313719 626605928 610072494 593725443 578472316 565055132 553722322 544143438 535789311
983.1E35789311p525981o866037o282032n660534m830241l962696l291338k735883
$$ 535789311 528263330 521397293 515115261 509454727 504624486 500661790 497370452 494634569
999.4D94634569k242029k042055k465397l472030m633964n653113o406545o747186
$$ 494634569 492392540 490350485 487885088 484413058 479779094 474125981 467719436 460972250
1015.7D60972250o619573o240606n825609n419285n088597m846215m604131m272402
$$ 460972250 454352677 448112071 442286462 436867177 431778580 426932365 422328234 418055832
1032D18055832l839671l385425k973676k657145k517789k454907k447009k580673k592206
$$ 418055832 414216161 410830736 407857060 405199915 402682126 400227219 397780210 395199537 392607331
1050.4C92607331k164721j299620k26945P69824J346529J188606K00897j355380l078162
$$ 392607331 390442610 389142990 388916045 389685869 391032398 392221004 392421901 391066521 387988359
1068.7C87988359m628688n657792o021709n928576n730450n618006n666524n969763
$$ 387988359 383359671 377701879 371680170 365751594 360021144 354403138 348736614 342766851
1085C42766851o471157o782502o507098n482793l844381k042651m96387M79668P84338
$$ 342766851 336295694 329513192 323006094 317523301 313678920 311636269 311139882 311619550 312403888
1103.4C12403888O50495L73721m1276p00057j604110k793610m439563o329417p065922
$$ 312403888 313054383 313428104 313386828 312686771 311082661 308289051 303849488 297520071 290454149
1121.8B90454149n201488j815886N32806J256883Q96573J49876M28409J927107L348589
$$ 290454149 285252661 283436775 283969581 285226464 286123037 286272913 286701322 288628429 291977018
1140.1B91977018L887653L667206L100187K590149K283067K158701K283037K700597
$$ 291977018 295864671 299531877 302632064 305222213 307505280 309663981 311947018 314647615
1156.4C14647615L376424M303694N489945O841660Q147299R181202R826839J0018289
$$ 314647615 318024039 322327733 327817678 334659338 342806637 351987839 361814678 371832967
1172.7C71832967R835124R432643Q934558Q358419P522404O312400M806012L134340
$$ 371832967 381668091 391100734 400035292 408393711 415916115 422228515 427034527 430168867
1189.1D30168867J501769K76178k05934J41263J172483K632499M141956N204857N479395
$$ 430168867 431670636 431946814 431740880 431882143 433054626 435687125 439829081 445033938 450513333
1207.4D50513333N057454M360229L675133L092170K712011K599299K642125K675623
$$ 450513333 455570787 459931016 463606149 466698319 469410330 472009629 474651754 477327377
1223.7D77327377K774000L058523L357112L490001L595352L795386L921538L804386
$$ 477327377 480101377 483159900 486517012 490007013 493602365 497397751 501319289 505123675
1240.1E05123675L490746L115952K695143K132893J531601J144766R63927R04620J141130
$$ 505123675 508614421 511730373 514425516 516558409 518090010 519234776 520198703 521103323 522244453
1258.4E22244453J727462K414823L069699L791034M566192N193413N561769N802691
$$ 522244453 523971915 526386738 529456437 533247471 537813663 543007076 548568845 554371536
1274.7E54371536O058752O243885O274521O311953O509483O688893O623030O439626
$$ 554371536 560430288 566674173 572948694 579260647 585770130 592459023 599082053 605521679
1291F05521679O259561N908548N329550M807353M435181L924251L290892K845943K496421
$$ 605521679 611781240 617689788 623019338 627826691 632261872 636186123 639477015 642322958 644819379
1309.4F44819379J978576J463771J232266J224280J176297J148940J352548J572192
$$ 644819379 646797955 648261726 649493992 650718272 651894569 653043509 654396057 655968249
1325.7F55968249J483083J155614Q07703L90351p1824l33607k87116j63376r6023M4346
$$ 655968249 657451332 658606946 659414649 659805000 659733176 659399569 659112453 658949077 658853054 658897400
1346.1F58897400K40266K33591j4603k16902l60310o02066r97067j455188j773476
$$ 658897400 659137666 659371257 659356654 659139752 658779442 658177376 657180309 655725121 653951645
1364.5F53951645k019942k390921k597928k901077l836632n177796q307219j4348506
$$ 653951645 651931703 649540782 646942854 644041777 640205145 635027349 626720130 612371624
1380.8F12371624j6433537o383777R101391J3796091P857144L233611J110852l78251
$$ 612371624 595938087 589554310 598655701 612451792 620308936 623542547 624653399 624275148
1397.1F24275148j659393k492547k873898l187358l127337k793252k463580j976847
$$ 624275148 622615755 620123208 617249310 614061952 610934615 608141363 605677783 603700936
1413.4F03700936j461804j235306j059413o75917m33624l79443k34127k4795J26898
$$ 603700936 602239132 601003826 599944413 599268496 598834872 598455429 598221302 598196507 598323405
1431.8E98323405L48449R68039J567065J422823J529276J926482K462745L143429L593803
$$ 598323405 598671854 599639893 601206958 602629781 604159057 606085539 608548284 611691713 615285516
1450.1F15285516L928125M665970P231653R819627P611692O438613P690847Q182227
$$ 615285516 619213641 623879611 631111264 640930891 648542583 654981196 662672043 670854270
1466.4F70854270P144034P501424R595513R212375O740987N165100M111886L304124
$$ 670854270 677998304 685499728 695095241 704307616 711048603 716213703 720325589 723629713
1482.8G23629713K414167J563966N49019n54920j125097j713395k808690l423631l241360
$$ 723629713 726043880 727607846 728156865 727601945 726476848 724763453 721954763 718531132 715289772
1501.1G15289772l006161l897547o686628o324232m899740m712463m449605l956736
$$ 715289772 712283611 708386064 701699436 695375204 690475464 685763001 681313396 677356660
1517.4F77356660l294766l339469l268540k857506k857328k471804k187312k312958
$$ 677356660 674061894 670722425 667453885 664596379 661739051 659267247 657079935 654766977
1533.7F54766977j898110j347125j344740j419842j137376p82848l08752J24932M17053
$$ 654766977 652868867 651521742 650177002 648757160 647619784 646836936 646528184 646653116 647070169
1552.1F47070169N70715O37948M56036m97997j220823j681327k225936l318250m734814
$$ 647070169 647640884 648278832 648734868 648236871 647016048 645334721 643108785 639790535 635055721
1570.5F35055721m778683n473078q076071q245945p490337q325219r081722r378910
$$ 635055721 630277038 624803960 616727889 608481944 600991607 592666388 583584666 574205756
1586.8E74205756r487033r632468r670794r631276r370387r056329q965016q823991
$$ 574205756 564718723 555086255 545415461 535784185 526413798 517357469 508392453 499568462
1603.1D99568462q446335q257360q403212q133709p449001p838309q950651p203668
$$ 499568462 491122127 482864767 474461555 466327846 458878845 451040536 442089885 434886217
1619.4D34886217o029338o744623o394714n531013m855424l636867k664029j993984
$$ 434886217 428856879 422112256 415717542 410186529 405331105 401694238 399030209 397036225
1635.7C97036225p27177L06517J160532K038390L676980M979015L794789M952639Q895576
$$ 397036225 396309048 396615565 397776097 399814487 403491467 408470482 412265271 417217910 426113486
1654.1D26113486O653190N161166O325007Q097648Q635313P473081Q504987J0606765
$$ 426113486 432766676 437927842 444252849 452350497 460985810 468458891 476963878 487570643
1670.4D87570643R451747R757400J1126697R901226R066700J0736228J4793336J2673259
$$ 487570643 497022390 506779790 517906487 527807713 536874413 547610641 562403977 575077236
1686.7E75077236R921968J0473847R713054J0648608J2269676J2266636J3949215J1131227
$$ 575077236 584999204 595473051 605186105 615834713 628104389 640371025 654320240 665451467
1703F65451467R066522R373486P990837O802142O265163O165922O663621N716145M219651
$$ 665451467 674517989 683891475 691882312 698684454 704949617 711115539 717779160 723495305 727714956
1721.4G27714956M036009M185856L848731L727496L628671M064679M057050L171801
$$ 727714956 731750965 735936821 739785552 743513048 747141719 751206398 755263448 758435249
1737.7G58435249L450632L869355L721714L693998L878117M019916L744900L102899
$$ 758435249 761885881 765755236 769476950 773170948 777049065 781068981 784813881 787916780
1754G87916780K966403K931059K516091K390861K198696J895905J823366J857340J867473
$$ 787916780 790883183 793814242 796330333 798721194 800919890 802815795 804639161 806496501 808363974
1772.4H08363974J662970J383066J413524J506388J398444J288474J318336J336574
$$ 808363974 810026944 811410010 812823534 814329922 815728366 817016840 818335176 819671750
1788.7H19671750J255632J207292J093268J015484R56774Q87394Q56340Q46744Q08119
$$ 819671750 820927382 822134674 823227942 824243426 825200200 826087594 826943934 827790678 828598797
1807H28598797P31170O89626O30975N78940N73873O24359N90801N15402N41687N87940
$$ 828598797 829329967 830019593 830650568 831229508 831803381 832427740 833018541 833533943 834075630 834663570
1827.4H34663570M98354L67344L64542L99351M20928M18782M24087M03345L60548K77639
$$ 834663570 835161924 835529268 835893810 836293161 836714089 837132871 837556958 837960303 838320851 838598490
1847.8H38598490K53737L32236L54469L07500K76566K77042K64526L07440L42071K63572
$$ 838598490 838852227 839184463 839538932 839846432 840122998 840400040 840664566 840972006 841314077 841577649
1868.2H41577649J37806J02103J52826K14815K20716J60098J69158K39849K08319Q2016
$$ 841577649 841715455 841817558 841970384 842185199 842405915 842566013 842735171 842975020 843183339 843265355
1888.6H43265355Q7738J65879R0719J6749R2208J55389Q9288N0843R8288P5638k6405
$$ 843265355 843353093 843518972 843609691 843626440 843718648 843874037 843963325 844014168 844112456 844188094 844161689
1911.1H44161689j0133J16289R7037l7611n2452J9729J4305p3850o5386Q225o0201
$$ 844161689 844151556 844267845 844364882 844327271 844274819 844294548 844308853 844235003 844169617 844177842 844117641
1933.5H44117641j55270n7399L6955j01626k55763j65582p4506j77145k45512j50263
$$ 844117641 843962371 843904972 843941927 843840301 843584538 843418956 843344450 843167305 842921793 842771530
1953.9H42771530r0718j90258k60651j81854j22428k16246k82943j93953j67013k42591
$$ 842771530 842680812 842490554 842229903 842048049 841925621 841709375 841426432 841232479 841065466 840822875
1974.3H40822875k11477r6142j28925k42710k10106j09494j47820k59041k68043k02417
$$ 840822875 840611398 840515256 840386331 840143621 839933515 839824021 839676201 839417160 839149117 838946700
1994.7H38946700k01881k51233k31564k00570k49922k92838k32816k04682k63095k63929
$$ 838946700 838744819 838493586 838262022 838061452 837811530 837518692 837285876 837081194 836818099 836554170
2015.1H36554170k42532k80320l17097k80499k19167k20835k77698k75671k13504j96576
$$ 836554170 836311638 836031318 835714221 835433722 835214555 834993720 834716022 834440351 834226847 834030271
2035.5H34030271k34902k59877k30729j91629j85728k21372k26021j90973j85370k09689
$$ 834030271 833795369 833535492 833304763 833113134 832927406 832706034 832480013 832289040 832103670 831893981
2055.9H31893981j89484j21474j12712j65224j69814j10090j04427j42157j25945r1970
$$ 831893981 831704497 831583023 831470311 831305087 831135273 831025183 830920756 830778599 830652654 830560684
2076.3H30560684j10745j29938q5354l7253q3685j54793j04547n1319r0301q7440Q94
$$ 830560684 830449939 830320001 830234647 830197394 830113709 829958916 829854369 829803050 829712749 829625309 829626203
2098.7H29626203L4749l9458o7949J3470M5777l6657n3644M5239O0916l7551j9013
$$ 829626203 829660952 829621494 829553545 829567015 829612792 829576135 829522491 829567730 829628646 829591095 829572082
2121.1H29572082R3162Q1360J7226P7426J60635Q9764j7524L3856J46449J16229L6537
$$ 829572082 829665244 829746604 829763830 829841256 830001891 830091655 830074131 830107987 830254436 830370665 830407202
2143.6H30407202Q1957J73509J35183N8353J33753J87337R8169P5400J62125J73986
$$ 830407202 830489159 830662668 830797851 830856204 830989957 831177294 831275463 831350863 831512988 831686974
2164H31686974R2744N7102J31487J90616J41084J34170J89901J58131N1558L7432J40607
$$ 831686974 831779718 831836820 831968307 832158923 832300007 832434177 832624078 832782209 832833767 832871199 833011806
2186.4H33011806J58548N2035L4750J04367N4479k2709N0008J24574P7665L6597P6949
$$ 833011806 833170354 833222389 833257139 833361506 833415985 833393276 833443284 833567858 833645523 833682120 833759069
2208.8H33759069R4235K0922j5438O8188R5427j5855m0114P6115Q0288m5598n6505
$$ 833759069 833853304 833874226 833858788 833926976 834022403 834006548 833966434 834042549 834122837 834077239 834020734
2231.3H34020734M0769L9757m0770k9981L5763M649q5354p9691o676l7193j22190o3836
$$ 834020734 834061503 834101260 834060490 834030509 834066272 834070921 833985567 833905876 833899200 833862007 833739817 833675981
2255.8H33675981N6505L0577m5598m649O5744J6630l7313N5015J22011N5432K9743
$$ 833675981 833732486 833763063 833717465 833712816 833778560 833795190 833757877 833812892 833934903 833990335 834020078
2278.2H34020078J36733J87099N7698k1995P5341Q8572k4140J7166J59145J25646j2695
$$ 834020078 834156811 834343910 834401608 834379613 834454954 834543526 834519386 834536552 834695697 834821343 834808648
2300.6H34808648K5212J31905O8605k9504K3365J30415J05441j9074n9187K1040Q4043
$$ 834808648 834833860 834965765 835034370 835004866 835028231 835158646 835264087 835245013 835185826 835206866 835290909
2323.1H35290909J05381J21534J39832R6321l516P569P4566O5923M9829J76966M19200
$$ 835290909 835396290 835517824 835657656 835753977 835750461 835758030 835832596 835898519 835948348 836125314 836544514
2345.5H36544514M58955K31922k0087k17735k66910q9943J17242K54214K36392K86221
$$ 836544514 837003469 837235391 837215304 836997569 836730659 836640716 836757958 837012172 837248564 837534785
2365.9H37534785M72307M75288M02927M37439M94957M94778M30405L88622M08829L34143
$$ 837534785 838007092 838482380 838885307 839322746 839817703 840312481 840742886 841131508 841540337 841874480
2386.3H41874480J67728J30534J94728J53303O4552P5460J40130J29283M0829L3617
$$ 841874480 842042208 842172742 842367470 842520773 842585325 842660785 842800915 842930198 842971027 843004644
2406.7H43004644R8944N4776o1154l5346O7711O259j67489k43008j94252q5473N9366
$$ 843004644 843103588 843158364 843097210 843061864 843129575 843135834 842968345 842725337 842531085 842445612 842504978
2429.1H42504978K09570K68877J24097m7029r596O5446r775p6771q523K4139q4936
$$ 842504978 842714548 842983425 843107522 843060493 843050897 843116343 843106568 843029797 843021274 843045413 842960477
2451.5H42960477j43767k3245M8041q1658j52588l9220r656j32203j34468k0266m2379
$$ 842960477 842816710 842793465 842841506 842759848 842607260 842568040 842558384 842426181 842291713 842271447 842229068
2474H42229068j51217j08182O080o7771j87933j11282k8610j22369k10285j11461J3531
$$ 842229068 842077851 841969669 841975749 841907978 841720045 841608763 841580153 841457784 841247499 841136038 841149569
2496.4H41149569o4910j77622j07109n2154j61231k02358o1273r179j58847k19464
$$ 841149569 841084659 840907037 840799928 840747774 840586543 840384185 840322912 840313733 840154886 839935422
2516.8H39935422q0526k2173j47402j90735q0824o9320j92642j87517o3896q3029j88053
$$ 839935422 839854896 839832723 839685321 839494586 839413762 839344442 839151800 838964283 838900387 838817358 838629305
2539.2H38629305j53124n3883j02579j91510j30176n5790j26124k15709j70827j04427
$$ 838629305 838476181 838422298 838319719 838128209 837998033 837942243 837816119 837600410 837429583 837325156
2559.6H37325156j73033k51829j91331j15633j82390k72096k25424j86503k80738l23713
$$ 837325156 837152123 836900294 836708963 836593330 836410940 836138844 835913420 835726917 835446179 835122466
2580H35122466k31266j99377l06964l78549l15130k77519l75093m31001l42071k99215
$$ 835122466 834891200 834691823 834384859 834006310 833691180 833413661 833038568 832607567 832265496 831966281
2600.4H31966281m10795m73857l94583l92020m97043n06282m29630m23312m89295m89413
$$ 831966281 831555486 831081629 830687046 830295026 829797983 829291701 828862071 828438759 827949464 827460051
2620.8H27460051l96491l99172n19991n19097m21762m52638n40793n03301m08709m23551
$$ 827460051 827063560 826664388 826144397 825625300 825203538 824750900 824210107 823706806 823298097 822874546
2641.2H22874546n05745m69983l90291m40955m98653m36842l75629m26233m70280m04775
$$ 822874546 822368801 821898818 821508527 821067572 820568919 820132077 819756448 819330215 818859935 818455160
2661.6H18455160l74079m77195n32508m18126l59774m78268n23924m22478m09365n16295
$$ 818455160 818081081 817603886 817071378 816653252 816293478 815815210 815291286 814868808 814459443 813943148
2682H13943148n32031m42505m45545n27143n32568m87447n16474n92649n74529m97818
$$ 813943148 813411117 812968612 812523067 811995924 811463356 810975909 810459435 809866786 809292257 808794439
2702.4H08794439n22137o28173o33061n39780n53906o47604o27101n34534n65767o60718
$$ 808794439 808272302 807644129 807011068 806471288 805917382 805269778 804642677 804108143 803542376 802881658
2722.8H02881658o25610n84185o70195o81341n57244n03480n77390o53029o27339n57124
$$ 802881658 802256048 801671863 801001668 800320327 799763083 799259603 798682213 798029184 797401845 796844721
2743.2G96844721n61714n97835n76436n76795o54816o98328o72043o55233o89745p11739
$$ 796844721 796283007 795685172 795108736 794531941 793877125 793178797 792506754 791851521 791161776 790450037
2763.6G90450037o64533o75022p70271p59006o90639p66277r02116r39846q99077q71837
$$ 790450037 789785504 789110482 788340211 787581205 786890566 786124289 785222173 784282327 783383250 782511413
2784G82511413q81731q73566q89957r92656j094460j117707j124978j173138j193583
$$ 782511413 781629682 780756116 779866159 778873503 777779043 776661336 775536358 774363220 773169637
2802.3G73169637j160085j156509j202703j261115j335144j396537j411974j408875
$$ 773169637 772009552 770853043 769650340 768389225 767054081 765657544 764245570 762836695
2818.7G62836695j420617j461089j541853j639962j695931j746178j870811k056539
$$ 762836695 761416078 759954989 758413136 756773174 755077243 753331065 751460254 749403715
2835G49403715k296209k652347l169179l751934m240095m535675m405201l639996k539039
$$ 749403715 747107506 744455159 741285980 737534046 733293951 728758276 724353075 720713079 718174040
2853.3G18174040j635611j171231j097918j304328j703024k174079k560914k728522
$$ 718174040 716538429 715367198 714269280 712964952 711261928 709087849 706526935 703798413
2869.7G03798413k682030k530098k294063k002299j813472j786053j813769j850128
$$ 703798413 701116383 698586285 696292222 694289923 692476451 690690398 688876629 687026501
2886F87026501j923621k037644k139211k178669k221465k309740k345264k375543k548396
$$ 687026501 685102880 683065236 680926025 678747356 676525891 674216151 671870887 669495344 666946948
2904.3F66946948k783359l011226l346205l807366m195213m270077l995955l484070
$$ 666946948 664163589 661152363 657806158 653998792 649803579 645533502 641537547 638053477
2920.6F38053477k787769j995146j237035o14941j73807K77876Q63076J438975J946449
$$ 638053477 635265708 633270562 632033527 631418586 631244779 631522655 632385731 633824706 635771155
2939F35771155K376199K567530K382576J925707J433909J017869N94794K13921R0182
$$ 635771155 638147354 640714884 643097460 645023167 646457076 647474945 648069739 648283660 648373842
2957.4F48373842K08736L52263L70443L47435L63052L30985L26455L96549M21465M93884
$$ 648373842 648582578 648934841 649305284 649652719 650015771 650346756 650673211 651069760 651491225 651985109
2977.8F51985109O25431O01769M85301M82738N38409M81128K22564j68443m51147o73473
$$ 651985109 652610540 653212309 653697610 654180348 654718757 655199885 655422449 655254006 654802859 654129386
2998.1F54129386r69648j137793j173854j221896j204907j117886j173675j418233
$$ 654129386 653159738 652021945 650848091 649626195 648421288 647303402 646129727 644711494
3014.5F44711494j635253j721621j745700j753569j803994j902461j923442j890779
$$ 644711494 643076241 641354620 639608920 637855351 636051357 634148896 632225454 630334675
3030.8F30334675j926243k084017k254784k250314k186000k270401k472579k603710
$$ 630334675 628408432 626324415 624069631 621819317 619633317 617362916 614890337 612286627
3047.1F12286627k564728k524078k583265k627850k647400k641081k558053k474129
$$ 612286627 609721899 607197821 604614556 601986706 599339306 596698225 594140172 591666043
3063.4E91666043k437711k464056k579868k647996k569794k410949k306997k410233
$$ 591666043 589228332 586764276 584184408 581536412 578966618 576555669 574248672 571838439
3079.7E71838439k591908k656281k684951k683640k655923k742171k850175k783776
$$ 571838439 569246531 566590250 563905299 561221659 558565736 555823565 552973390 550189614
3096E50189614k630770k668559k881706k969921k876341k833426k984107l067136k958118
$$ 550189614 547558844 544890285 542008579 539038658 536162317 533328891 530344784 527277648 524319530
3114.4E24319530k950848l099739l299475l487825l497303l345489l273726l358364
$$ 524319530 521368682 518268943 514969468 511481643 507984340 504638851 501365125 498006761
3130.7D98006761l465891l446787l339976l371239l594011l736675l664166l577709
$$ 498006761 494540870 491094083 487754107 484382868 480788857 477052182 473388016 469810307
3147D69810307l542274l519297l624618l825694l884554l795624l733814l764540l825009
$$ 469810307 466268033 462748736 459124118 455298424 451413870 447618246 443884432 440119892 436294883
3165.4D36294883l824681l791034l798246l824562l808469l795296l807812l799916
$$ 436294883 432470202 428679168 424880922 421056360 417247891 413452595 409644783 405844867
3181.7D05844867l762871l733277l726393l703266l670305l648162l667087l685236
$$ 405844867 402081996 398348719 394622326 390919060 387248755 383600593 379933506 376248270
3198C76248270l608495l512174l490716l465593l416151l387987l357649l314733l254444
$$ 376248270 372639775 369127601 365636885 362171292 358755141 355367154 352009505 348694772 345440328
3216.4C45440328l191590l145933l100276l045947l000289k948940k842188k712369
$$ 345440328 342248738 339102805 336002529 332956582 329956293 327007353 324165165 321452796
3232.7C21452796k708882k763241k695948k586067k495199k365113k264887k297520
$$ 321452796 318743914 315980673 313284725 310698658 308203459 305838346 303573459 301275939
3249C01275939k334208k280771k199978k158224k185703k191841k147586k110779k063215
$$ 301275939 298941731 296660960 294460982 292302758 290117055 287925214 285777628 283666849 281603634
3267.4B81603634k007663k055079k165645k198845k172262k136945k148569k190292
$$ 281603634 279595971 277540892 275375247 273176402 271004140 268867195 266718626 264528334
3283.7B64528334k147943k047211j980871k007305k113640k198697k232998k191112
$$ 264528334 262380391 260333180 258352309 256345004 254231364 252032667 249799669 247608557
3300B47608557k046197j917467j981631k193019k310559k262935k172917k120525k098009
$$ 247608557 245562360 243644893 241663262 239470243 237159684 234896749 232723832 230603307 228505298
3318.4B28505298k072185k010226j958028k001911k068624k043098j967192j830965
$$ 228505298 226433113 224422887 222464859 220462948 218394324 216351226 214384034 212553069
3334.7B12553069j670465j702115j853928j893654j870439j771092j597151j612202
$$ 212553069 210882604 209180489 207326561 205432907 203562468 201791376 200194225 198582023
3351A98582023j802072j822069j570970j364022j379907j387522j223400j096144j211927
$$ 198582023 196779951 194957882 193386912 192022890 190642983 189255461 188032061 186935917 185723990
3369.3A85723990j438618j438379j158640r50291r10685r03532q13037o10292l39120
$$ 185723990 184285372 182846993 181688353 180738062 179827377 178923845 178110808 177500516 177161396
3387.7A77161396j15917j67742m23223m54351j02416J58713q2478l95090j89319J84596
$$ 177161396 177045479 176877737 176454514 176000163 175897747 176056460 175973982 175578892 175389573 175574169
3408.1A75574169K77593K36854J93268J87457L15517M73201N34118O96390R84908J154497
$$ 175574169 175851762 176088616 176281884 176469341 176784858 177258059 177792177 178488567 179473475 180627972
3428.5A80627972J085088J110464J291469J142084Q00684Q73193J273975J571626J693099
$$ 180627972 181713060 182823524 184114993 185257077 186057761 186930954 188204929 189776555 191469654
3446.8A91469654J649768J651138J779705J898840K028152K172307K156227K184570
$$ 191469654 193119422 194770560 196550265 198449105 200477257 202649564 204805791 206990361
3463.2B06990361K503574K680823K364353J906737J924724K332166K750560K839089
$$ 206990361 209493935 212174758 214539111 216445848 218370572 220702738 223453298 226292387
3479.5B26292387K563446K496183K754927K833664K759725K876595L074914L219292
$$ 226292387 228855833 231352016 234106943 236940607 239700332 242576927 245651841 248871133
3495.8B48871133L147140L043592L140598L103912K898485L049940L498643L751844
$$ 248871133 252018273 255061865 258202463 261306375 264204860 267254800 270753443 274505287
3512.1B74505287L628880L388763L417015L649890L999561M026473L756016L839910
$$ 274505287 278134167 281522930 284939945 288589835 292589396 296615869 300371885 304211795
3528.4C04211795M100323M248470M495055M644453M435539M467369M813313N006194
$$ 304211795 308312118 312560588 317055643 321700096 326135635 330603004 335416317 340422511
3544.7C40422511M866690M643231M766226N130202N204677N202890N484849N598813
$$ 340422511 345289201 349932432 354698658 359828860 365033537 370236427 375721276 381320089
3561.1C81320089N268097N315959O539912O967186O066561N828142O303549O682843
$$ 381320089 386588186 391904145 398444057 405411243 411477804 417305946 423609495 430292338
3577.4D30292338O893039P005066O855368O900758P602095P754505O996840P085473
$$ 430292338 437185377 444190443 451045811 457946569 465548664 473303169 480300009 487385482
3593.7D87385482P756590P929832P934630P946134P576883P364809Q071184Q421421
$$ 487385482 495142072 503071904 511006534 518952668 526529551 533894360 541965544 550386965
3610E50386965Q083880P998288P629990P942856Q917689Q090794O735921O468535Q137762
$$ 550386965 558470845 566469133 574099123 582041979 590959668 599050462 605786383 612254918 620392680
3628.4F20392680R356320P552326O797671O935895O729841O583869O383419N914271
$$ 620392680 629749000 637301326 644098997 651034892 657764733 664348602 670732021 676646292
3644.7F76646292N828321O927848P168353N305230M449904N248010N320728M459143
$$ 676646292 682474613 689402461 696570814 701876044 706325948 711573958 716894686 721353829
3661G21353829M016817L831386L511489L622114L978312L193319K876222L242195K834678
$$ 721353829 725370646 729202032 732713521 736335635 740313947 743507266 746383488 749625683 752460361
3679.4G52460361K576828K596795K536297K567232K470374K023995J789987J803994
$$ 752460361 755037189 757633984 760170281 762737513 765207887 767231882 769021869 770825863
3695.7G70825863J735151J525342J519621J649856J513541J226365J020611J133263
$$ 770825863 772561014 774086356 775605977 777255833 778769374 779995739 781016350 782149613
3712G82149613J365423J226723R47118Q04484Q18193P81894P63058R34422R41515Q10027
$$ 782149613 783515036 784741759 785688877 786493361 787311554 788093448 788856506 789790928 790732443 791542470
3732.4G91542470P75338R34839J046479P01010J03593K13325R25660O20127J78754
$$ 791542470 792317808 793252647 794299126 795000136 795103729 795317054 796242714 796862841 797041595
3750.7G97041595N37634P96854N74649L96549N10395N13375M49300L96847K43187L34323
$$ 797041595 797579229 798376083 798950732 799347281 799857676 800371051 800820351 801217198 801460385 801794708
3771.1H01794708N17308N22078N10513M03703K49087J69874J95384L15010L97563L93152
$$ 801794708 802312016 802834094 803344607 803748310 803997397 804167271 804362655 804677665 805075228 805468380
3791.5H05468380K42830J69039L03864J44005L2365K84910J27375J14441M33803M50552
$$ 805468380 805711210 805880249 806184113 806328118 806360483 806645393 806772768 806887209 807321012 807771564
3811.9H07771564J84774J45435L68595K4081j05262K13444K24948K01821J86444K42650
$$ 807771564 807956338 808101773 808470368 808494449 808389187 808602631 808827579 809029400 809215844 809458494
3832.3H09458494L31819R6202k23458p6413J72317K85924L48091K81811j12534p77662
$$ 809458494 809790313 809886515 809663057 809586644 809758961 810044885 810392976 810674787 810562253 809784591
3852.7H09784591l28958N64575M89474J90079O080N7280M6730j65105l0875J62065
$$ 809784591 809455633 810020208 810509682 810699761 810705841 810763121 810809851 810644746 810613871 810775936
3873.1H10775936K10821J89960n7220J8418J65224k1458m0293r5963j32382J27375
$$ 810775936 810986757 811176717 811119497 811137915 811303139 811281681 811241388 811145425 811013043 811140418
3893.5H11140418K21551Q4996j7643j09852j34468M6552J36435O5028M5836L0816n6386
$$ 811140418 811361969 811446965 811429322 811319470 811185002 811231554 811367989 811433017 811478853 811509669 811453283
3915.9H11453283l3617J03116Q2433k8074j6689R656m7743j2935J35661J72257O3360
$$ 811453283 811419666 811522782 811605215 811577141 811560452 811570108 811522365 811509430 811645091 811817348 811880708
3938.4H11880708m7446l3617O5685R8228N7340K0146K3425L5405L0160P5996J45912
$$ 811880708 811833262 811799645 811865330 811963558 812020898 812041044 812064469 812099874 812130034 812206030 812351942
3960.8H12351942J31726O9678N5313N5492O3718J13964J29342J37448J35899J04248
$$ 812351942 812483668 812553346 812608659 812664151 812727869 812841833 812971175 813108623 813244522 813348770
3981.2H13348770J15514O9022j5139M887N4181J05202J71304J56820
$$ 813348770 813464284 813533306 813518167 813523054 813577235 813682437 813853741 814010561
3997.5H14010561
$$ 814010561
##END=$$ End of the data block
