##TITLE=$$ Begin of the data block
##JCAMP-DX=5.00 $$ ACD/SpecManager v 10.08
##SPECTROMETER/DATA SYSTEM=Alpha
##DATE=10 Apr 2014 11:00:52
##DATA TYPE=INFRARED SPECTRUM
##DATA CLASS=XYDATA
##ORIGIN=
##OWNER=
##NPOINTS=1765
##FIRSTX=399.75695801
##LASTX=3997.56933594
##MAXX=3997.56933594
##MINX=399.75695801
##MAXY=0.84438926
##MINY=0.17538041
##XFACTOR=1.0000000000
##YFACTOR=1.000000000000000e-9
##FIRSTY=0.56035757
##DELTAX=2.03957629
##XUNITS=1/CM
##YUNITS=ARBITRARY UNITS
##XYDATA=(X++(Y..Y))
$$ plain form
399.8 560357571 559032440 557207406 555504978 554170251 553041101 551809132 550835669 550474286 549990118
418.1 549990118 548812807 547850132 547390103 546995759 546466887 546129882 546038687 545287192 543652415 542457938
438.5 542457938 542021453 541577399 541378558 541596889 541388035 540661454 540403008 540639520 539916635 538145661
458.9 538145661 537105083 536770463 535976052 534702063 533607483 532466412 530787289 529215753 528303385
477.3 528303385 527509153 526587367 526107430 525838971 524933159 523672938 522693455 521760225 520404637
495.6 520404637 518933713 517903566 517028689 515835881 514671266 513852954 512904465 511476934 510072708
514 510072708 509001613 507672906 505897880 504317999 502841353 500869453 498688936 496940434 495443016
532.3 495443016 493827075 492393821 491504431 490763426 489619464 488388777 487501353 486595213 485327303
$$ packed form
399.8E60357571j325131j825034j702428j334727j129150j231969r73463l61383m84168
418.1E49990118j177311r62675m60029l94344n28872l37005r1195p51495j634777j194477
438.5E42457938m36485m44054j98841K18331k08854p26581k58446K36512p22885j770974
458.9E38145661j040578l34620p94411j273989j094580j141071j679123j571536r12368
477.3E28303385p94232r21786m79937k68459r05812j260221r79483r33230j355588
495.6E20404637j470924j030147q74877j192808j164615q18312r48489j427531j404226
514E10072708j071095j328707j775026j579881j476646j971900k180517j748502j497418
532.3D95443016j615941j433254q89390p41005j143962j230687q87424r06140j267910
$$ plain form
550.7 485327303 483953804 482652217 481116980 479309738 477581739 475736469 473244518 470360011
567 470360011 467686355 465112597 462359786 459547877 456921458 454477042 451961547 449456871 447100550
585.4 447100550 444654107 441917777 439037472 436199874 433432192 430708915 427851319 424607426
601.7 424607426 421102881 418210626 416624516 415880054 415173382 414607257 414935768 416880548 420396030
620 420396030 424705684 429271281 433766305 438106656 442349643 446426690 450245112 453759819 456686854
638.4 456686854 458615124 459529400 460479885 462876439 466386020 469144166 469782054 468994319 470035523
656.7 470035523 475423187 483115345 489567637 493749142 497546434 502926826 507210910 510422945
673.1 510422945 513892829 517283916 520344853 523308873 526143491 528582096 530705750 532821000
$$ packed form
550.7D85327303j373499j301587j535237j807242j727999j845270k491951k884507
567D70360011k673656k573758k752811k811909k626419k444416k515495k504676k356321
585.4D47100550k446443k736330k880305k837598k767682k723277k857596l243893
601.7D24607426l504545k892255j586110p44462p06672n66125L28511J944780L515482
620D20396030M309654M565597M495024M340351M242987M077047L818422L514707K927035
638.4D56686854J928270R14276R50485K396554L509581K758146O37888p87735J041204
656.7D70035523N387664P692158O452292M181505L797292N380392M284084L212035
673.1E10422945L469884L391087L060937K964020K834618K438605K123654K115250
$$ plain form
689.4 532821000 534795523 536286354 537521183 538896561 540323138 541677415 543337941 545472920
705.7 545472920 547654271 549734652 552133501 554934025 557682097 560325801 563242018 566307843
722 566307843 569056630 571650684 574347794 576918662 579175055 581323206 583626568 585904241 587917864
740.4 587917864 589897990 592076600 594249964 596323609 598489165 600792944 602996349 605110526
756.7 605110526 607407510 609747708 611857057 613881290 616035044 617998660 619495332 620666862
773 620666862 621541560 621877551 621516585 620740652 619922638 619112492 618547022 618907988 620570362 623451173
793.4 623451173 627490044 632731318 638931155 645506203 652001023 658169925 663772643 668552756
809.7 668552756 672451556 675576031 677876770 679121852 679248929 678272247 676089287 672731578 668513596
$$ packed form
689.4E32821000J974523J490831J234829J375378J426577J354277J660526K134979
705.7E45472920K181351K080381K398849K800524K748072K643704K916217L065825
722E66307843K748787K594054K697110K570868K256393K148151K303362K277673K013623
740.4E87917864J980126K178610K173364K073645K165556K303779K203405K114177
756.7F05110526K296984K340198K109349K024233K153754J963616J496672J171530
773F20666862Q74698L35991l60966p75933q18014q10146n65470L60966J662374K880811
793.4F23451173M038871N241274O199837O575048O494820O168902N602718M780113
809.7F68552756L898800L124475K300739J245082J27077r76682k182960l357709m217982
$$ plain form
828.1 668513596 663875997 659076869 654219687 649476767 645127475 641240597 637554288 634107888
844.4 634107888 631488264 630287230 631011963 634166300 639885485 647715390 656960368 667092085
860.7 667092085 677583218 687727392 697012901 705354333 712592602 718372107 722733915 726034701
877 726034701 728335977 729427218 729422212 728661895 727172554 724979758 722618937 720753372 719607949
895.4 719607949 719269633 720006824 721718907 723757386 725610137 727135062 728084624 727940559 726386249
913.7 726386249 723605096 719892323 715448260 710841894 707014263 704548478 703456223 703615069 704753995
932.1 704753995 706208110 707391202 708291233 709082544 709617674 709698558 709329128 708352089 706372440
950.4 706372440 703182936 698882520 693454623 686570823 678030550 667873204 655932784 641968012
$$ packed form
828.1F68513596m637599m799128m857182m742920m349292l886878l686309l446400
844.4F34107888k619624j201034P24733L154337N719185P829905R244978J0131717
860.7F67092085J0491133J0144174R285509Q341432P238269N779505M361808L300786
877G26034701K301276J091241n006p60317j489341k192796k360821j865565j145423
895.4G19607949l38316P37191J712083K038479J852751J524925R49562j44065j554310
913.7G26386249k781153l712773m444063m606366l827631k465785j092255J58846J138926
932.1G04753995J454115J183092R00031P91311N35130Q0884l69430r77039j979649
950.4G06372440l189504m300416n427897o883800q540273j0157346j1940420j3964772
$$ plain form
966.8 641968012 626302242 609808087 593437850 578117847 564685524 553418636 543896496 535549939
983.1 535549939 528012097 521103859 514788270 509165645 504369974 500394404 497117400 494425774
999.4 494425774 492199272 490091652 487514764 483974397 479315907 473677546 467319429 460612625
1015.7 460612625 454022735 447823018 442027837 436587960 431473464 426650882 422102273 417880267
1032 417880267 414053053 410669625 407704711 405043304 402551085 400142193 397699654 395109922 392518044
1050.4 392518044 390335619 389004946 388749540 389507443 390858799 392045677 392251402 390911520 387826174
1068.7 387826174 383195788 377561778 371549875 365612477 359860986 354216158 348540753 342599481
1085 342599481 336184323 329418451 322891980 317425340 313613474 311591953 311112612 311590433 312358528
$$ packed form
966.8F41968012j5665770j6494155j6370237j5320003j3432323j1266888r522140q346557
983.1E35549939p537842o908238o315589n622625m795671l975570l277004k691626
999.4D94425774k226502k107620k576888l540367m658490n638361o358117o706804
1015.7D60612625o589890o199717n795181n439877n114496m822582m548609m222006
1032D17880267l827214l383428k964914k661407k492219k408892k442539k589732k591878
1050.4C92518044k182425j330673k55406P57903J351356J186878K05725j339882l085346
1068.7C87826174m630386n634010o011903n937398n751491n644828n675405n941272
1085C42599481o415158o765872o526471n466640l811866k021521m79341M77821P68095
$$ plain form
1103.4 312358528 313003898 313403428 313373089 312611461 310942113 308169365 303813428 297558516 290508181
1121.8 290508181 285252810 283372968 283892721 285174042 286097020 286250234 286666989 288601875 291968226
1140.1 291968226 295835257 299447000 302526981 305130035 307395846 309537411 311841518 314567536
1156.4 314567536 317942321 322195530 327617407 334446937 342645735 351875961 361694068 371686846
1172.7 371686846 381514102 390926212 399831444 408161879 415680856 422018528 426836014 429986835
1189.1 429986835 431527227 431815863 431580067 431684673 432848722 435515523 439700097 444912463 450380206
1207.4 450380206 455429167 459775537 463433474 466512084 469229132 471856415 474499285 477143586
1223.7 477143586 479902089 482952476 486300707 489812881 493455738 497287542 501224995 505026877
$$ packed form
1103.4C12358528O45370L99530l0339p61628j669348k772748m355937o254912p050335
1121.8B90508181n255371j879842N19753J281321R22978J53214M16755J934886L366351
1140.1B91968226L867031L611743L079981K603054K265811K141565K304107K726018
1156.4C14567536L374785M253209N421877O829530Q198798R230226R818107R992778
1172.7C71686846R827256R412110Q905232Q330435P518977O337672M817486L150821
1189.1D29986835J540392K88636k35796J04606J164049K666801M184574N212366N467743
1207.4D50380206N048961M346370L657937L078610K717048K627283K642870K644301
1223.7D77143586K758503L050387L348231L512174L642857L831804L937453L801882
$$ plain form
1240.1 505026877 508519292 511665404 514369488 516462028 517971396 519132197 520097613 520977139 522093832
1258.4 522093832 523820341 526251853 529335439 533128083 537673712 542829633 548348308 554124296
1274.7 554124296 560191989 566459060 572750449 579052806 585524261 592201173 598848999 605300009
1291 605300009 611549377 617451370 622804284 627667129 632139146 636056840 639315367 642127275 644633889
1309.4 644633889 646663964 648164749 649404705 650621891 651788712 652942657 654322386 655916512
1325.7 655916512 657389283 658533454 659348488 659739971 659673035 659361303 659075201 658882141 658775687
1344.1 658775687 658864558 659156442 659392476 659359455 659130394 658777535 658199310 657218516 655782998 654021978
1364.5 654021978 651991725 649598479 647006094 644081593 640193045 634988904 626706660 612380028
$$ packed form
1240.1E05026877L492415L146112K704084K092540J509368J160801R65416Q79526J116693
1258.4E22093832J726509K431512L083586L792644M545629N155921N518675N775988
1274.7E54124296O067693O267071O291389O302357O471455O676912O647826O451010
1291F05300009O249368N901993N352914M862845M472017L917694L258527K811908K506614
1309.4F44633889K030075J500785J239956J217186J166821J153945J379729J594126
1325.7F55916512J472771J144171Q15034L91483o6936l11732k86102j93060j06454
1344.1F58775687Q8871K91884K36034l3021k29061l52859n78225r80794j435518j761020
1364.5F54021978k030253k393246k592385k924501l888548n204141q282244j4326632
$$ plain form
1380.8 612380028 595921814 589509428 598620117 612446725 620314538 623525500 624604762 624214947
1397.1 624214947 622564018 620089471 617233217 614072740 610970676 608183503 605722070 603735387
1413.4 603735387 602248967 601000428 599937260 599269688 598862231 598487079 598216891 598139703 598243296
1431.8 598243296 598629594 599669039 601270199 602664948 604149818 606041789 608470500 611577690
1448.1 611577690 615173638 619139075 623800814 630964100 640751481 648373008 654813588 662526727
1464.4 662526727 670752108 677940369 685499907 695123553 704295754 711018205 716203809 720333576
1480.7 720333576 723638892 726049125 727617562 728157938 727564633 726426184 724744678 721977234 718545794
1499.1 718545794 715274274 712273479 708428919 701788545 695426047 690478444 685744643 681306720
$$ packed form
1380.8F12380028j6458214o412386R110689J3826608P867813L210962J079262l89815
1397.1F24214947j650929k474547k856254l160477l102064k787173k461433j986683
1413.4F03735387j486420j248539j063168o67572m07457l75152k70188p7188J03593
1431.8E98243296L86298J039445J601160J394749J484870J891971K428711L107190
1448.1F11577690L595948L965437M661739P163286R787381P621527O440580P713139
1464.4F62526727Q225381P188261P559538R623646R172201O722451N185604M129767
1480.7G20333576L305316K410233J568437N40376n93305j138449j681506k767444l431440
1499.1G18545794l271520l000795l844560o640374o362498m947603m733801m437923
$$ plain form
1515.4 681306720 677379370 674096465 670754850 667489588 664665937 661830306 659348965 657202423
1531.7 657202423 654955029 653039455 651645541 650322556 648990393 647873521 647036970 646688402 646826625
1550.1 646826625 647283077 647881806 648514092 648934901 648411393 647201478 645532548 643308580 639987350
1568.4 639987350 635234714 630450785 625014305 616973221 608689904 601137936 592786312 583716333
1584.7 583716333 574359298 564876378 555237293 545543373 535838604 526413500 517376602 508440793
1601.1 508440793 499619246 491156548 482851803 474389732 466242999 458816946 450985223 442019790
1617.4 442019790 434815109 428798288 422071368 415676385 410113871 405251324 401656955 399043441
1633.7 399043441 397052109 396275908 396566719 397744834 399785370 403466821 408483595 412299871 417273521
$$ packed form
1515.4F81306720l927350l282905l341615l265262k823651k835631k481341k146542
1531.7F57202423k247394j915574j393914j322985j332163j116872q36551l48568J38223
1550.1F46826625M56452N98729O32286M20809n23508j209915j668930k223968l321230
1568.4F39987350m752636m783929n436480q041084q283317p551968q351624r069979
1584.7E83716333r357035r482920r639085r693920r704769r425104r036898q935809
1601.1E08440793q821547q462698q304745q462071q146733p426053p831723q965433
1617.4D42019790p204681o016821o726920o394983n562514m862547l594369k613514
1633.7C99043441j991332p76201K90811J178115K040536L681451N016774L816276M973650
$$ plain form
1652 417273521 426182508 432812363 437963039 444309771 452461123 461145699 468645811 477156043 487736225
1670.4 487736225 497165948 506907880 518003106 527872264 536926687 547698438 562567294 575249374
1686.7 575249374 585128486 595569372 605268776 615910947 628164113 640399575 654349446 665510654
1703 665510654 674611926 684013784 691995442 698765814 705014110 711189210 717875659 723594308 727788150
1721.4 727788150 731781363 735925853 739757001 743482947 747136474 751260102 755316079 758441210
1737.7 758441210 761889815 765789390 769512951 773191094 777067661 781104982 784875274 787985802
1754 787985802 790925801 793828905 796354711 798770964 800994575 802910805 804726005 806553185 808414459
1772.4 808414459 810092449 811468482 812864244 814376950 815795958 817085683 818393409 819724619
$$ packed form
1652D17273521Q908987O629855N150676O346732Q151352Q684576P500112Q510232J0580182
1670.4D87736225R429723R741932J1095226R869158R054423J0771751J4868856J2682080
1686.7E75249374R879112J0440886R699404J0642171J2253166J2235462J3949871J1161208
1703F65510654R101272R401858P981658O770372O248296O175100O686449N718649M193842
1721.4G27788150L993213M144490L831148L725946L653527M123628M055977L125131
1737.7G58441210L448605L899575L723561L678143L876567M037321L770292L110528
1754G87985802K939999K903104K525806K416253K223611J916230J815200J827180J861274
1772.4H08414459J677990J376033J395762J512706J419008J289725J307726J331210
$$ plain form
1788.7 819724619 820982397 822187781 823274553 824300706 825266540 826147676 826993406 827820420 828613222
1807 828613222 829357386 830062389 830672681 831230164 831802249 832433164 833043993 833588481 834148943 834726036
1827.4 834726036 835195720 835555315 835937381 836343944 836755574 837171435 837590992 837989986 838365793 838655829
1847.8 838655829 838898659 839204729 839545250 839839637 840082467 840369642 840686858 841011107 841356158 841635346
1868.2 841635346 841772854 841860473 841997564 842199624 842416823 842595935 842778206 843008518 843233705 843342662
1888.6 843342662 843417525 843563795 843658507 843686044 843786359 843943298 844014645 844047964 844157994 844252229 844233274
1911.1 844233274 844224870 844321728 844389260 844340742 844290912 844301760 844298542 844235420 844188631 844203889 844167113 844038546
1935.5 844038546 843977451 843989551 843884170 843640387 843464673 843376338 843201041 842948258 842781663 842680633
$$ packed form
1788.7H19724619J257778J205384J086772J026153R65834Q81136Q45730Q27014P92802
1807H28613222P44164P05003O10292N57483N72085O30915O10829N44488N60462N77093
1827.4H34726036M69684L59595L82066M06563M11630M15861M19557L98994L75807K90036
1847.8H38655829K42830L06070L40521K94387K42830K87175L17216L24249L45051K79188
1868.2H41635346J37508Q7619J37091K02060K17199J79112J82271K30312K25187J08957
1888.6H43342662P4863J46270R4712K7537J00315J56939P1347L3319J10030R4235j8955
1911.1H44233274q404R6858O7532m8518m9830J0848l218o3122m6789J5258l6776j28567
1935.5H44038546o1095J2100j05381k43783j75714q8335j75297k52783j66595j01030
$$ plain form
1955.9 842680633 842483342 842234492 842069507 841944396 841730654 841463268 841272652 841107428 840867281 840640843
1976.3 840640843 840529799 840401411 840157688 839933515 839825213 839718103 839501143 839227676 838981092 838735759
1996.7 838735759 838474631 838283122 838117123 837853611 837536573 837275445 837047994 836808741 836574256 836318195
2017.1 836318195 836010814 835692644 835435927 835224509 834987342 834715426 834465384 834249198 834030271 833797812
2037.5 833797812 833552063 833314478 833096325 832872331 832628965 832430005 832282305 832104564 831876814 831675351
2057.9 831675351 831548274 831433892 831274629 831095636 830957413 830830753 830675602 830556512 830511689 830446720
2078.3 830446720 830320179 830229163 830192447 830088735 829912543 829810321 829765677 829689562 829620242 829614282 829637349
2100.7 829637349 829626620 829599679 829598546 829590976 829520702 829460800 829505801 829566598 829538822 829543233 829658985 829740644
$$ packed form
1955.9H42680633j97291k48850j64985j25111k13742k67386j90616j65224k40147k26438
1976.3H40640843j11044j28388k43723k24173j08302j07110k16960k73467k46584k45333
1996.7H38735759k61128j91509j65999k63512l17038k61128k27451k39253k34485k56061
2017.1H36318195l07381l18170k56717k11418k37167k71916k50042k16186k18927k32459
2037.5H33797812k45749k37585k18153k23994k43366j98960j47700j77741k27750k01463
2057.9H31675351j27077j14382j59263j78993j38223j26660j55151j19090m4823o4969
2078.3H30446720j26541r1016l6716j03712j76192j02222m4644p6115o9320n960K3067
2100.7H29637349j0729k6941j133p570p0274n9902M5001O0797k7776M411J15752Q1659
$$ plain form
2125.2 829740644 829738200 829791665 829941511 830044627 830059350 830115795 830247879 830342531 830400169 830529332 830708563
2147.7 830708563 830813646 830865860 831014633 831206560 831283092 831329525 831498444 831697106 831786335 831832469
2168 831832469 831966877 832146823 832255781 832368553 832564056 832721651 832775116 832851887 833026171 833186686
2188.4 833186686 833247364 833307326 833426654 833485544 833462715 833503366 833622932 833688080 833700180 833779514 833897531
2210.9 833897531 833925366 833888233 833919823 833995104 833989680 833963335 834043562 834138274 834107459 834035635 834036827 834047079
2235.4 834047079 834017396 834018528 834069490 834079087 834004164 833950937 833955109 833894312 833774865 833733857 833782554 833805144
2259.8 833805144 833759308 833731771 833772540 833792269 833774924 833830059 833933353 833986402 834041834 834203720 834388137
2282.3 834388137 834452033 834459066 834542990 834634483 834637105 834652722 834746718 834822357 834824324 834870040 835007131 835111022
$$ packed form
2125.2H29740644k444N3465J49846J03116J4723N6445J32084R4652N7638J29163J79231
2147.7H30708563J05083N2214J48773J91927P6532M6433J68919J98662Q9229M6134
2168H31832469J34408J79946J08958J12772J95503J57595N3465P6771J74284J60515
2188.4H33186686O0678N9962J19328N8890k2829M0651J19566O5148J2100P9334J18017
2210.9H33897531K7835l7133L1590P5281n424k6345Q0227R4712l0815p1824J192J0252
2235.4H34047079k9683J132N0962R597p4923n3227M172o0797j19447m1008M8697K2590
2259.8H33805144m5836k7537M0769J9729j7345N5135J03294N3049N5432J61886J84417
2282.3H34388137O3896P033Q3924R1493K622J5617R3996P5639J967M5716J37091J03891
$$ plain form
2306.7 835111022 835117579 835117340 835227013 835371912 835403085 835360408 835345924 835346758 835363925 835447788 835592687 835702956
2331.2 835702956 835752249 835831821 835922420 835955560 835970640 836084843 836454570 836944103 837189674 837129235 836935341
2353.6 836935341 836729705 836584687 836661994 836952686 837177217 837421775 837898076 838460088 838956833 839409709
2374 839409709 839884579 840372682 840818763 841224313 841617703 841938078 842128634 842264116 842425466 842569172
2394.4 842569172 842650115 842734635 842878282 843004167 843037307 843062997 843154252 843221843 843196392 843175948 843223751
2416.9 843223751 843212426 843033314 842768192 842562556 842491806 842576742 842804968 843068540 843167543 843101144
2437.3 843101144 843083501 843149006 843139470 843054712 843042195 843063474 842975736 842847645 842850804 842900515 842784047
2459.7 842784047 842600048 842573404 842593729 842462361 842325509 842326462 842290759 842119455 841993988 842005372 841935158
$$ packed form
2306.7H35111022O557k39J09673J44899L1173m2677j4484Q34J7167Q3863J44899J10269
2331.2H35702956M9293P9572R0599L3140J5080J14203L69727M89533K45571o0439j93894
2353.6H36935341k05636j45018P7307K90692K24531K44558M76301N62012M96745M52876
2374H39409709M74870M88103M46081M05550L93390L20375J90556J35482J61350J43706
2394.4H42569172Q0943Q4520J43647J25885L3140K5690R1255O7591k5451k0444M7803
2416.9H43223751j1325j79112k65122k05636p0750Q4936K28226K63572R9003o6399
2437.3H43101144j7643O5505r536q4758j2517K1279q7738j28091L159M9711j16468
2459.7H42784047j83999k6644K0325j31368j36852R53l5703j71304j25467J1384p0214
$$ plain form
2482.1 841935158 841703534 841570079 841583490 841497838 841288686 841172636 841149032 841023862 840834796 840763688
2502.5 840763688 840754449 840622067 840433896 840376437 840359151 840196431 839984417 839897931 839845359 839673102 839487851
2525 839487851 839434206 839380205 839173019 838956654 838874400 838788331 838598013 838444889 838398457 838316262 838147104
2547.4 838147104 838019013 837951601 837819099 837605536 837428808 837306738 837129593 836895883 836726904 836625755
2567.8 836625755 836459458 836219728 836008072 835780323 835458696 835123003 834894717 834720194 834431648 834058464
2588.2 834058464 833759844 833487809 833095253 832650900 832296014 831968188 831540346 831074655 830670416 830251634
2608.6 830251634 829766810 829317629 828958452 828575552 828052044 827475786 827017784 826618969 826119125 825600564
2629 825600564 825187504 824778378 824277103 823777735 823354483 822912693 822389841 821913719 821533561 821094334
$$ packed form
2482.1H41935158k31624j33455J3411q5652k09152j16050k3604j25170j89066p1108
2502.5H40763688r239j32382j88171n7459j7286j62720k12014q6486n2572j72257j85251
2525H39487851n3645n4001k07186k16365q2254q6069j90318j53124m6432q2195j69158
2547.4H38147104j28091o7412j32502k13563j76728j22070j77145k33710j68979j01149
2567.8H36625755j66297k39730k11656k27749l21627l35693k28286j74523k88546l73184
2588.2H34058464k98620k72035l92556m44353l54886l27826m27842m65691m04239m18782
2608.6H30251634m84824m49181l59177l82900n23508n76258m58002l98815m99844n18561
2629H25600564m13060m09126n01275m99368m23252m41790n22852m76122l80158m39227
$$ plain form
2649.4 821094334 820570052 820120394 819761157 819342256 818854094 818433702 818076432 817638099 817124605 816678226
2669.8 816678226 816271186 815773726 815269947 814879298 814475417 813947856 813419402 812984049 812536836 812015355
2690.2 812015355 811513007 811055303 810528815 809899569 809309006 808823168 808303535 807654262 807009995 806490183
2710.6 806490183 805953443 805309653 804701090 804164767 803564429 802878082 802234232 801660120 801049232 800413966
2731 800413966 799849629 799312115 798703909 798061013 797461271 796903849 796341360 795737982 795134008 794532955
2751.4 794532955 793874919 793210566 792585909 791915298 791167617 790440857 789784133 789113760 788369775 787630975
2771.8 787630975 786927462 786144674 785242319 784303367 783401251 782524765 781646132 780777812 779875278 778870702
2792.2 778870702 777786553 776687622 775580287 774416447 773210645 772023261 770853341 769663095
$$ packed form
2649.4H21094334n24282m49658l59237m18901m88162m20392l57270m38333n13494m46379
2669.8H16678226m07040m97460n03779l90649m03881n27561n28454m35353m47213n21481
2690.2H12015355n02348m57704n26488o29246n90563m85838n19633o49273o44267n19812
2710.6H06490183n36740o43790o08563n36323o00338o86347o43850n74112o10888o35266
2731H00413966n64337n37514o08206o42896n99742n57422n62489o03378o03974o01053
2751.4G94532955o58036o64353o24657o70611p47681p26760o56724o70373p43985p38800
2771.8G87630975p03513p82788r02355r38952r02116q76486q78633q68320r02534j004576
2792.2G78870702j084149j098931j107335j163840j205802j187384j169920j190246
$$ plain form
2808.5 769663095 768399417 767058849 765692532 764307797 762904763 761493325 760029674 758448482
2824.8 758448482 756773949 755082905 753357649 751496017 749452710 747197747 744556427 741360545
2841.1 741360545 737618446 733402491 728848636 724411309 720775247 718253076 716599226 715395153
2857.4 715395153 714281917 712985814 711324275 709194124 706630588 703880489 701221764 698720992
2873.7 698720992 696395636 694357693 692556560 690792859 688992202 687144160 685199797 683145225
2890.1 683145225 681017280 678846598 676603019 674248815 671831965 669407487 666901171 664193630
2906.4 664193630 661218524 657891750 654132903 649963856 645645559 641608238 638139904 635369837
2922.7 635369837 633364260 632104635 631478965 631332755 631649315 632523417 633956790 635882378 638242602
$$ packed form
2808.5G69663095j263678j340568j366317j384735j403034j411438j463651j581192
2824.8G58448482j674533j691044j725256j861632k043307k254963k641320l195882
2841.1G41360545l742099m215955m553855m437327l636062k522171j653850j204073
2857.4G15395153j113236j296103j661539k130151k563536k750099k658725k500772
2873.7F98720992k325356k037943j801133j763701j800657j848042j944363k054572
2890.1F83145225k127945k170682k243579k354204k416850k424478k506316k707541
2906.4F64193630k975106l326774l758847m169047m318297m037321l468334k770067
2922.7F35369837k005577j259625o25670j46210L16560Q74102J433373J925588K360224
$$ plain form
2941 638242602 640836537 643261433 645185530 646589041 647592604 648178816 648403943 648533642 648759007
2959.4 648759007 649093866 649447799 649794221 650162995 650509596 650834322 651199222 651624084 652150154 652782261
2979.8 652782261 653370142 653845012 654322267 654841125 655325532 655590653 655445278 654982924 654310822 653376639
3000.2 653376639 652255177 651062787 649836898 648631096 647489905 646299303 644895732 643294871
3016.5 643294871 641601443 639864683 638091385 636247516 634307981 632341206 630415499 628506899
3032.8 628506899 626472235 624253809 622037470 619881094 617606580 615126789 612547159 610007524
3049.1 610007524 607491553 604933858 602347195 599687397 596987844 594404697 591939867 589505315
3065.5 589505315 587032557 584438443 581770003 579201996 576840341 574570596 572145820 569513142
$$ packed form
2941F38242602K593935K424896J924097J403511J003563N86212K25127J29699K25365
2959.4F48759007L34859L53933L46422L68774L46601L24726L64900M24862N26070O32107
2979.8F52782261N87881M74870M77255N18858M84407K65121j45375m62354o72102r34183
3000.2F53376639j121462j192390j225889j205802j141191j190602j403571j600861
3016.5F43294871j693428j736760j773298j843869j939535j966775j925707j908600
3032.8F28506899k034664k218426k216339k156376k274514k479791k579630k539635
3049.1F10007524k515971k557695k586663k659798k699553k583147k464830k434552
3065.5E89505315k472758k594114k668440k568007k361655k269745k424776k632678
$$ plain form
3081.8 569513142 566824913 564147592 561475635 558806360 556075811 553287327 550541341 547858536
3098.1 547858536 545114160 542212725 539257288 536386251 533552766 530570805 527507603 524578750
3114.4 524578750 521692812 518641174 515324891 511801481 508324742 505011082 501701772 498303711
3130.7 498303711 494851619 491405338 488043517 484682769 481105715 477370769 473693401 470080107
3147 470080107 466525793 463010639 459362060 455513149 451635599 447861284 444131047 440363556 436542809
3165.4 436542809 432686001 428850561 425079197 421319306 417527050 413730770 409969509 406228274
3181.7 406228274 402458370 398659319 394877344 391140819 387442231 383791089 380159199 376499206
3198 376499206 372858971 369307220 365831167 362399518 358980477 355579376 352248192 348968625 345706463
$$ packed form
3081.8E69513142k688229k677321k671957k669275k730549k788484k745986k682805
3098.1E47858536k744376k901435k955437k871037k833485k981961l063202k928853
3114.4E24578750k885938l051638l316283l523410l476739l313660l309310l398061
3130.7D98303711l452092l446281l361821l360748l577054l734946l677368l613294
3147D70080107l554314l515154l648579l848911l877550l774315l730237l767491l820747
3165.4D36542809l856808l835440l771364l759891l792256l796280l761261l741235
3181.7D06228274l769904l799051l781975l736525l698588l651142l631890l659993
3198C76499206l640235l551751l476053l431649l419041l401101l331184l279567l262162
$$ plain form
3216.4 345706463 342484027 339310616 336182892 333122432 330127716 327199996 324378580 321656317
3232.7 321656317 318924397 316155791 313468277 310893178 308407396 306037217 303726226 301373750
3249 301373750 299028546 296785563 294615507 292421550 290209144 288044035 285902113 283779293 281719953
3267.4 281719953 279698193 277620941 275459647 273265511 271071553 268921107 266844153 264755368
3283.7 264755368 262605131 260484666 258443356 256426692 254363477 252214730 249991894 247790337
3300 247790337 245716691 243766084 241793856 239645362 237327367 235013202 232832178 230722561 228619009
3318.4 228619009 226561934 224579483 222611651 220559016 218461350 216464952 214572594 212758794
3334.7 212758794 211043954 209272400 207354203 205446750 203596190 201834098 200268328 198699668
$$ packed form
3216.4C45706463l222436l173411l127724l060460k994716k927720k821416k722263
3232.7C21656317k731920k768606k687514k575099k485782k370179k310991k352476
3249C01373750k345204k242983k170056k193957k212406k165109k141922k122820k059340
3267.4B81719953k021760k077252k161294k194136k193958k150446k076954k088785
3283.7B64755368k150237k120465k041310k016664k063215k148747k222836k201557
3300B47790337k073646j950607j972228k148494k317995k314165k181024k109617k103552
3318.4B28619009k057075j982451j967832k052635k097666j996398j892358j813800
3334.7B12758794j714840j771554j918197j907453j850560j762092j565770j568660
$$ plain form
3351 198699668 196919769 195085183 193442017 192032844 190683991 189308926 188051790 186937422 185710192
3369.3 185710192 184237942 182821393 181717113 180774003 179859102 178959459 178132161 177518070 177211419
3387.7 177211419 177130669 176940396 176440001 175947100 175879762 176077202 175986215 175570622 175380409 175565585
3408.1 175565585 175849125 176115558 176330835 176515341 176839992 177341521 177914426 178639889 179620951 180752575
3428.5 180752575 181817651 182893783 184149504 185339063 186211303 187049046 188218474 189704835 191386834
3446.8 191386834 193107277 194813579 196565658 198420838 200472787 202706546 204879910 207043216
3463.2 207043216 209540620 212225661 214578241 216491982 218481958 220858112 223541453 226286352
3479.5 226286352 228850558 231402919 234176442 236979395 239698246 242543921 245600179 248828009
$$ packed form
3351A98699668j779899j834586j643166j409173j348853j375065j257136j114368j227230
3369.3A85710192j472250j416549j104280r43110r14901q99643q27298o14091l06651
3387.7A77211419q0750j90273n00395m92901o7338J97440r0987m15593j90213J85176
3408.1A75565585K83540K66433K15277J84506L24651N01529N72905P25463R81062J131624
3428.5A80752575J065076J076132J255721J189559Q72240Q37743J169428J486361J681999
3446.8A91386834J720443J706302J752079J855180K051949K233759K173364K163306
3463.2B07043216K497404K685041K352580J913741J989976K376154K683341K744899
3479.5B26286352K564206K552361K773523K802953K718851K845675L056258L227830
$$ plain form
3495.8 248828009 251991659 255042285 258191079 261313468 264213175 267199308 270634949 274395376
3512.1 274395376 278030604 281386703 284803122 288525462 292623609 296716839 300477922 304290295
3528.4 304290295 308419168 312719315 317190588 321765512 326188236 330690056 335509747 340500414
3544.7 340500414 345348984 349997282 354779184 359880090 365034133 370201558 375698537 381352663
3561.1 381352663 386681020 392081112 398691028 405664742 411722958 417535722 423782051 430397838
3577.4 430397838 437306345 444377124 451236010 458087832 465673923 473443776 480401963 487408102
3593.7 487408102 495157510 503175199 511198640 519174099 526732087 534069121 542145967 550618589
3610 550618589 558766842 566851199 574586809 582579911 591454744 599475563 606151462 612561584 620668352
$$ packed form
3495.8B48828009L163650L050626L148794L122389K899707K986133L435641L760427
3512.1B74395376L635228L356099L416419L722340M098147M093230L761083L812373
3528.4C04290295M128873M300147M471273M574924M422724M501820M819691M990667
3544.7C40500414M848570M648298M781902N100906N154043N167425N496979N654126
3561.1C81352663N328357N400092O609916O973714O058216N812764O246329O615787
3577.4D30397838O908507P070779O858886O851822P586091P769853O958187P006139
3593.7D87408102P749408Q017689Q023441P975459P557988P337034Q076846Q472622
3610E50618589Q148253Q084357P735610P993102Q874833Q020819O675899O410122Q106768
$$ plain form
3628.4 620668352 630012751 637522817 644288123 651210606 657966614 664641738 671073318 676959813
3644.7 676959813 682758152 689657152 696797371 702123106 706655443 711927176 717113853 721444011
3661 721444011 725471258 729387760 732970178 736630082 740593553 743786633 746703386 749923587 752708852
3679.4 752708852 755252898 757822633 760360956 762957692 765462637 767513633 769302726 771042466
3695.7 771042466 772674441 774156272 775707304 777384818 778903127 780176222 781298935 782464623
3712 782464623 783733070 784858286 785810590 786702693 787552774 788302600 789086223 790074408 791023076 791833818
3732.4 791833818 792665243 793618321 794602633 795246184 795311451 795469820 796293437 796835959 797076881 797741950
3752.8 797741950 798595965 799171269 799527705 800006449 800531149 800985932 801393390 801701486 802062392 802537262
$$ packed form
3628.4F20668352R344399P510066O765306O922483O756008O675124O431580N886495
3644.7F76959813N798339O899000P140219N325735M532337N271733N186677M330158
3661G21444011M027247L916502L582418L659904L963471L193080K916753L220201K785265
3679.4G52708852K544046K569735K538323K596736K504945K050996J789093J739740
3695.7G71042466J631975J481831J551032J677514J518309J273095J122713J165688
3712G82464623J268447J125216R52304Q92103Q50081P49826P83623R88185R48668Q10742
3732.4G91833818Q31425R53078R84312O43551O5267J58369Q23617N42522K40922O65069
3752.8G97741950Q54015N75304L56436M78744N24700M54783M07458L08096L60906M74870
$$ plain form
3773.2 802537262 803033650 803516269 803895116 804171741 804359257 804534554 804845214 805250049 805601299 805804014
3793.6 805804014 806036234 806408346 806514084 806562126 806952178 807094514 807163596 807590187 808047593 808232784
3814 808232784 808337688 808588386 808541238 808474898 808720708 808943212 809149563 809334099 809545636 809892237
3834.4 809892237 810077488 809954047 809940457 810076118 810243368 810511291 810781837 810658395 809914351 809696019
3854.8 809696019 810290098 810771048 810960054 810953796 811000824 811025739 810822904 810770690 810907185 811077058
3875.2 811077058 811273515 811295748 811379433 811547101 811524212 811480820 811378062 811259925 811395407 811601460
3895.5 811601460 811664641 811593056 811432779 811303675 811356664 811511755 811612546 811683893 811748207 811750054 811737716
3918 811737716 811751068 811721206 811671615 811726093 811843157 811856866 811795890 811806500 811882496 811949432 811966121 811958075
$$ packed form
3773.2H02537262M96388M82619L78847K76625J87516J75297L10660M04835L51250K02715
3793.6H05804014K32220L72112J05738M8042L90052J42336O9082M26591M57406J85191
3814H08232784J04904K50698m7148o6340K45810K22504K06351J84536K11537L46601
3834.4H09892237J85251j23441j3590J35661J67250K67923K70546j23442p44044k18332
3854.8H09696019N94079M80950J89006o258M7028K4915k02835n2214J36495J69873
3875.2H11077058J96457K2233Q3685J67668k2889m3392j02758j18137J35482K06053
3895.5H11601460O3181p1585j60277j29104N2989J55091J00791P1347O4314J847j2338
3918H11737716J3352k9862m9591N4478J17064J3709o0976J0610P5996O6936J6689q046
$$ plain form
3942.5 811958075 812004089 812079430 812116504 812129617 812177241 812281489 812392652 812488377 812575996 812640846 812683403
3964.9 812683403 812732995 812805355 812910736 813053548 813197672 813356757 813516736 813641310 813734829 813750148
3985.3 813750148 813734949 813802481 813911438 813994527 814106405 814239442
3997.5 814239442
$$ packed form
3942.5H11958075M6014P5341L7074J3113M7624J04248J11163R5725Q7619O4850M2557
3964.9H12683403M9592P2360J05381J42812J44124J59085J59979J24574R3519J5319
3985.3H13750148j5199O7532J08957Q3089J11878J33037
3997.5H14239442
##END=$$ End of the data block
