##TITLE=$$ Begin of the data block
##JCAMP-DX=5.00 $$ ACD/SpecManager v 10.08
##SPECTROMETER/DATA SYSTEM=Alpha
##DATE=10 Apr 2014 11:00:52
##DATA TYPE=INFRARED SPECTRUM
##DATA CLASS=XYDATA
##ORIGIN=
##OWNER=
##NPOINTS=1765
##FIRSTX=399.75695801
##LASTX=3997.56933594
##MAXX=3997.56933594
##MINX=399.75695801
##MAXY=0.84459490
##MINY=0.17583951
##XFACTOR=1.0000000000
##YFACTOR=1.000000000000000e-9
##FIRSTY=0.56452143
##DELTAX=2.03957629
##XUNITS=1/CM
##YUNITS=ARBITRARY UNITS
##XYDATA=(X++(Y..Y))
$$ plain form
399.8 564521432 562496960 560104132 558295131 557261407 556129634 554676056 553560078 552969337 552480936
418.1 552480936 551535428 550465941 549899340 549494326 549049914 548706830 548004031 546751320 545420527
436.5 545420527 544701457 544538379 544117689 543553770 543385744 543176115 542630970 542263627 542212009 541593015
456.9 541593015 540119708 538955986 538426578 537654877 536287844 535052001 533915997 532227278 530712962
475.2 530712962 529879630 528920650 527648211 526910961 526740193 526195347 525108278 524020731 523062885
493.6 523062885 521796465 520234942 519038200 518146694 517020881 515922368 515113056 514177561 512866199
511.9 512866199 511530578 510395348 508993387 507122636 505418539 503976464 502206564 500184894
528.3 500184894 498472124 496860027 495027781 493556231 492752939 491978347 490887523 489848375 489022464
$$ packed form
399.8E64521432k024472k392828j809001j033724j131773j453578j115978n90741m88401
418.1E52480936r45508j069487n66601m05014m44412l43084p02799j252711j330793
436.5E45420527p19070j63078m20690n63919j68026k09629n45145l67343n1618o18994
456.9E41593015j473307j163722n29408p71701j367033j235843j136004j688719j514316
475.2E30712962q33332r58980j272439p37250j70768n44846j087069j087547r57846
493.6E23062885j266420j561523j196742q91506j125813j098513q09312r35495j311362
511.9E12866199j335621j135230j401961j870751j704097j442075j769900k021670
528.3E00184894j712770j612097j832246j471550q03292p74592j090824j039148q25911
$$ plain form
546.6 489022464 487980545 486513764 485037982 483787328 482410699 480679661 478802145 476795137
562.9 476795137 474367470 471674562 469048768 466336459 463518471 460841209 458411545 456033319
579.2 456033319 453411818 450719267 448130012 445522040 442791551 440032035 437402278 434792489
595.6 434792489 432158440 429405898 426099598 422384769 419414341 417853653 417110652 416384429 415718108
613.9 415718108 415922552 417831779 421333283 425597578 430148125 434748143 439266950 443640441 447751433
632.3 447751433 451457053 454763591 457587272 459541529 460513145 461554736 464023322 467496812 470139802
650.6 470139802 470709026 469952881 471038014 476380914 484053224 490672261 495119870 499154925 504427612
669 504427612 508388817 511465967 514921486 518293142 521281600 524186134 527071774 529609323 531738102
$$ packed form
546.6D89022464j041919j466781j475782j250654j376629j731038j877516k007008
562.9D76795137k427667k692908k625794k712309k817988k677262k429664k378226
579.2D56033319k621501k692551k589255k607972k730489k759516k629757k609789
595.6D34792489k634049k752542l306300l714829k970428j560688p43001p26223o66321
613.9D15718108K04444J909227L501504M264295M550547M600018M518807M373491M110992
632.3D47751433L705620L306538K823681J954257R71616J041591K468586L473490K642990
650.6D70139802N69224p56145J085133N342900P672310O619037M447609M035055N272687
669E04427612L961205L077150L455519L371656K988458K904534K885640K537549K128779
$$ plain form
687.3 531738102 533785105 535714686 537251115 538587451 539979577 541336477 542586625 544117570
703.7 544117570 546181738 548432112 550613940 553030252 555845559 558626235 561265826 564149022
720 564149022 567161560 569875360 572474957 575225472 577903390 580241680 582398415 584620059 586733639
738.3 586733639 588644505 590681314 592979133 595130861 597022235 599073768 601432264 603725016
754.6 603725016 605869651 608191729 610582292 612733305 614732265 616782010 618691564 620204926
771 620204926 621365726 622233927 622586310 622206688 621358275 620442331 619608045 619125187 619550705 621206999
791.4 621206999 624082744 628128827 633343458 639491796 646025002 652475238 658581018 664169729
807.7 664169729 669067800 673119724 676278770 678547800 679754496 679778159 678713322 676531255 673118412
$$ packed form
687.3E31738102K047003J929581J536429J336336J392126J356900J250148J530945
703.7E44117570K064168K250374K181828K416312K815307K780676K639591K883196
720E64149022L012538K713800K599597K750515K677918K338290K156735K221644K113580
738.3E86733639J910866K036809K297819K151728J891374K051533K358496K292752
754.6F03725016K144635K322078K390563K151013J998960K049745J909554J513362
771F20204926J160800Q68201L52383l79622q48413r15944q34286m82858M25518J656294
791.4F21206999K875745M046083N214631O148338O533206O450236O105780N588711
807.7F64169729M898071M051924L159046K269030J206696K3663j064837k182067l412843
$$ plain form
826 673118412 668807507 664205372 659484148 654632449 649905503 645606041 641699195 637970567 634572923
844.4 634572923 632046103 630904436 631653547 634854257 640617371 648410439 657573760 667614520
860.7 667614520 677979767 688022435 697337627 705775261 713049352 718860149 723309517 726631701
877 726631701 728842974 729864836 729831040 729020536 727478445 725290060 722983479 721122265 719932854
895.4 719932854 719598711 720383704 722098649 724085152 725928128 727497160 728444755 728236198 726659119
913.7 726659119 723946631 720293224 715818763 711168051 707346201 704892933 703817010 703998387 705102921
932.1 705102921 706481218 707626939 708501756 709262431 709830165 709942520 709543109 708559632 706615508
950.4 706615508 703457594 699165165 693730950 686838269 678269684 668071985 656125188 642181873
$$ packed form
826F73118412m310905m602135m721224m851699m726946m299462l906846l728628l397644
844.4F34572923k526820j141667P49111L200710N763114P793068R163321J0040760
860.7F67614520J0365247J0042668R315192Q437634P274091N810797M449368L322184
877G26631701K211273J021862l3796q10504j542091k188385k306581j861214j189411
895.4G19932854l34143P84993J714945J986503J842976J569032R47595k08557j577079
913.7G26659119k712488l653407m474461m650712l821850k453268j075923J81377J104534
932.1G05102921J378297J145721Q74817P60675N67734J12355l99411r83477j944124
950.4G06615508l157914m292429n434215o892681q568585j0197699j1946797j3943315
$$ plain form
966.8 642181873 626502693 609992862 593664467 578403890 564982474 553679466 544141293 535814643
983.1 535814643 528299332 521421432 515141368 509511232 504663706 500651181 497351348 494603008
999.4 494603008 492309242 490196347 487661839 484154701 479507685 473843992 467450887 460755408
1015.7 460755408 454204708 448020756 442226052 436811209 431729615 426905066 422342211 418149710
1032 418149710 414377213 411020070 408060521 405395001 402868360 400439620 398041070 395506084 392936796
1050.4 392936796 390750289 389410615 389156282 389893949 391210079 392397076 392615467 391250253 388125360
1068.7 388125360 383481294 377866000 371890038 365979075 360238165 354605287 348934472 342977583
1085 342977583 336571664 329861581 323385179 317923635 314088374 312044948 311539412 311990738 312760621
$$ packed form
966.8F42181873j5679180j6509831j6328395j5260577j3421416j1303008r538173q326650
983.1E35814643p515311o877900o280064n630136m847526m012525l299833k748340
999.4D94603008k293766k112895k534508l507138m647016n663693o393105o695479
1015.7D60755408o550700o183952n794704n414843n081594m824549m562855m192501
1032D18149710l772497l357143k959549k665520k526641k428740k398550k534986k569288
1050.4C92936796k186507j339674k54333P37667J316130J186997K18391j365214l124893
1068.7C88125360m644066n615294n975962n910963n740910n632878n670815n956889
1085C42977583o405919o710083o476402n461544l835261k043426n05536M51326P69883
$$ plain form
1103.4 312760621 313424110 313832313 313802868 313053906 311391741 308582902 304192036 297928929 290839970
1121.8 290839970 285542101 283688217 284241587 285486698 286372691 286552817 287004173 288926423 292259663
1140.1 292259663 296120495 299761862 302875936 305491030 307762891 309897512 312157631 314837337
1156.4 314837337 318196774 322465003 327922493 334769756 342951804 352169812 361996502 371982157
1172.7 371982157 381778479 391155034 400038540 408391684 415935874 422252148 427019179 430093288
1189.1 430093288 431565523 431856066 431686491 431839526 432968915 435578078 439764708 445004284 450485945
1207.4 450485945 455551803 459916204 463590324 466683269 469403237 472016692 474648267 477304757
1223.7 477304757 480085284 483142078 486464709 489946485 493581265 497423947 501383901 505182266
$$ packed form
1103.4C12760621O63489M08203k9445p48962j662165k808839m390866o263107p088959
1121.8B90839970n297869j853884N53370J245111Q85993J80126M51356J922250L333240
1140.1B92259663L860832L641367L114074K615094K271861K134621K260119K679706
1156.4C14837337L359437M268229N457490O847263Q182048R218008R826690R985655
1172.7C71982157R796322R376555Q883506Q353144P544190O316274M767031L074109
1189.1D30093288J472235K90543j69575J53035J129389K609163M186630N239576N481661
1207.4D50485945N065858M364401L674120L092945K719968K613455K631575K656490
1223.7D77304757K780527L056794L322631L481776L634780L842682L959954L798365
$$ plain form
1240.1 505182266 508636892 511775911 514549315 516739190 518297493 519453108 520404935 521294415 522425354
1258.4 522425354 524131954 526529372 529588878 533348680 537866712 543013394 548526704 554285824
1274.7 554285824 560304642 566510558 572783470 579132557 585650921 592303455 598899662 605352998
1291 605352998 611637175 617543817 622892201 627770543 632260561 636200249 639490664 642314494 644812286
1309.4 644812286 646864176 648404002 649654686 650869787 652035773 653185785 654554129 656145275
1325.7 656145275 657636285 658788800 659594119 659967184 659862339 659518480 659237504 659056842 658947051
1344.1 658947051 659032464 659332097 659590423 659593642 659401715 659066379 658507884 657560587 656099975 654273868
1364.5 654273868 652237356 649867654 647270143 644337416 640472591 635271668 626941741 612581611
$$ packed form
1240.1E05182266L454626L139019K773404K189875J558303J155615R51827Q89480J130939
1258.4E22425354J706600K397418L059506L759802M518032N146682N513310N759120
1274.7E54285824O018818O205916O272912O349087O518364O652534O596207O453336
1291F05352998O284177N906642N348384M878342M490018L939688L290415K823830K497792
1309.4F44812286K051890J539826J250684J215101J165986J150012J368344J591146
1325.7F56145275J491010J152515Q05319L73065j04845l43859k80976j80662j09791
1344.1F58947051Q5413K99633K58326L219j91927l35336n58495r47297j460612j826107
1364.5F54273868k036512k369702k597511k932727l864825n200923q329927j4360130
$$ plain form
1380.8 612581611 596131206 589732051 598850369 612688839 620576501 623829424 624946773 624543726
1397.1 624543726 622865915 620375454 617515326 614351034 611225069 608419120 605943739 603934765
1413.4 603934765 602438331 601222992 600218534 599561512 599126160 598731577 598481119 598460674 598596275
1431.8 598596275 598954737 599950135 601516366 602885008 604359031 606240392 608650863 611739933 615312696
1450.1 615312696 619253993 623922586 631145597 640978694 648567379 654954851 662651300 670895159
1466.4 670895159 678091288 685651958 695273638 704432070 711135864 716311455 720450580 723775804
1482.8 723775804 726209879 727801561 728349507 727743208 726599693 724939525 722181857 718725204 715443909
1501.1 715443909 712453127 708642483 702082038 695736349 690747321 686004341 681604445 677716672
$$ packed form
1380.8F12581611j6450405o399155R118318J3838470P887662L252923J117349m03047
1397.1F24543726j677811k490461k860128l164292l125965k805949k475381k008974
1413.4F03934765j496434j215339j004458o57022m35352l94583k50458k0445J35601
1431.8E98596275L58462R95398J566231J368642J474023J881361K410471L089070L572763
1450.1F15312696L941297M668593P223011R833097P588685O387472P696449Q243859
1466.4F70895159P196129P560670R621680R158432O703794N175591M139125L325224
1482.8G23775804K434075J591682N47946o06299j143515j660168k757668l456653l281295
1501.1G15443909k990782l810644o560445o345689m989028m742980m399896l887773
$$ plain form
1517.4 677716672 674443185 671087801 667806923 664955676 662087858 659615159 657497704 655259430
1533.7 655259430 653361201 652012885 650696933 649306297 648185790 647384405 647075415 647230268 647656083
1552.1 647656083 648241222 648921967 649403930 648860753 647606313 645939708 643752635 640449584 635657728
1570.5 635657728 630835176 625405967 617376149 609082103 601521194 593175888 584123611 574756980
1586.8 574756980 565246344 555593967 545885861 536165118 526726425 517659247 508687854 499863833
1603.1 499863833 491425693 483127773 474652737 466498047 459072888 451246142 442254007 434998542
1619.4 434998542 428949803 422194928 415784389 410243571 405387193 401750982 399115086 397177607
1635.7 397177607 396445006 396713734 397858977 399906814 403640896 408711880 412560403 417555451 426452190
$$ packed form
1517.4F77716672l273487l355384l280878k851247k867818k472699k117455k238274
1533.7F55259430j898229j348316j315952j390636j120507q01385l08990J54853M25815
1552.1F47656083N85139O80745M81963n43177j254440j666605k187073l303051m791856
1570.5F35657728m822552n429209q029818q294046p560909q345306r052277r366631
1586.8E74756980r510636r652377r708106r720743r438693r067178q971393q824021
1603.1D99863833q438140q297920q475036q154690p425159p826746q992135p255465
1619.4D34998542o048739o754875o410539n540818m856378l636211k635896j937479
1635.7C97177607p32601K68728J145243K047837L734082N070984L848523M995048Q896739
$$ plain form
1654.1 426452190 433049619 438189417 444537550 452694595 461381018 468870580 477402598 488057613
1670.4 488057613 497540504 507308662 518421829 528281450 537314355 548079073 562930226 575590849
1686.7 575590849 585466802 595896006 605595946 616273105 628555417 640789866 654703915 665826201
1703 665826201 674928486 684337974 692306519 699077666 705348969 711536050 718211591 723916829 728100479
1721.4 728100479 732085049 736227870 740075946 743817210 747471035 751611352 755678058 758790731
1737.7 758790731 762210667 766073406 769791245 773472309 777339935 781377077 785135031 788220048
1754 788220048 791150630 794056296 796584785 798997164 801199853 803101599 804945290 806837201 808725357
1772.4 808725357 810360193 811711192 813112855 814591050 815950513 817232013 818581998 819970846
$$ packed form
1654.1D26452190O597429N139798O348133Q157045Q686423P489562Q532018J0655015
1670.4D88057613R482891R768158J1113167R859621R032905J0764718J4851153J2660623
1686.7E75590849R875953J0429204R699940J0677159J2282312J2234449J3914049J1122286
1703F65826201R102285R409488P968545O771147O271303O187081O675541N705238M183650
1721.4G28100479L984570M142821L848076L741264L653825M140317M066706L112673
1737.7G58790731L419936L862739L717839L681064L867626M037142L757954L085017
1754G88220048K930582K905666K528489K412379K202689J901746J843691J891911J888156
1772.4H08725357J634836J350999J401663J478195J359463J281500J349985J388848
$$ plain form
1788.7 819970846 821261346 822452724 823521614 824546158 825506806 826367676 827207148 828047216 828835428
1807 828835428 829569995 830296040 830921233 831456125 832017303 832659960 833267748 833797336 834336102 834896684
1827.4 834896684 835385799 835787475 836190760 836595833 836998463 837411642 837847233 838249743 838587523 838851511
1847.8 838851511 839106500 839434266 839772820 840063989 840330005 840617061 840897977 841200829 841549218 841834724
1868.2 841834724 841968119 842058837 842221081 842450798 842673779 842831552 842977405 843169451 843367457 843492806
1888.6 843492806 843605161 843747854 843819320 843846619 843961835 844138861 844228923 844254792 844323516 844388425 844392836
1911.1 844392836 844414413 844518065 844594896 844545901 844485223 844496727 844489336 844411254 844372451 844391227 844307899
1933.5 844307899 844141364 844098985 844159007 844088674 843841970 843635857 843526602 843358338 843125105 842963755
$$ packed form
1788.7H19970846J290500J191378J068890J024544R60648Q60870Q39472Q40068P88212
1807H28835428P34567P26045O25193N34892N61178O42657O07788N29588N38766N60582
1827.4H34896684M89115M01676M03285M05073M02630M13179M35591M02510L37780K63988
1847.8H38851511K54989L27766L38554K91169K66016K87056K80916L02852L48389K85506
1868.2H41834724J33395R0718J62244K29717K22981J57773J45853J92046J98006J25349
1888.6H43492806J12355J42693P1466K7299J15216J77026R0062K5869O8724O4909M411
1911.1H44392836K1577J03652P6831m8995o0678J1504p391p8082l8803J8776q3328
1933.5H44307899j66535m2379O0022p0333k46704k06113j09255j68264k33233j61350
$$ plain form
1953.9 842963755 842838407 842628002 842408359 842280984 842167556 841939032 841652036 841452301 841291666 841068089
1974.3 841068089 840838492 840697229 840552926 840313673 840111852 840027750 839906156 839667857 839415431 839195013
1994.7 839195013 838939726 838652670 838434875 838264525 838034391 837755084 837516963 837292314 837037385 836791456
2015.1 836791456 836539388 836247742 835930943 835662603 835467160 835260928 834983885 834692597 834441900 834202766
2035.5 834202766 833961308 833735824 833532095 833342791 833137453 832888544 832654834 832487106 832347572 832165122
2055.9 832165122 831953526 831788123 831656873 831492186 831310034 831190944 831089079 830949664 830847025 830803156
2076.3 830803156 830701292 830525458 830419123 830390215 830303907 830160022 830063581 829995155 829898894 829820514 829829276
2098.7 829829276 829870522 829849839 829811156 829836547 829868317 829804301 829724729 829751432 829804897 829779267 829789937
$$ packed form
1953.9H42963755j25348k10405k19643j27375j13428k28524k86996j99735j60635k23577
1974.3H41068089k29597j41263j44303k39253k01821q4102j21594k38299k52426k20418
1994.7H39195013k55287k87056k17795j70350k30134k79307k38121k24649k54929k45929
2015.1H36791456k52068k91646l16799k68340j95443k06232k77043k91288k50697k39134
2035.5H34202766k41458k25484k03729j89304k05338k48909k33710j67728j39534j82450
2055.9H32165122k11596j65403j31250j64687j82152j19090j01865j39415j02639m3869
2076.3H30803156j01864j75834j06335k8908q6308j43885r6441o8426r6261p8380Q762
2098.7H29829276M1246k0683l8683K5391L1770o4016p9572K6703N3465k5630J0670
$$ plain form
2121.1 829789937 829917371 830012977 830011845 830062389 830210268 830309391 830323637 830383480 830531478 830638707 830684602
2143.6 830684602 830790877 830949903 831032693 831064641 831213892 831421077 831522048 831590652 831750512 831936359
2164 831936359 832050443 832133114 832284689 832469165 832568645 832656682 832846582 833029389 833097398 833156049 833301246
2186.4 833301246 833443582 833494604 833540797 833643019 833689570 833686888 833773971 833912492 833967865 833971798 834050119
2208.8 834050119 834177971 834215224 834168851 834198475 834290266 834298015 834275603 834333599 834389865 834355652 834327638
2231.3 834327638 834374607 834378898 834301889 834285080 834352195 834363580 834289074 834237337 834236920 834189475 834084034 834058821
2255.8 834058821 834131122 834139228 834062636 834042907 834103823 834126055 834094763 834129930 834223688 834275007 834329188 834506273
2280.2 834506273 834727108 834814191 834810138 834870100 834944844 834935248 834960461 835096300 835191011 835166752 835187018
$$ packed form
2121.1H29789937J27434R5606j132N0544J47879R9123J4246N9843J47998J07229M5895
2143.6H30684602J06275J59026Q2790L1948J49251K07185J00971O8604J59860J85847
2164H31936359J14084Q2671J51575J84476R9480Q8037J89900J82807O8009N8651J45197
2186.4H33301246J42336N1022M6193J02222M6551k682Q7083J38521N5373L933P8321
2208.8H34050119J27852L7253m6373K9624R1791P749k2412N7996N6266l4213k8014
2231.3H34327638M6969M291p7009j6809O7115J1385p4506n1737m17m7445j05441k5213
2255.8H34058821P2301Q106p6592j9729O0916K2232l1292L5167R3758N1319N4181J77085
2280.2H34506273K20835Q7083m053N9962P4744r596K5213J35839R4711k4259K0266
$$ plain form
2302.7 835187018 835311353 835400045 835421801 835460603 835577786 835738063 835798442 835738480 835718691 835782409 835850954
2325.1 835850954 835944951 836134613 836325765 836434484 836525679 836584330 836551666 836483717 836587071 837005258
2345.5 837005258 837496877 837732434 837717474 837600946 837442338 837357879 837402463 837478757 837669849 838105023
2365.9 838105023 838636816 839067101 839402914 839777827 840235353 840713143 841140866 841523468 841913760 842229426
2386.3 842229426 842386007 842490673 842656910 842812419 842891872 842989385 843152344 843267977 843268216 843284070 843397498
2408.7 843397498 843483627 843466401 843460500 843525589 843519270 843334198 843070865 842876196 842790425 842852414 843085587
2431.2 843085587 843341827 843417108 843347013 843341589 843416870 843407810 843310177 843276799 843293846 843218207 843090236
2453.6 843090236 843065560 843091190 843002796 842864871 842842460 842848778 842728734 842621744 842633724 842565358 842350423
$$ packed form
2302.7H35187018J24335Q8692K1756L8802J17183J60277O0379n9962j9789O3718O8545
2325.1H35850954R3997J89662J91152J08719R1195N8651l2664o7949J03354M18187
2345.5H37005258M91619K35557j4960j16528j58608q4459M4584P6294J91092M35174
2365.9H38105023N31793M30285L35813L74913M57526M77790M27723L82602L90292L15666
2386.3H42229426J56581J04666J66237J55509P9453R7513J62959J15633K39J5854J13428
2408.7H43397498Q6129j7226n901O5089o319j85072k63333j94669q5771O1989K33173
2431.2H43085587K56240P5281p0095n424P5281r060r7633l3378J7047p5639j27971
2453.6H43090236k4676K5630q8394j37925k2411O318j20044j06990J1980o8366k14935
$$ plain form
2476 842350423 842212737 842217863 842129529 841902792 841784775 841796935 841713190 841519952 841431797 841438532 841318190
2498.5 841318190 841103375 841007769 840985835 840839267 840648651 840602756 840585589 840412855 840200186 840128899
2518.9 840128899 840092957 839920461 839730501 839666843 839594662 839411139 839260817 839210987 839118838 838924706
2539.2 838924706 838764548 838700891 838590562 838383496 838231504 838168919 838059962 837877095 837718248 837577522
2559.6 837577522 837369919 837145686 837005615 836902797 836709261 836431205 836195350 835996568 835722685 835397959
2580 835397959 835155189 834970236 834687233 834321558 834014833 833744645 833367050 832921088 832560956 832234561
2600.4 832234561 831795394 831316531 830933690 830548465 830042779 829534411 829135597 828741372 828252077 827743828
2620.8 827743828 827312529 826894104 826397598 825903952 825472236 825007021 824484050 823999107 823574662 823143184
$$ packed form
2476H42350423j37686N126q8334k26737j18017J2160q3745j93238q8155O735j20342
2498.5H41318190k14815r5606k1934j46568j90616m5895j7167j72734k12669p1287
2518.9H40128899l5942j72496j89960o3658p2181j83523j50322m9830r2149j94132
2539.2H38924706j60158o3657j10329k07066j51992o2585j08957j82867j58847j40726
2559.6H37577522k07603k24233j40071j02818j93536k78056k35855j98782k73883l24726
2580H35397959k42770j84953k83003l65675l06725k70188l77595m45962l60132l26395
2600.4H32234561m39167m78863l82841l85225n05686n08368l98814l94225m89295n08249
2620.8H27743828m31299m18425m96506m93646m31716m65215n22971m84943m24445m31478
$$ plain form
2641.2 823143184 822675109 822239280 821841598 821367085 820836782 820392787 820021808 819597602 819135129 818728030
2661.6 818728030 818326056 817841649 817343295 816942215 816577613 816101849 815575659 815142870 814709663 814168036
2682 814168036 813648760 813254476 812839568 812301457 811760008 811286211 810782969 810197592 809628010 809126318
2702.4 809126318 808596134 807978451 807364047 806822658 806260526 805612922 804988325 804448187 803864300 803204894
2722.8 803204894 802608550 802043021 801376939 800699294 800146163 799647689 799070656 798420787 797807992 797255635
2743.2 797255635 796667516 796033382 795444250 794881523 794245243 793547809 792861402 792187929 791500866 790836751
2763.6 790836751 790236592 789599597 788831532 788028061 787261784 786446095 785531223 784598470 783717632 782854021
2784 782854021 781987548 781138241 780239284 779229760 778160095 777084947 775982440 774815559 773632467
$$ packed form
2641.2H23143184m68075m35829l97682m74513n30303m43995l70979m24206m62473m07099
2661.6H18728030m01974m84407m98354m01080l64602m75764n26190m32789m33207n41627
2682H14168036n19276l94284m14908n38111n41449m73797n03242n85377n69582n01692
2702.4H09126318n30184o17683o14404n41389n62132o47604o24597n40138n83887o59406
2722.8H03204894n96344n65529o66082o77645n53131m98474n77033o49869o12795n52357
2743.2G97255635n88119o34134n89132n62727o36280o97434o86407o73473o87063o64115
2763.6G90836751o00159o36995p68065q03471p66277q15689r14872r32753q80838q63611
2784G82854021q66473q49307q98957j009524j069665j075148j102507j166881j183092
$$ plain form
2802.3 773632467 772478044 771307111 770083189 768800735 767465472 766094804 764703393 763311327
2818.7 763311327 761906862 760428727 758835077 757156968 755463660 753753304 751905084 749834895
2835 749834895 747540653 744909167 741758108 738024175 733761489 729175508 724761307 721155584 718648136
2853.3 718648136 717004538 715808094 714702606 713396490 711690903 709516346 706948280 704202056
2869.7 704202056 701529920 699055552 696791410 694768667 692934036 691145241 689350665 687521458
2886 687521458 685586810 683516920 681368828 679217458 677014291 674663842 672236562 669829249 667335331
2904.3 667335331 664623976 661643863 658301115 654505730 650315344 646030486 642031670 638554454
2920.6 638554454 635762930 633764863 632538497 631943047 631778181 632047057 632913589 634355187 636281013
$$ packed form
2802.3G73632467j154423j170933j223922j282454j335263j370668j391411j392066
2818.7G63311327j404465j478135j593650j678109j693308j710356j848220k070189
2835G49834895k294242k631486l151059l733933m262686m585981m414201l605723k507448
2853.3G18648136j643598j196444j105488j306116j705587k174557k568066k746224
2869.7G04202056k672136k474368k264142k022743j834631j788795j794576j829207
2886F87521458j934648k069890k148092k151370k203167k350449k427280k407313k493918
2904.3F67335331k711355k980113l342748l795385m190386m284858l998816l477216
2920.6F38554454k791524j998067j226366n95450j64866K68876Q66532J441598J925826
$$ plain form
2939 636281013 638677418 641310155 643731713 645657659 647072017 648058355 648615420 648810625 648927152
2957.4 648927152 649178088 649548888 649918914 650260568 650622249 650975049 651329696 651736259 652151942 652626157
2977.8 652626157 653240502 653861821 654387474 654884279 655390203 655872285 656142473 655995190 655551851 654888868
2998.1 654888868 653904915 652747929 651581585 650385499 649199247 648088634 646925032 645528018
3014.5 645528018 643911779 642173827 640397310 638645351 636857271 634942591 632967114 631039500
3030.8 631039500 629139662 627094090 624843895 622607112 620452046 618166506 615672588 613112688
3047.1 613112688 610593140 608067036 605482161 602890670 600284338 597634554 595026612 592502177
3063.4 592502177 590040207 587597251 585061431 582439780 579911768 577571392 575277448 572809875
$$ packed form
2939F36281013K396405K632737K421558J925946J414358R86338N57065J95205J16527
2957.4F48927152K50936L70800L70026L41654L61681L52800L54647M06563M15683M74215
2977.8F52626157O14345O21319N25653M96805N05924M82082K70188j47283m43339o62983
2998.1F54888868r83953j156986j166344j196086j186252j110613j163602j397014
3014.5F45528018j616239j737952j776517j751959j788080j914680j975477j927614
3030.8F31039500j899838k045572k250195k236783k155066k285540k493918k559900
3047.1F13112688k519548k526104k584875k591491k606332k649784k607942k524435
3063.4E92502177k461970k442956k535820k621651k528012k340376k293944k467573
$$ plain form
3079.7 572809875 570160449 567465246 564771473 562104046 559472501 556784630 554010153 551252127
3096 551252127 548557758 545823574 542926669 539932966 537039757 534246206 531320691 528266370 525281250
3114.4 525281250 522321999 519231558 515935600 512474060 509024322 505685627 502372444 498986036
3130.7 498986036 495525599 492088437 488724023 485325933 481744230 478026450 474355608 470759004
3147 470759004 467216790 463706791 460080594 456246018 452335864 448518306 444787711 441035479 437213719
3165.4 437213719 433361799 429528147 425730020 421943218 418147713 414368182 410619408 406846076
3181.7 406846076 403038085 399258524 395527422 391827196 388146192 384468824 380759567 377051115
3198 377051115 373417944 369858027 366346627 362904638 359513581 356125206 352757931 349455953 346225411
$$ packed form
3079.7E72809875k649426k695203k693773k667427k631545k687871k774477k758026
3096E51252127k694369k734184k896905k993703k893209k793551k925515l054321k985120
3114.4E25281250k959251l090441l295958l461540l449738l338695l313183l386408
3130.7D98986036l460437l437162l364414l398090l581703l717780l670842l596604
3147D70759004l542214l509999l626197l834576l910154l817558l730595l752232l821760
3165.4D37213719l851920l833652l798127l786802l795505l779531l748774l773332
3181.7D06846076l807991l779561l731102l700226l681004l677368l709257l708452
3198C77051115l633171l559917l511400l441989l391057l388375l367275l301978l230542
$$ plain form
3216.4 346225411 343030214 339855731 336721003 333659977 330693573 327803195 324986488 322251618
3232.7 322251618 319513112 316738874 314050674 311490834 309023529 306645304 304311424 301976621
3249 301976621 299685717 297453105 295241982 293036669 290836573 288640827 286443084 284292161 282230109
3267.4 282230109 280192852 278091460 275932819 273760587 271602482 269477129 267358512 265226156
3283.7 265226156 263100356 261004150 258965522 256957322 254872501 252684265 250463188 248293832
3300 248293832 246228322 244253337 242272511 240151122 237875417 235571429 233344212 231210142 229126364
3318.4 229126364 227060303 225049227 223096654 221101165 219014183 216942310 215001494 213223517
3334.7 213223517 211548477 209801152 207898334 205977410 204121709 202367082 200776055 199174747
$$ packed form
3216.4C46225411l195197l174483l134728l061026k966404k890378k816707k734870
3232.7C22251618k738506k774238k688200k559840k467305k378225k333880k334803
3249C01976621k290904k232612k211123k205313k200096k195746k197743k150923k062052
3267.4B82230109k037257k101392k158641k172232k158105k125353k118617k132356
3283.7B65226156k125800k096206k038628k008200k084821k188236k221077k169356
3300B48293832k065510j974985j980826k121389k275705k303988k227217k134070k083778
3318.4B29126364k066061k011076j952573j995489k086982k071873j940816j777977
3334.7B13223517j675040j747325j902818j920924j855701j754627j591027j601308
$$ plain form
3351 199174747 197387263 195575088 193970591 192560613 191172704 189770982 188517272 187414855 186208412
3369.3 186208412 184758589 183308944 182156309 181218982 180322930 179431483 178623438 178007156 177648783
3387.7 177648783 177513361 177345827 176924139 176456526 176375240 176574439 176485464 176054537 175839514 176021844
3408.1 176021844 176325887 176597774 176779807 176923454 177254468 177796558 178368539 179062814 180033699 181166962
3428.5 181166962 182246760 183354169 184605718 185724750 186580896 187528595 188797563 190274641 191875592
3446.8 191875592 193497986 195141837 196910188 198828444 200930923 203178227 205325425 207454175
3463.2 207454175 209966376 212696701 215058893 216968298 218947828 221305937 224022880 226818129
3479.5 226818129 229353905 231813714 234542117 237382933 240140155 243006349 246096447 249331340
$$ packed form
3351A99174747j787484j812175j604497j409978j387909j401722j253710j102417j206443
3369.3A86208412j449823j449645j152635r37327q96052q91447q08045o16282l58373
3387.7A77648783j35422j67534m21688m67613q1286J99199q8975m30927k15023J82330
3408.1A76021844L04043K71887J82033J43647L31014N42090N71981O94275R70885J133263
3428.5A81166962J079798J107409J251549J119032Q56146R47699J268968J477078J600951
3446.8A91875592J622394J643851J768351J918256K102479K247304K147198K128750
3463.2B07454175K512201K730325K362192J909405J979530K358109K716943K795249
3479.5B26818129K535776K459809K728403K840816K757222K866194L090098L234893
$$ plain form
3495.8 249331340 252474755 255524993 258696675 261828154 264713854 267712653 271171838 274917692
3512.1 274917692 278529614 281867057 285271734 289024115 293177009 297301084 301060319 304837823
3528.4 304837823 308904320 313164681 317638963 322230995 326677203 331204861 336062342 341107219
3544.7 341107219 345947891 350493103 355192959 360318869 365554988 370775610 376273751 381918132
3561.1 381918132 387231857 392603248 399233371 406231433 412252605 418017805 424253911 430897355
3577.4 430897355 437801331 444822639 451682925 458627284 466313899 474115372 481098861 488179475
3593.7 488179475 495984405 503966987 511940539 519903004 527450979 534759104 542785108 551217198
3610 551217198 559355736 567461431 575257421 583288550 592117369 600110471 606842995 613325119 621438920
$$ packed form
3495.8B49331340L143415L050238L171682L131479K885700K998799L459185L745854
3512.1B74917692L611922L337443L404677L752381M152894M124075L759235L777504
3528.4C04837823M066497M260361M474282M592032M446208M527658M857481N044877
3544.7C41107219M840672M545212M699856N125910N236119N220622N498141N644381
3561.1C81918132N313725N371391O630123O998062O021172N765200O236106O643444
3577.4D30897355O903976P021308O860286O944359P686615P801473O983489P080614
3593.7D88179475P804930P982582P973552P962465P547975P308125Q026004Q432090
3610E51217198Q138538Q105695P795990Q031129Q828819P993102O732524O482124Q113801
$$ plain form
3628.4 621438920 630753160 638269126 645018280 651902258 658632278 665270627 671690524 677618802
3644.7 677618802 683501542 690481603 697584987 702792108 707214534 712471306 717745781 722140968
3661 722140968 726139128 729973614 733523428 737200618 741153598 744348109 747330546 750592113 753318608
3679.4 753318608 755798399 758362412 760909677 763521850 766056061 768073857 769824803 771607518
3695.7 771607518 773286581 774763882 776304722 777979493 779516995 780810177 781894684 782999992
3712 782999992 784246981 785366297 786321759 787271440 788209498 788957417 789641976 790566802 791560590 792433202
3732.4 792433202 793266475 794206142 795161664 795825362 796022296 796290338 797077656 797558308 797749937 798391461
3752.8 798391461 799247324 799809992 800143361 800576806 801028311 801427841 801817060 802115023 802478671 802990139
$$ packed form
3628.4F21438920R314240P515966O749154O883978O730020O638349O419897N928278
3644.7F77618802N882740O980061P103384N207121M422426N256772N274475M395187
3661G22140968L998160L834486L549814L677190L952980L194511K982437L261567K726495
3679.4G53318608K479791K564013K547265K612173K534211K017796J750946J782715
3695.7G71607518J679063J477301J540840J674771J537502J293182J084507J105308
3712G82999992J246989J119316R55462R49681R38058P47919O84559R24826R93788Q72612
3732.4G92433202Q33273R39667R55522O63698J96934K68042P87318M80652J91629O41524
3752.8G98391461Q55863N62668L33369M33445M51505L99530L89219K97963L63648N11468
$$ plain form
3773.2 802990139 803546965 804076135 804447472 804686010 804848731 805001915 805262625 805639088 806055546 806357503
3793.6 806357503 806621373 806997418 807163894 807206154 807486892 807607591 807712138 808098674 808496177 808689594
3814 808689594 808865488 809177518 809154570 809083343 809294403 809478998 809680343 809897840 810162783 810542107
3834.4 810542107 810702205 810483694 810381293 810549200 810795486 811071038 811332464 811237812 810463309 810151339
3854.8 810151339 810737193 811220348 811407208 811438978 811508775 811538219 811355233 811281502 811390460 811582506
3875.2 811582506 811773241 811729074 811736584 811899662 811953485 811956048 811858237 811777174 811958909 812181234 812194824
3897.6 812194824 812039614 811924756 811947823 812035441 812061191 812007666 811997414 812036693 812055945 812137604 812268615
3920 812268615 812264860 812152982 812142134 812234402 812255621 812246144 812344432 812436104 812447608 812448502 812469602 812545538
$$ packed form
3773.2H02990139N56826N29170L71337K38538J62721J53184K60710L76463M16458L01957
3793.6H06357503K63870L76045J66476M2260K80738J20699J04547L86536L97503J93417
3814H08689594J75894L12030k2948p1227K11060J84595K01345K17497K64943L79324
3834.4H10542107J60098k18511j02401J67907K46286K75552K61426r4652p74503l11970
3854.8H10151339N85854M83155J86860L1770O9797K9444j82986p3731J08958J92046
3875.2H11582506J90735m4167P510J63078N3823K563r7811q1063J81735K22325J3590
3897.6H12194824j55210j14858K3067Q7618K5750n3525j0252L9279J9252Q1659J31011
3920H12268615l755j11878j0848R2268K1219r477R8288R1672J1504Q94K1100P5936
$$ plain form
3944.5 812545538 812646449 812680840 812643826 812633097 812678039 812727332 812814355 812949002 813079417 813190162 813246071
3966.9 813246071 813277364 813368022 813487947 813593566 813716769 813852966 813990831 814103663 814130664 814111829
3987.3 814111829 814142346 814252257 814408422 814568043 814702868
3997.5 814702868
$$ packed form
3944.5H12545538J00911L4391l7014j0729M4942M9293Q7023J34647J30415J10745N5909
3966.9H13246071L1293R0658J19925J05619J23203J36197J37865J12832K7001j8835
3987.3H14111829L0517J09911J56165J59621J34825
3997.5H14702868
##END=$$ End of the data block
