##TITLE=$$ Begin of the data block
##JCAMP-DX=5.00 $$ ACD/SpecManager v 10.08
##SPECTROMETER/DATA SYSTEM=Alpha
##DATE=10 Apr 2014 11:00:52
##DATA TYPE=INFRARED SPECTRUM
##DATA CLASS=XYDATA
##ORIGIN=
##OWNER=
##NPOINTS=1765
##FIRSTX=399.75695801
##LASTX=3997.56933594
##MAXX=3997.56933594
##MINX=399.75695801
##MAXY=0.84468585
##MINY=0.17588359
##XFACTOR=1.0000000000
##YFACTOR=1.000000000000000e-9
##FIRSTY=0.56295043
##DELTAX=2.03957629
##XUNITS=1/CM
##YUNITS=ARBITRARY UNITS
##XYDATA=(X++(Y..Y))
399.8E62950432j584053j936614j804233j048267n16712q04246j164913q58724n01633
418.1E52731037r34064j003623l10600k08855o67035p06494o67036j152098j564443
436.5E45516789j045346l16859l06010l61502j20223l30448o24299j68741Q7500p96676
456.9E41534185j630008j296222q25048q86797j014650q62360j103103j761258j561165
475.2E30593574r00865q80062j014292n72384j76787o47664j131773j012027j126886
493.6E23130834j578450j461268q39412p46369j238346j220525q18669r80974j404285
511.9E12842536j327097j053989j370013j942992j807809j452089j736521k036512
528.3E00115514j653761j366645j595378j586467j066744p92593j048535j152605r51648
$$ plain form
399.8 562950432 561366379 559429765 557625532 556577265 556060553 555256307 554091394 553232670 552731037
418.1 552731037 551796973 550793350 550482750 550273895 549606860 548900366 548233330 547081232 545516789
436.5 545516789 544471443 544154584 543848574 543487072 543366849 543036401 542412102 542243361 542330861 541534185
456.9 541534185 539904177 538607955 537782907 536896110 535881460 535019100 533915997 532154739 530593574
475.2 530593574 529692709 528812647 527798355 527225971 527049184 526401520 525269747 524257720 523130834
493.6 523130834 521552384 520091116 519251704 518505335 517266989 516046464 515227795 514246821 512842536
511.9 512842536 511515439 510461450 509091437 507148445 505340636 503888547 502152026 500115514
528.3 500115514 498461753 497095108 495499730 493913263 492846519 492053926 491005391 489852786 488901138
546.6D88901138j003325j285284j336992j230777j426726j863271j972944j883179
562.9D76898640k178281k615005k815425k935261k969205k780289k435296k301544
579.2D55868334k503843k568334k469271k499461k676458k799898k714276k617121
595.6D35019672k638161k839476l321648l654301l043026j719951p65801o36607n48274
613.9D15852427K89619J857728L475785M373253M579186M451216M374563M332572M070044
632.3D47656393L740847L539711L057450J970947Q11488R02086K408415L442467K659112
650.6D70188916O19381o59138J242489N457640P605165O443322M384339M086434N285740
669E04654288L947318L092229L481329L461659L109038K926945K805412K468824K175808
$$ plain form
546.6 488901138 487897813 486612529 485275537 484044760 482618034 480754763 478781819 476898640
562.9 476898640 474720359 472105354 469289929 466354668 463385463 460605174 458169878 455868334
579.2 455868334 453364491 450796157 448326886 445827425 443150967 440351069 437636793 435019672
595.6 435019672 432381511 429542035 426220387 422566086 419523060 417803109 417037308 416400701 415852427
613.9 415852427 416142046 417999774 421475559 425848812 430427998 434879214 439253777 443586349 447656393
632.3 447656393 451397240 454936951 457994401 459965348 460776836 461678922 464087337 467529804 470188916
650.6 470188916 470808297 470149159 471391648 476849288 484454453 490897775 495282114 499368548 504654288
669 504654288 508601606 511693835 515175164 518636823 521745861 524672806 527478218 529947042 532122850
687.3E32122850K146960J981795J469671J160503J280844J399934J365960J613617
703.7E44542134K087116K218604K129853K390444K809167K804577K672375K897858
720E64552128L081799K828061K631069K685010K583325K251625K134264K288460K179683
738.3E87215424J908302J994491K251148K168953K027273K184570K276421K107203
754.6F04133785K104103K365888K419590K151967J992046K087951J973391J534879
771F20763600J104474P72893K95699l51608p96199q88824q21292m95315M42564J727641
791.4F21753633K882719L956258N119205O074369O495476O482541O217301N665064
807.7F64646566M800260L875494L037631K255917J311779J12236j092613k204955l293276
$$ plain form
687.3 532122850 534269810 536251605 537721276 538881779 540162623 541562557 542928517 544542134
703.7 544542134 546629250 548847854 550977707 553368151 556177318 558981895 561654270 564552128
720 564552128 567633927 570461988 573093057 575778067 578361392 580613017 582747281 585035741 587215424
738.3 587215424 589123726 591118217 593369365 595538318 597565591 599750161 602026582 604133785
754.6 604133785 606237888 608603776 611023366 613175333 615167379 617255330 619228721 620763600
771 620763600 621868074 622640967 622936666 622585058 621788859 620900035 620078743 619583428 620025992 621753633
791.4 621753633 624636352 628592610 633711815 639786184 646281660 652764201 658981502 664646566
807.7 664646566 669446826 673322320 676359951 678615868 679927647 680039883 678947270 676742315 673449039
826F73449039m181087m620432m791618m901051m757285m290104l879428l701866l405511
844.4F34920657k583921j177192P60972L189028N740821P816494R178638J0035992
860.7F67881489J0384321J0059357R307503Q417905P252395N792141M418373L297865
877G26811349K195597J001835k7239p85828j483858k115786k314746j942158j239955
895.4G20099211l25024P94112J723409K021790J857996J520633R04560j78456j538336
913.7G26879895k754987l752529m525542m634977l777265k416730j104832J21593J085282
932.1G05119908J363098J098276Q66413P84039N35369O9499l89695r38833j909196
950.4G06598878l172159m332960n471408o915629q562386j0182798j1949718j3939679
$$ plain form
826 673449039 669267952 664647520 659855902 654954851 650197566 645907462 642028034 638326168 634920657
844.4 634920657 632336736 631159544 631920516 635109544 640850365 648666859 657845497 667881489
860.7 667881489 678265810 688325167 697632670 706050575 713302970 719095111 723513484 726811349
877 726811349 729006946 730008781 729981542 729195714 727711856 725596070 723281324 721339166 720099211
895.4 720099211 719774187 720568299 722291708 724313498 726171494 727692127 728596687 728418231 726879895
913.7 726879895 724124908 720372379 715846837 711211860 707434595 705017865 703913033 704034626 705119908
932.1 705119908 706483006 707581282 708447695 709231734 709767103 709836602 709446907 708508074 706598878
950.4 706598878 703426719 699093759 693622351 686706722 678144336 667961538 656011820 642072141
966.8F42072141j5636027j6456425j6290128j5223324j3402999j1321366r573579q348763
983.1E35819530p490634o825686o277680n683124m891873m039287l316880k737522
999.4D94556844k283990k136856k570749l528654m643202n657822o390333o676346
1015.7D60668892o536603o175280n777121n400270n061894m772723m508972m204303
1032D18231726l816992l368497k950490k645701k481967k402216k411187k532393k564072
1050.4C93058211k191633j305819j94430P73191J305103J113505J26302j380414l085554
1068.7C88218462m617840n603700n991668n950689n767525n621880n642801n937696
1085C43084663o385118o691962o465137n429685l785908k010256m83454M66138P75576
$$ plain form
966.8 642072141 626436114 609979689 593689561 578466237 565063238 553741872 544168293 535819530
983.1 535819530 528328896 521503210 515225530 509542406 504650533 500611246 497294366 494556844
999.4 494556844 492272854 490135998 487565249 484036595 479393393 473735571 467345238 460668892
1015.7 460668892 454132289 447957009 442179888 436779618 431717724 426945001 422436029 418231726
1032 418231726 414414734 411046237 408095747 405450046 402968079 400565863 398154676 395622283 393058211
1050.4 393058211 390866578 389560759 389366329 390139520 391444623 392558128 392684430 391304016 388218462
1068.7 388218462 383600622 377996922 372005254 366054565 360287040 354665160 349022359 343084663
1085 343084663 336699545 330007583 323542446 318112761 314326853 312316597 311833143 312299281 313074857
1103.4C13074857O75946L86775q5384p68661j636863k776176m398316o294668p078349
1121.8B91099161n281180j906991M80294J239270R11295J95682M61191J906991L317386
1140.1B92423099L860653L625065L075540K569079K250433K159953K304018K712250
1156.4C14980090L380179M277140N451947O837577Q167297R179890R785086R974718
1172.7C72033924R780794R329617Q856833Q336604P496863O283969M785121L122121
1189.1D30025846J504183K81900k08467J37150J194596K671093M164457N211204N491198
1207.4D50473160N086898M375816L653317L067136K720416K612710K624243K659083
1223.7D77272779K773434L065169L380328L527284L642916L835291L945351L829598
$$ plain form
1103.4 313074857 313750803 314137578 314052194 313283533 311646670 308870494 304472178 298177510 291099161
1121.8 291099161 285817981 283910990 284391284 285630554 286541849 286737531 287198722 289105713 292423099
1140.1 292423099 296283752 299908817 302984357 305553436 307803869 309963822 312267840 314980090
1156.4 314980090 318360269 322637409 328089356 334926933 343094230 352274120 362059206 372033924
1172.7 372033924 381814718 391144335 400001168 408337772 415834635 422118604 426903725 430025846
1189.1 430025846 431530029 431811929 431603462 431740612 432935208 435606301 439770758 444981962 450473160
1207.4 450473160 455560058 459935874 463589191 466656327 469376743 471989453 474613696 477272779
1223.7 477272779 480046213 483111382 486491710 490018994 493661910 497497201 501442552 505272150
1240.1E05272150L535807L172994K716243K120853J545012J191139J000225Q87692
1256.4E21442115J089692J708091K408623L031671L736794M491330N103826N478800
1272.7E48490942N739092O043077O246686O259382O307482O507337O679535O621123
1289E98894656O435632O255389N921125N381107M883409M483759L933072L286243K849281
1307.4F42323673K530217K046764J521706J263142J246035J181424J144707J389682
1323.7F54647350J637101J490236J112342P72655L63588p8738k93612k47240j74999
1342F59228683j06276P9632K80321K56956L218k26021l61979n52356r32097j416087
1362.4F56253994j777411k051532k416015k610505k921938l866435n210697q344770
$$ plain form
1240.1 505272150 508807957 511980951 514697194 516818047 518363059 519554198 520554423 521442115
1256.4 521442115 522531807 524239898 526648521 529680192 533416986 537908316 543012142 548490942
1272.7 548490942 554230034 560273111 566519797 572779179 579086661 585593998 592273533 598894656
1289 598894656 605330288 611585677 617506802 622887909 627771318 632255077 636188149 639474392 642323673
1307.4 642323673 644853890 646900654 648422360 649685502 650931537 652112961 653257668 654647350
1323.7 654647350 656284451 657774687 658887029 659659684 660023272 659944534 659650922 659403682 659228683
1342 659228683 659122407 659202039 659482360 659739316 659742534 659516513 659154534 658602178 657670081 656253994
1362.4 656253994 654476583 652425051 650009036 647398531 644476593 640610158 635399461 627054691
1378.7F27054691j4388323j6469717o394565R141147J3861359P890045L254056J141191
1395.1F25089884l84152j692593k505541k851963l148615l120721k817690k472282
1411.4F06096327j982212j489043j224756j012743o78301m55200l93153k39908k1756
1429.7E98599255J19150L29137R55045J537978J366795J495242J909077K404392L061056
1448.1F11777127L583789L987193M699290P198453R780406P598818O422937P702410
1464.4F62750423Q221030P174552P552206R643793R202481O728708N164385M096329
1480.7G20533907L283918K434194J626969N75959o14762j173913j687944k748490l424227
1499.1G18805611l298044l030121l812612o550610o356239m966020m702390m387557
$$ plain form
1378.7 627054691 612666368 596196651 589802086 598943233 612804592 620694637 623948693 625089884
1395.1 625089884 624705732 623013139 620507598 617655635 614507020 611386299 608568609 606096327
1411.4 606096327 604114115 602625072 601400316 600387573 599709272 599254072 598860919 598621011 598599255
1429.7 598599255 598718405 599047542 600002587 601540565 602907360 604402602 606311679 608716071 611777127
1448.1 611777127 615360916 619348109 624047399 631245852 641026258 648625076 655048013 662750423
1464.4 662750423 670971453 678146005 685698211 695342004 704544485 711273193 716437578 720533907
1480.7 720533907 723817825 726252019 727878988 728454947 727840185 726666272 724978328 722229838 718805611
1499.1 718805611 715507567 712477446 708664834 702114224 695757985 690791965 686089575 681702018
1515.4F81702018l892780l253579l328800l276229k842605k851725k468109k105415
1531.7F57682776k201676j874208j327277j272320j401723j148343p84635l00289J50264
1550.1F47522569M43875N86749O43313M68432n20348j253367j681447k201736l276467
1568.4F40731573m723012m799307n463719q074939q296550p533967q347333r087681
1584.7E84405065r379924r501934r653032r706556r710849r447455r105742r015560
1601.1E08884013q866430q481204q315176q478671q169592p443845p843077q995921
1617.4D42290097p264703o080329o791652o435781n558730m858583l632426k660990
1633.7C99006903j980215p19696L27169J204581K084881L757685N092412L858507M988402
$$ plain form
1515.4 681702018 677809238 674555659 671226859 667950630 665108025 662256300 659788191 657682776
1531.7 657682776 655481100 653606892 652279615 651007295 649605572 648457229 647672594 647372305 647522569
1550.1 647522569 647966444 648553193 649196506 649664938 649144590 647891223 646209776 644008040 640731573
1568.4 640731573 636008561 631209254 625745535 617670596 609374046 601840079 593492746 584405065
1584.7 584405065 575025141 565523207 555870175 546163619 536452770 527005315 517899573 508884013
1601.1 508884013 500017583 491536379 483221203 474742532 466572940 459129095 451286018 442290097
1617.4 442290097 435025394 428945065 422153413 415717632 410158902 405300319 401667893 399006903
1633.7 399006903 397026688 396306992 396634161 397838742 399923623 403681308 408773720 412632227 417620629
1652D17620629Q885145O638170N193799O371379Q163601Q721471P539571Q568078J0667354
1670.4D88369197R457737R728372J1115968R892643R050965J0779142J4878273J2650371
1686.7E75922668R839296J0398388R680927J0679603J2302518J2246131J3920367J1104524
1703F66094422R060562R360731P935047O765544O277144O197095O695747N717993M189968
1721.4G28294253L987968M136503L844619L753841L656804M101336M024327L115297
1737.7G58914948L451347L877580L706038L696144L897726M026830L737331L086448
1754G88394392K943217K906740K507806K406359K218365J903117J831889J878321J860440
1772.4H08850646J610458J343250J407922J501679J383424J291871J345873J363933
$$ plain form
1652 417620629 426505774 433143944 438337743 444709122 452872723 461594194 469133765 477701843 488369197
1670.4 488369197 497826934 507555306 518671274 528563917 537614882 548394024 563272297 575922668
1686.7 575922668 585761964 596160352 605841279 616520882 628823400 641069531 654989898 666094422
1703 666094422 675154984 684515715 692450762 699216306 705493450 711690545 718386292 724104285 728294253
1721.4 728294253 732282221 736418724 740263343 744017184 747673988 751775324 755799651 758914948
1737.7 758914948 762366295 766243875 769949913 773646057 777543783 781570613 785307944 788394392
1754 788394392 791337609 794244349 796752155 799158514 801376879 803279996 805111885 806990206 808850646
1772.4 808850646 810461104 811804354 813212276 814713955 816097379 817389250 818735123 820099056
1788.7H20099056J260638J196086J090527J019418R53317Q80182Q46684Q34644Q06093
1807H28986645P36594O78360N89431N47528N73456O39975O25372N57125N60701N72860
1827.4H35068047M65930L63290L88920L92974L80635M12345M56571M19259L51549K76267
1847.8H38975787K66910L36349TK95400K77162K85387K82109L20375L52800K60830
1868.2H41989458J02460P4565J65582K35438K18749J59622J66893K14040J90496Q8096
1888.6H43605399R3401J73926J08361L7730J07706J45375M8459J3590J01506J12474
1909H44547927J4127k027P4089N1737m0174k1517K6881k8550j00315n1081K8253n0247
1933.5H44449103j51098n0366M5479r8944k62380j95861j00732j65164k33889j57535
$$ plain form
1788.7 820099056 821359694 822555780 823646307 824665725 825619042 826499224 827345908 828180552 828986645
1807 828986645 829723239 830401599 830991030 831538558 832112014 832751989 833377361 833934486 834495187 835068047
1827.4 835068047 835533977 835897267 836286187 836679161 837059796 837472141 837928712 838347971 838699520 838975787
1847.8 838975787 839242697 839579046 839915395 840210795 840487957 840773344 841055453 841375828 841728628 841989458
1868.2 841989458 842091918 842166483 842332065 842567503 842786252 842945874 843112767 843326807 843517303 843605399
1888.6 843605399 843698800 843872726 843981087 844018817 844126523 844271898 844320357 844333947 844435453 844547927
1909 844547927 844562054 844560027 844634116 844685853 844645679 844624162 844651043 844622493 844522178 844471097 844499350 844449103
1933.5 844449103 844298005 844247639 844293118 844194174 843931794 843735933 843635201 843470037 843236148 843078613
1953.9H43078613j22368k31504k43724j14262q9109k30431k85090j91509j73092k34604
1974.3H41162920k19524j37091j58906k38299j96218q8454r8943k10464k64883k39909
1994.7H39310229k49624k67268j98841j81377k80499l29375k51711k00212k26140k43723
2015.1H36881459k64228k88069k83003k36690k09808k37942k79367k70486k37286k35259
2035.5H34339321k37644k30789k26259k11835j99557k29418k17617j74224k00510k36273
2055.9H32175195j70707q2314j20760j98245j79231j17719j20938j40667j06573n7459
2076.3H30880582q3565j32502q5055m6790j23620j71781r9897m7386o5922o3003N305
2098.7H29966366L0935l7730n1796K3901K2710p1943n6207N3823N3108k3008K7716
$$ plain form
1953.9 843078613 842956245 842724741 842481017 842366755 842277646 842047215 841762125 841570616 841397524 841162920
1974.3 841162920 840943396 840806305 840647399 840409100 840212882 840124428 840025485 839815021 839550138 839310229
1994.7 839310229 839060605 838793337 838594496 838413119 838132620 837803245 837551534 837351322 837125182 836881459
2015.1 836881459 836617231 836329162 836046159 835809469 835599661 835361719 835082352 834811866 834574580 834339321
2035.5 834339321 834101677 833870888 833644629 833432794 833233237 833003819 832786202 832611978 832411468 832175195
2055.9 832175195 832004488 831922174 831801414 831603169 831423938 831306219 831185281 831044614 830938041 830880582
2076.3 830880582 830797017 830664515 830579460 830532670 830409050 830237269 830137372 830089986 830024064 829961061 829966366
2098.7 829966366 829997301 829959571 829907775 829931676 829954386 829882443 829826236 829880059 829933167 829910159 829937875
2121.1H29937875J15156M5896k5630O6638J53720R6620M2378J01746J44362O6519K4855
2143.6H30770135J14679J68681R7037Q3029J90258J90198O6996N5134J60218J75357
2164H32071722R3340P8500J57296J73688J02461J17302J93000J60992O2167O9917J62541
2186.4H33442926J52290M5598L0041Q7738O0141K4140R9062J35601L1173j9431P1228
2208.8H34160507J18434L8266j2993O2227R1910m232k3722P0512O7115l4750m1663
2231.3H34491611L1173K2053n9545o1988J5080K8491l5823m3630j20n0604j23084m5418
2255.8H34168196O4611J0312p2718n126P7784L0577l1054M1724J18792O2167L7909
2278.2H34503174J52290J95324O8784r656O3598Q7440N782K3544J18017P7069k4617
$$ plain form
2121.1 829937875 830053031 830098927 830073297 830139935 830293655 830390275 830432653 830534399 830678761 830745280 830770135
2143.6 830770135 830884814 831053495 831150532 831233561 831423819 831614017 831681013 831736147 831896365 832071722
2164 832071722 832165062 832243562 832400858 832574546 832677007 832794309 832987309 833148301 833210468 833280385 833442926
2186.4 833442926 833595216 833640814 833670855 833758593 833818734 833842874 833941936 834077537 834108710 834089279 834160507
2208.8 834160507 834278941 834317207 834304214 834366441 834458351 834454119 834430397 834500909 834568024 834533274 834491611
2231.3 834491611 834522784 834544837 834485292 834423304 834438384 834466875 834431052 834387422 834387302 834336698 834213614 834168196
2255.8 834168196 834232807 834243119 834170401 834165275 834243059 834273636 834242582 834284306 834403098 834465265 834503174
2278.2 834503174 834655464 834850788 834919572 834909916 834973514 835060954 835066736 835090280 835208297 835285366 835260749
2300.6H35260749M2558J53660J17839L2365K7537J26660J57833L6538k3425K9266O7652
2323.1H36029232Q4400O9916P6175Q0704O6221J13368R6142m768P570J67966L71218
2345.5H37158144M17947K25008J3053r2268j16288l6955R1254J93477K28524K90215
2365.9H38372111M02093M50194M34101M26948M45485M35531L83139L57747L66688K92003
2386.3H42366040J61528J32740J85668J64807Q2791P1228J14798R2030J1921K4318
2406.7H43407869J07587Q5175l0458l4154N6684j78j71245k29656j76430r7513M7743
2429.1H42965424K26438K67267J01626m6491J371N7220l3617r9540j1205M1425o5088
2451.5H43404830j18495j4603J0014j20223j55329j6272J8358j29521j45316k3902
$$ plain form
2300.6 835260749 835303307 835456967 835574806 835607171 835634708 835761368 835919201 835955739 835932314 835961580 836029232
2323.1 836029232 836113632 836183548 836259723 836340427 836406648 836520016 836616158 836611390 836618960 836786926 837158144
2345.5 837158144 837576091 837801099 837814152 837721884 837605596 837568641 837659895 837853372 838081896 838372111
2365.9 838372111 838774204 839224398 839658499 840085447 840530932 840966463 841349602 841707349 842074037 842366040
2386.3 842366040 842527568 842660308 842845976 843010783 843093574 843164802 843279600 843371630 843383551 843407869
2406.7 843407869 843515456 843600631 843570173 843536019 843592703 843592525 843421280 843191624 843015194 842917681 842965424
2429.1 842965424 843191862 843459129 843560755 843514264 843515635 843572855 843539238 843439698 843428493 843469918 843404830
2451.5 843404830 843286335 843271732 843281746 843161523 843006194 842989922 843008280 842878759 842733443 842709541
2471.9H42709541n5730j67727j13011n186r1135k02179r0957J6570j08897k31385j11938
2494.4H41547966J8179q4877j82747p7308k7060j84357k34962o3658j847j38104j90318
2516.8H40380907p8380o4433j95264j81318k7239m8578k26200k32040q6844q1063j79708
2539.2H38979840j54912o2287r5904j80662j35481o5386j37389k11596j52827j17242
2559.6H37666154k09928k54213j51456q8632j75893k59280k26081k11298k99812l22342
2580H35467219k10940j71304l11196m06563l16918k69592l72469m14551l34322l37124
2600.4H32322240m52638m60982l73244m05729n17071m91082l67999l80397n07355n20646
2620.8H27845097m21822m17710n00798m93407m26114m63188n47051n08308m15504m23432
$$ plain form
2471.9 842709541 842653811 842486084 842373073 842367887 842276752 842074573 841983616 842000186 841891289 841659904 841547966
2494.4 841547966 841566145 841481268 841298521 841221213 841194153 841009796 840774834 840711176 840709329 840571225 840380907
2516.8 840380907 840302527 840238094 840042830 839861512 839834273 839785695 839559495 839327455 839240611 839159548 838979840
2539.2 838979840 838824928 838762641 838666737 838486075 838350594 838285208 838147819 837936223 837783396 837666154
2559.6 837666154 837456226 837202013 837050557 836961925 836786032 836526752 836300671 836089373 835789561 835467219
2580 835467219 835256279 835084975 834773779 834367216 834050298 833780706 833408237 832993686 832659364 832322240
2600.4 832322240 831869602 831408620 831035376 830629647 830112576 829621494 829253495 828873098 828365743 827845097
2620.8 827845097 827423275 827005565 826504767 826011360 825585246 825122058 824575007 824066699 823651195 823227763
2641.2H23227763m74393m43757m19676m83990n14507m36068l63230m12882m63962m06266
2661.6H18809032l85940m85122n32567m33743l74258m70877n10573m10974m14252n29349
2682H14261377n20885m04418m08053n23925n35250m63068n06163o08861n72980m98652
2702.4H09219122n61953o63042o26623n07951n31554o44803o33657n60940n78522o16670
2722.8H03293407n67198n49793o51538o83606n80013n44727o06954o22809n83350n61595
2743.2G97341824n80907n77808n40793n90026p12037p41601o68645o44922p01130o92963
2763.6G90890992o14107o43849p74861p95901p20739p69794q98480r32575q87632q66353
2784G82986701q77798q65042r05991j028836j096725j083076j088977j152217j182020
$$ plain form
2641.2 823227763 822753370 822309613 821889937 821405947 820891440 820455372 820092142 819679260 819215298 818809032
2661.6 818809032 818423092 817937970 817405403 816971660 816597402 816126525 815615952 815204978 814790726 814261377
2682 814261377 813740492 813336074 812928021 812404096 811868846 811405778 810899615 810290754 809717774 809219122
2702.4 809219122 808657169 807994127 807367504 806859553 806327999 805683196 805049539 804488599 803910077 803293407
2722.8 803293407 802726209 802176416 801524878 800841272 800261259 799716532 799109578 798486769 797903419 797341824
2743.2 797341824 796760917 796183109 795642316 795052290 794340253 793598652 792930007 792285085 791583955 790890992
2763.6 790890992 790276885 789633036 788858175 788062274 787341535 786571741 785673261 784740686 783853054 782986701
2784 782986701 782108903 781243861 780337870 779309034 778212309 777129233 776040256 774888039 773706019
2802.3G73706019j155734j172245j229763j275539j326501j378358j400113j391053
2818.7G63376713j397193j457870j560092j653790j700103j736582j850247k046228
2835G49974608k291858k661586l184497l741562m232943m545212m396618l601610k504230
2853.3G18814492j649737j201928j092553j279294j692832k196908k594888k749264
2869.7G04357088k682031k517223k294958j987040j771032j771152j829267j868904
2886F87635481j939952k053738k141297k162396k231658k355277k377928k357661k483964
2904.3F67531610k733112l005504l350556l790856m168033m270912m022300l497898
2920.6F38692439k785325k009213j262248n88596q8930L47257Q74102J416325J920104
$$ plain form
2802.3 773706019 772550285 771378040 770148277 768872738 767546237 766167879 764767766 763376713
2818.7 763376713 761979520 760521650 758961558 757307768 755607665 753871083 752020836 749974608
2835 749974608 747682750 745021164 741836667 738095105 733862162 729316950 724920332 721318722 718814492
2853.3 718814492 717164755 715962827 714870274 713590980 711898148 709701240 707106352 704357088
2869.7 704357088 701675057 699157834 696862876 694875836 693104804 691333652 689504385 687635481
2886 687635481 685695529 683641791 681500494 679338098 677106440 674751163 672373235 670015574 667531610
2904.3 667531610 664798498 661792994 658442438 654651582 650483549 646212637 642190337 638692439
2920.6 638692439 635907114 633897901 632635653 632047057 631958127 632305384 633179486 634595811 636515915
2939F36515915K373100K588749K405941J959443J468778J017153N57065J73807Q6606
2957.4F49146557K40803L83734L90292L63171L56674L29852L55005M21465M35352M66883
2977.8F52889788N73218O06120N39362N07951N06997M86493K87592j42633m58539o61492
2998.1F55134857r51886j114130j137317j198649j201332j117706j166225j393616
3014.5F45853996j591384j692951j762450j789808j839876j932263j933337j893520
3030.8F31418407j933515k058148k213538k246380k195120k272963k456308k571285
3047.1F13471150k560794k537429k564192k594590k649367k668440k573133k463877
3063.4E92859328k419770k443850k572477k673864k546370k320528k277613k456725
$$ plain form
2939 636515915 638889015 641477764 643883705 645843148 647311926 648329079 648886144 649059951 649146557
2957.4 649146557 649387360 649771094 650161386 650524557 650881231 651211083 651566088 651987553 652422905 652889788
2977.8 652889788 653463006 654069126 654608488 655116439 655623436 656109929 656397521 656254888 655796349 655134857
2998.1 655134857 654182971 653068841 651931524 650732875 649531543 648413837 647247612 645853996
3014.5 645853996 644262612 642569661 640807211 639017403 637177527 635245264 633311927 631418407
3030.8 631418407 629484892 627426744 625213206 622966826 620771706 618498743 616042435 613471150
3047.1 613471150 610910356 608372927 605808735 603214145 600564778 597896338 595323205 592859328
3063.4 592859328 590439558 587995708 585423231 582749367 580202997 577882469 575604856 573148131
3079.7E73148131k631724k666354k670645k665580k661228k754509k820433k755045
3096E51522613k660811k691269k868295k947390k838910k810538l001451l075004k925753
3114.4E25703192k910674l080249l310442l510415l505349l356576l291428l352076
3130.7D99385983l447891l443241l339380l360748l589988l744185l675073l613353
3147D71172124l574133l501326l611415l853113l903508l803015l752589l755242l793239
3165.4D37624544l847182l861725l819555l766805l762871l794611l791213l762096
3181.7D07218486l743231l742606l753543l748864l724366l694892l696948l687382
3198C77426654l605813l517389l497899l467202l407806l385216l357738l311038l274352
$$ plain form
3079.7 573148131 570516407 567850053 565179408 562513828 559852600 557098091 554277658 551522613
3096 551522613 548861802 546170533 543302238 540354848 537515938 534705400 531703949 528628945 525703192
3114.4 525703192 522792518 519712269 516401827 512891412 509386063 506029487 502738059 499385983
3130.7 499385983 495938092 492494851 489155471 485794723 482204735 478460550 474785477 471172124
3147 471172124 467597991 464096665 460485250 456632137 452728629 448925614 445173025 441417783 437624544
3165.4 437624544 433777362 429915637 426096082 422329277 418566406 414771795 410980582 407218486
3181.7 407218486 403475255 399732649 395979106 392230242 388505876 384810984 381114036 377426654
3198 377426654 373820841 370303452 366805553 363338351 359930545 356545329 353187591 349876553 346602201
3216.4C46602201l246456l188670l101557l031671k993554k947658k852559k765179
3232.7C22474897k772480k782882k690136k572447k478689k384991k319633k326996
3249C02146643k309739k225250k178997k201498k223193k210736k198726k166510k090097
3267.4B82341897k001225j999617k098471k182841k200783k166450k140581k142757
3283.7B65409172k119571k054245j988351k005249k119035k207011k217263k157509
3300B48540938k021432j944125k041667k180219k251506k273455k211109k123579k118722
3318.4B29375124k109587k012760j946956k017542k093166k050057j956776j813114
3334.7B13375166j694769j777067j920894j910091j823842j714066j576796j625165
$$ plain form
3216.4 346602201 343355745 340167075 337065518 334033847 331040293 328092635 325240076 322474897
3232.7 322474897 319702417 316919535 314229399 311656952 309178263 306793272 304473639 302146643
3249 302146643 299836904 297611654 295432657 293231159 291007966 288797230 286598504 284431994 282341897
3267.4 282341897 280340672 278341055 276242584 274059743 271858960 269692510 267551929 265409172
3283.7 265409172 263289601 261235356 259247005 257241756 255122721 252915710 250698447 248540938
3300 248540938 246519506 244575381 242533714 240353495 238101989 235828534 233617425 231493846 229375124
3318.4 229375124 227265537 225252777 223305821 221288279 219195113 217145056 215188280 213375166
3334.7 213375166 211680397 209903330 207982436 206072345 204248503 202534437 200957641 199332476
3351A99332476j803190j800403j612291j429706j409352j435340j251563j071781j190826
3369.3A86328024j431674j416281j143590r64105r27508r22694q38235o10963k89053
3387.7A77783921p4476k08690m95851m47944j0908K00778j48475m78357k36407J75268
3408.1A76058859L16068K90454K09644J91778L72007N48810N53727O53908R17837J120046
3428.5A81233138J083717J112595J340359J234845Q65414Q86083J224250J483276J648650
3446.8A92112327J642570J618459J726851J889006K104938K255082K128228K093882
3463.2B07571343K512395K782136K376869J838625J945063K398164K736255K787963
3479.5B26948813K537995K475202K731547K820268K726719K839089L065854L203898
$$ plain form
3351 199332476 197529286 195728883 194116592 192686886 191277534 189842194 188590631 187518850 186328024
3369.3 186328024 184896350 183480069 182336479 181372374 180444866 179522172 178683937 178072974 177783921
3387.7 177783921 177709445 177500755 177004904 176556960 176546052 176746830 176598355 176119998 175883591 176058859
3408.1 176058859 176374927 176665381 176875025 177066803 177438810 177987620 178541347 179195255 180113092 181233138
3428.5 181233138 182316855 183429450 184769809 186004654 186870068 187756151 188980401 190463677 192112327
3446.8 192112327 193754897 195373356 197100207 198989213 201094151 203349233 205477461 207571343
3463.2 207571343 210083738 212865874 215242743 217081368 219026431 221424595 224160850 226948813
3479.5 226948813 229486808 231962010 234693557 237513825 240240544 243079633 246145487 249349385
3495.8B49349385L117890L032922L177524L189504K962619L028244L424376L698260
3512.1B74980724L617018L415317L484547L752738M096627M049599L683478L786177
3528.4C04866225M170328M326403M478216M572839M382312M483938M866243N039632
3544.7C41186136M862696M631609M769653N132764N206168N202770N496264N634963
3561.1C82123023N315453N366445O581396O983548O058723N814194O285102O659060
3577.4D31186944O899387P020175O834418O914288P687270P785976O959707P101834
3593.7D88389999P828325P970988P992805Q021414P551729P249892Q006990Q480966
3610E51493108Q195341Q141756P770419P961333Q810639P991553O720841O523847Q202136
$$ plain form
3495.8 249349385 252467275 255500197 258677721 261867225 264829844 267858088 271282464 274980724
3512.1 274980724 278597742 282013059 285497606 289250344 293346971 297396570 301080048 304866225
3528.4 304866225 309036553 313362956 317841172 322414011 326796323 331280261 336146504 341186136
3544.7 341186136 346048832 350680441 355450094 360582858 365789026 370991796 376488060 382123023
3561.1 382123023 387438476 392804921 399386317 406369865 412428588 418242782 424527884 431186944
3577.4 431186944 438086331 445106506 451940924 458855212 466542482 474328458 481288165 488389999
3593.7 488389999 496218324 504189312 512182117 520203531 527755260 535005152 543012142 551493108
3610 551493108 559688449 567830205 575600624 583561957 592372596 600364149 607084990 613608837 621810973
3628.4F21810973R347200P491469O764710O902218O689608O621898O439983N898059
3644.7F77966118N805552O922424P117629N272209M463733N234778N237519M392028
3661G22411990L998280L833115L577351L711164L944815L128111K895832L268361K805352
3679.4G53574371K529145K552569K497732K592206K583265K057791J719058J711726
3695.7G71817863J657844J509964J560330J697362J557171J281977J080453J155615
3712G83318579J319885J172603R86814R03785Q04067O72579P26104R77337R96292Q66890
3732.4G92744935Q47220R65774R81569O19173P4506J91748Q46804N73992K68638O56665
3752.8G98771024P73906M97401L54886M51565M61519M79042M95613L48270L22938M08769
$$ plain form
3628.4 621810973 631158173 638649642 645414352 652316570 659006178 665628076 672068059 677966118
3644.7 677966118 683771670 690694094 697811723 703083932 707547665 712782443 718019962 722411990
3661 722411990 726410270 730243385 733820736 737531900 741476715 744604826 747500658 750769019 753574371
3679.4 753574371 756103516 758656085 761153817 763746023 766329288 768387079 770106137 771817863
3695.7 771817863 773475707 774985671 776546001 778243363 779800534 781082511 782162964 783318579
3712 783318579 784638464 785811067 786797881 787701666 788505733 789178312 789904416 790881753 791878045 792744935
3732.4 792744935 793592155 794557929 795539498 796158671 796233177 796424925 797271729 797845721 798114359 798771024
3752.8 798771024 799544930 800042331 800397217 800848782 801310301 801789343 802284956 802633226 802956164 803364933
3773.2H03364933M83691N29766M06802K48551J53959J52171K63274L80098M13835K66493
3793.6H06663573K12669L45767J45435N8830L38137J63555J25170L82423L79265J61290
3814H08976114J56581L46959J2457p0572K01345J65820J52588J54912K51234L97742
3834.4H10745180J37090k23398m1127J94669K38120K75791K31087j18911o95825k57730
3854.8H10484946N21898M24147J56402K3306J04189P8797j44124o0797N3108J16587
3875.2H11758459J66654j3947J13070K82109J02341K9683r3222j80185K4021J42515
3895.5H12331498L5226j05798j52052p4207Q0347J16765N3942N9426M5777l5644l4928
3918H12320352L3319L3199K9207O6578L9935J311L9161O3419L5763L2723N5074O9738
$$ plain form
3773.2 803364933 803848624 804378390 804785192 805033743 805187702 805339873 805603147 805983245 806397080 806663573
3793.6 806663573 806876242 807222009 807367444 807426274 807764411 807927966 808053136 808435559 808814824 808976114
3814 808976114 809132695 809479654 809492111 809421539 809622884 809788704 809941292 810096204 810347438 810745180
3834.4 810745180 810882270 810658872 810617745 810812414 811050534 811326325 811557412 811438501 810742676 810484946
3854.8 810484946 811006844 811430991 811587393 811610699 811714888 811793685 811649561 811588764 811641872 811758459
3875.2 811758459 811925113 811911166 812024236 812306345 812408686 812438369 812345147 812164962 812188983 812331498
3895.5 812331498 812366724 812260926 812108874 812034667 812115014 812231779 812285721 812345147 812390924 812355280 812320352
3918 812320352 812353671 812386870 812416077 812482655 812522590 812523901 812563062 812626481 812662244 812694967 812750041 812819779
3942.5H12819779R0659P4267M0531J3054j3888L2007Q0347P3493R6142J28150J04547
3964.9H13539088Q3327R7990J17362J22785Q4520Q7380J21236R9182Q2970O1512K2232
3987.3H14519584K5094N7041J19388J69874J39892
3997.5H15030873
$$ plain form
3942.5 812819779 812910438 812984705 813025236 813038290 813024402 813056409 813136756 813210249 813306391 813434541 813539088
3964.9 813539088 813622415 813720405 813837767 813960552 814045072 814132452 814253688 814352870 814435840 814497352 814519584
3987.3 814519584 814544678 814601719 814721107 814890981 815030873
3997.5 815030873
##END=$$ End of the data block
