##TITLE=$$ Begin of the data block
##JCAMP-DX=5.00 $$ ACD/SpecManager v 10.08
##SPECTROMETER/DATA SYSTEM=Alpha
##DATE=10 Apr 2014 11:00:52
##DATA TYPE=INFRARED SPECTRUM
##DATA CLASS=XYDATA
##ORIGIN=
##OWNER=
##NPOINTS=1765
##FIRSTX=399.75695801
##LASTX=3997.56933594
##MAXX=3997.56933594
##MINX=399.75695801
##MAXY=0.84471554
##MINY=0.17629975
##XFACTOR=1.0000000000
##YFACTOR=1.000000000000000e-9
##FIRSTY=0.56301147
##DELTAX=2.03957629
##XUNITS=1/CM
##YUNITS=ARBITRARY UNITS
##XYDATA=(X++(Y..Y))
$$ plain form
399.8 563011467 560916662 558829427 557205737 556527197 556051552 554514885 552718163 552262127 552247226
418.1 552247226 550763428 549233198 548744619 548348129 547803938 547644675 547336519 546046972 544289410
436.5 544289410 543350637 543181658 542876482 542587698 542596400 542391598 541960716 541829944 541875720 541201532
456.9 541201532 539626837 538294435 537404120 536246479 534863770 533877313 533048809 531702399 530290723
475.2 530290723 529345155 528339982 527112126 526435852 526244819 525446057 524025202 522965491 522319198
493.6 522319198 521230698 519871652 518925369 517976224 516639650 515457988 514599323 513560057 512161791
511.9 512161791 510929406 509957254 508504868 506590068 504991114 503601670 501775920 499705940 498025715
530.3 498025715 496546060 494872689 493344933 492414385 491721869 490611941 489276022 488267481 487372607
$$ packed form
399.8E63011467k094805k087235j623690o78540m75645j536667j796722m56036j4901
418.1E52247226j483798j530230m88579l96490n44191j59263l08156j289547j757562
436.5E44289410r38773j68979l05176k88784Q702k04802m30882j30772M5776o74188
456.9E41201532j574695j332402q90315j157641j382709r86457q28504j346410j411676
475.2E30290723r45568j005173j227856o76274j91033p98762j420855j059711o46293
493.6E22319198j088500j359046r46283r49145j336574j181662q58665j039266j398266
511.9E12161791j232385r72152j452386j914800j598954j389444j825750k069980j680225
530.3D98025715j479655j673371j527756r30548o92516j109928j335919j008541q94874
$$ plain form
548.6 487372607 486149102 484812140 483564019 482024133 480049342 478078276 476207525 473931164
565 473931164 471142858 468341619 465695381 463041186 460460007 458061337 455651045 453018010 450344145
583.3 450344145 447816968 445339799 442782551 440158546 437510878 434822053 432107776 429208815
599.6 429208815 425845444 422232538 419277698 417598188 416761458 416013151 415446639 415822178 417846024
618 417846024 421451926 425823748 430344731 434763789 439116061 443463832 447705925 451570690 454926729
636.3 454926729 457729131 459650785 460566819 461549014 464009672 467574686 470357686 470985442 470236450
654.7 470236450 471395671 476875007 484586358 491029590 495259821 499261469 504704654 508730829
671 508730829 511760652 515224934 518730521 521891415 524870694 527700841 530176997 532364607 534537971
$$ packed form
548.6D87372607j223505j336962j248121j539886j974791j971066j870751k276361
565D73931164k788306k801239k646238k654195k581179k398670k410292k633035k673865
583.3D50344145k527177k477169k557248k624005k647668k688825k714277k898961
599.6D29208815l363371l612906k954840j679510q36730p48307n66512L75539K023846
618D17846024L605902M371822M520983M419058M352272M347771M242093L864765L356039
636.3D54926729K802402J921654R16034R82195K460658L565014K783000O27756p48992
654.7D70236450J159221N479336P711351O443232M230231M001648N443185M026175
671E08730829L029823L464282L505587L160894K979279K830147K476156K187610K173364
$$ plain form
689.4 534537971 536542892 538040042 539285779 540644407 541997969 543279648 544911444 547030449
705.7 547030449 549210787 551329374 553793132 556668103 559434116 562012076 564856410 567926407
722 567926407 570724547 573293507 575943947 578574359 580876112 582964897 585215449 587475300 589537084
740.4 589537084 591652930 593852758 595827937 597692728 599837601 602228642 604450464 606545687
756.7 606545687 608887851 611284614 613428593 615460753 617531478 619413674 620883942 621999800
773 621999800 622840047 623171985 622770965 621931016 621053755 620225906 619710207 620183110 621957064 624859333
793.4 624859333 628822267 633971691 640128672 646655142 653068662 659201920 664802670 669584811
809.7 669584811 673503399 676575661 678779960 680043280 680194497 679096222 676766038 673366785 669196188
$$ packed form
689.4E34537971K004921J497150J245737J358628J353562J281679J631796K119005
705.7E47030449K180338K118587K463758K874971K766013K577960K844334L069997
722E67926407K798140K568960K650440K630412K301753K088785K250552K259851K061784
740.4E89537084K115846K199828J975179J864791K144873K391041K221822K095223
756.7F06545687K342164K396763K143979K032160K070725J882196J470268J115858
773F21999800Q40247L31938m01020q39949q77261q27849n15699M72903J773954K902269
793.4F24859333L962934N149424O156981O526470O413520O133258N600750M782141
809.7F69584811L918588L072262K204299J263320J51217j098275k330184l399253m170597
$$ plain form
828.1 669196188 664623857 659886718 655077517 650363684 646051824 642207205 638566971 635169268
844.4 635169268 632597089 631465256 632267416 635475039 641190767 648929119 658023715 668025196
860.7 668025196 678422868 688479304 697705448 706009507 713209689 719008148 723438203 726745665
877 726745665 728970766 729998052 729948163 729109764 727568388 725403309 723104715 721275449 720138550
895.4 720138550 719800413 720505238 722152412 724140286 725977838 727492929 728406847 728215992 726662815
913.7 726662815 723961055 720320761 715869963 711218655 707349300 704834342 703682303 703791797 704885066
932.1 704885066 706273079 707395613 708280802 709065020 709568679 709616244 709254384 708338141 706390858
950.4 706390858 703181922 698867381 693417311 686473608 677875280 667704523 655783415 641851008
$$ packed form
828.1F69196188m572331m737139m809201m713833m311860l844619l640234l397703
844.4F35169268k572179j131833Q02160L207623N715728P738352R094596J0001481
860.7F68025196J0397672J0056436R226144Q304059P200182N798459M430055L307462
877G26745665K225101J027286m9889q38399j541376k165079k298594j829266j136899
895.4G20138550l38137P04825J647174J987874J837552J515091R13918j90855j553177
913.7G26662815k701760l640294m450798m651308l869355k514958j152039J09494J093269
932.1G04885066J388013J122534Q85189P84218N03659M7565l61860r16243j947283
950.4G06390858l208936m314541n450070o943703q598328j0170757j1921108j3932407
$$ plain form
966.8 641851008 626209974 609751880 593459487 578230679 564867139 553627729 544096649 535728693
983.1 535728693 528192163 521324694 515038610 509375930 504491866 500449777 497124970 494344115
999.4 494344115 491992325 489794970 487205446 483698547 479059756 473401368 467051446 460417807
1015.7 460417807 453877151 447674513 441908717 436563313 431528807 426723987 422187895 418028682
1032 418028682 414297193 410971820 408016384 405385703 402956158 400585741 398152411 395593137 393063635
1050.4 393063635 390944630 389658064 389387786 390043736 391261339 392357290 392532587 391207367 388142496
1068.7 388142496 383504689 377867550 371878654 365973115 360261202 354640096 348945141 342972726
1085 342972726 336590767 329933167 323504835 318105817 314364433 312382907 311893433 312348276 313096136
$$ packed form
966.8F41851008j5641034j6458094j6292393j5228808j3363540j1239410r531080q367956
983.1E35728693p536530o867469o286084n662680m884064m042089l324807k780855
999.4D94344115k351790k197355k589524l506899m638791n658388o349922o633639
1015.7D60417807o540656o202638n765796n345404n034506m804820m536092m159213
1032D18028682l731489l325373k955436k630681k429545k370417k433330k559274k529502
1050.4C93063635k119005j286566k70278O55950J217603J095951J75297j325220l064871
1068.7C88142496m637807n637139n988896n905539n711913n621106n694955n972415
1085C42972726o381959o657600o428332n399018l741384j981526m89474M54843P47860
$$ plain form
1103.4 313096136 313714266 314088047 314067960 313354343 311700881 308882266 304461896 298158497 291086167
1121.8 291086167 285811096 283857763 284250319 285444587 286393613 286649734 287134349 289071381 292440385
1140.1 292440385 296311617 299912840 302988112 305603832 307887107 310004115 312242836 314921737
1156.4 314921737 318281680 322548062 327995986 334803075 342918932 352055430 361825675 371820807
1172.7 371820807 381639749 391003311 399850667 408139586 415589869 421832144 426602751 429740697
1189.1 429740697 431248903 431510925 431292117 431446224 432664067 435361952 439556390 444769382 450218797
1207.4 450218797 455261111 459628731 463297158 466370553 469074190 471678674 474307358 476968467
1223.7 476968467 479778498 482877433 486229807 489728034 493382782 497243494 501210630 505040646
$$ packed form
1103.4C13096136O18130L73781k0087p13617j653462k818615m420370o303399p072330
1121.8B91086167n275071j953333L92556J194268R49026K56121M84615J937032L369004
1140.1B92440385L871232L601223L075272K615720K283275K117008K238721K678901
1156.4C14921737L359943M266382N447924O807089Q115857R136498R770245R995132
1172.7C71820807R818942R363562Q847356Q288919P450283O242275M770607L137946
1189.1D29740697J508206K62022k18808J54107J217843K697885M194438N212992N449415
1207.4D50218797N042314M367620L668427L073395K703637K604484K628684K661109
1223.7D76968467K810031L098935L352374L498227L654748L860712L967136L830016
$$ plain form
1240.1 505040646 508569539 511764228 514513373 516663790 518240094 519435108 520419240 521334589 522472858
1258.4 522472858 524165154 526523232 529540420 533296645 537808955 542882681 548283279 553967237
1274.7 553967237 559975803 566188693 572439313 578752279 585262001 591941118 598582923 605075240
1291 605075240 611367702 617267430 622602463 627475321 631997168 635973871 639298677 642176032 644694090
1309.4 644694090 646722376 648265362 649563015 650822282 651992798 653132617 654515505 656102717
1325.7 656102717 657564402 658732653 659576178 659958303 659865558 659553587 659288526 659104764 658985674
1344.1 658985674 659048975 659345746 659637570 659655333 659454644 659134865 658605278 657683313 656261146 654451489
1364.5 654451489 652376235 649971306 647388697 644471288 640575826 635343015 626992404 612595856
$$ packed form
1240.1E05040646L528893L194689K749145K150417J576304J195014R84132R15349J138269
1258.4E22472858J692296K358078L017188L756225M512310N073726N400598N683958
1274.7E53967237O008566O212890O250620O312966O509722O679117O641805O492317
1291F05075240O292462N899728N335033M872858M521847L976703L324806K877355K518058
1309.4F44694090K028286J542986J297653J259267J170516J139819J382888J587212
1325.7F56102717J461685J168251Q43525L82125r2745l11971k65061j83762j19090
1344.1F58985674O3301K96771K91824J7763k00689l19779n29587r21965j422167j809657
1364.5F54451489k075254k404929k582609k917409l895462n232811q350611j4396548
$$ plain form
1380.8 612595856 596133947 589743614 598855436 612707794 620643318 623943806 625088215 624686003
1397.1 624686003 622983873 620482028 617629468 614476621 611351728 608510256 606007397 604015648
1413.4 604015648 602543890 601329982 600304246 599634945 599205315 598816991 598564625 598538220 598663270
1431.8 598663270 598987281 599921703 601455569 602831781 604319692 606211841 608608365 611660659 615205646
1450.1 615205646 619133592 623790979 630992949 640815854 648426116 654844165 662563562 670815766
1466.4 670815766 678008616 685548007 695179284 704422116 711190760 716376901 720493853 723796904
1482.8 723796904 726233959 727832317 728388131 727799475 726650536 724977791 722213984 718731105 715416312
1501.1 715416312 712414145 708614945 702054501 695712268 690770984 686086595 681707323 677792907
$$ packed form
1380.8F12595856j6461909o390333R111822J3852358P935524L300488J144409m02212
1397.1F24686003j702130k501845k852560l152847l124893k841472k502859j991749
1413.4F04015648j471758j213908j025736o69301m29630l88324k52366k6405J25050
1431.8E98663270L24011R34422J533866J376212J487911J892149K396524L052294L544987
1450.1F15205646L927946M657387P201970R822905P610262O418049P719397Q252204
1466.4F70815766P192850P539391R631277R242832O768644N186141M116952L303051
1482.8G23796904K437055J598358N55814n88656j148939j672745k763807l482879l314793
1501.1G15416312l002167l799200o560444o342233m941284m684389m379272l914416
$$ plain form
1517.4 677792907 674513996 671207786 667964041 665137947 662308276 659865975 657775521 655558527
1533.7 655558527 653661132 652321458 651044965 649674296 648542285 647749066 647466600 647656500 648124814
1552.1 648124814 648722112 649356127 649770916 649241269 648057640 646445870 644268036 640947759 636167824
1570.5 636167824 631365895 625942826 617939174 609684467 602129340 593728960 584599376 575206995
1586.8 575206995 565698206 556028485 546308935 536579549 527097583 517973661 508955121 500071704
1603.1 500071704 491572738 483248711 474754691 466556340 459077209 451190621 442170322 434926093
1619.4 434926093 428863138 422064513 415627956 410081476 405229837 401605994 398942560 396929353
1635.7 396929353 396179885 396509111 397741884 399832696 403544694 408605754 412461042 417476594 426488847
$$ packed form
1517.4F77792907l278911l306210l243745k826094k829671k442301k090454k216994
1533.7F55558527j897395j339674j276493j370669j132011p93219k82466J89900M68314
1552.1F48124814N97298O34015M14789n29647j183629j611770k177834l320277m779935
1570.5F36167824m801929n423069q003652q254707p555127q400380r129584r392381
1586.8E75206995r508789r669721r719550r729386r481966r123922r018540q883417
1603.1E00071704q498966q324027q494020q198351p479131p886588r020299p244229
1619.4D34926093o062955o798625o436557n546480m851639l623843k663434k013207
1635.7C96929353p49468L29226J232773K090812L711998N061060L855288N015552R012253
$$ plain form
1654.1 426488847 433210433 438430250 444835186 453021139 461736500 469283044 477873534 488557637
1670.4 488557637 498043060 507806480 518919766 528785348 537809730 548525989 563332140 575994968
1686.7 575994968 585883319 596313119 605973005 616587579 628831804 641044557 654933572 666031539
1703 666031539 675117731 684529006 692505717 699272811 705544233 711762786 718462110 724136353 728288174
1721.4 728288174 732278526 736435592 740278423 744025648 747668326 751720965 755741775 758909166
1737.7 758909166 762392402 766263545 769950509 773622513 777505159 781538129 785288334 788389087
1754 788389087 791329265 794224322 796741366 799148679 801344275 803236544 805071831 806930363 808780611
1772.4 808780611 810446858 811834931 813238621 814734638 816128016 817422390 818760633 820118785
$$ packed form
1654.1D26488847O721586N219817O404936Q185953Q715361P546544Q590490J0684103
1670.4D88557637R485423R763420J1113286R865582R024382J0716259J4806151J2662828
1686.7E75994968R888351J0429800R659886J0614574J2244225J2212753J3889015J1097967
1703F66031539R086192R411275P976711O767094O271422O218553O699324N674243M151821
1721.4G28288174L990352M157066L842831L747225L642678M052639M020810L167391
1737.7G58909166L483236L871143L686964L672004L882646M032970L750205L100753
1754G88389087K940178K895057K517044K407313K195596J892269J835287J858532J850248
1772.4H08780611J666247J388073J403690J496017J393378J294374J338243J358152
$$ plain form
1788.7 820118785 821382046 822570860 823652685 824689686 825663149 826545715 827393651 828225374 829010367
1807 829010367 829724431 830397308 830993891 831547678 832118988 832749009 833358347 833907008 834481537 835082948
1827.4 835082948 835576475 835946083 836321056 836717248 837128580 837560058 838002026 838373661 838673115 838930130
1847.8 838930130 839209974 839579701 839943767 840236485 840500295 840790033 841073751 841378093 841723740 842001498
1868.2 842001498 842113554 842165589 842301250 842526257 842739046 842888713 843071103 843312025 843506575 843591273
1888.6 843591273 843684971 843856871 843972862 844021380 844133496 844286501 844349861 844381630 844487309 844563484
1909 844563484 844519138 844514549 844641209 844715536 844655812 844612658 844639301 844634295 844552934 844505966 844526708 844461739
1933.5 844461739 844305217 844255090 844302118 844199896 843920171 843734920 843661189 843491256 843250692 843097210
$$ packed form
1788.7H20118785J263261J188814J081825J037001R73463Q82566Q47936Q31723P84993
1807H29010367P14064O72877N96583N53787N71310O30021O09338N48661N74529O01411
1827.4H35082948M93527L69608L74973L96192M11332M31478M41968L71635K99454K57015
1847.8H38930130K79844L69727L64066K92718K63810K89738K83718L04342L45647K77758
1868.2H42001498J12056N2035J35661K25007K12789J49667J82390K40922J94550Q4698
1888.6H43591273R3698J71900J15991M8518J12116J53005O3360L1769J05679P6175
1909H44563484m4346m589J26660P4327n9724m3154K6643n006q1361m6968K0742o4969
1933.5H44461739j56522n0127M7028j02222k79725j85251p3731j69933k40564j53482
$$ plain form
1953.9 843097210 842987001 842786193 842553020 842408359 842291534 842053652 841757476 841548443 841365695 841141582
1974.3 841141582 840947270 840824187 840663612 840427279 840256691 840194881 840073228 839829624 839580774 839364409
1994.7 839364409 839119494 838843822 838623464 838436425 838172913 837859988 837615907 837402582 837135971 836868823
2015.1 836868823 836637497 836388588 836091340 835815430 835602880 835393786 835128427 834847808 834603965 834379673
2035.5 834379673 834141254 833876848 833624601 833409131 833218575 833030105 832844555 832660556 832465410 832261682
2055.9 832261682 832096577 831979275 831838429 831654668 831475735 831351161 831239164 831087112 830949366 830883801
2076.3 830883801 830831170 830739260 830654740 830591619 830491066 830347061 830248296 830188334 830099344 830018163 830023587
2098.7 830023587 830086291 830092251 830043733 830036044 830040216 829972267 829916060 829959989 830004871 829978943 830000460 830109417
$$ packed form
1953.9H43097210j10209k00808k33173j44661j16825k37882k96176k09033j82748k24113
1974.3H41141582j94312j23083j60575k36333j70588o1810j21653k43604k48850k16365
1994.7H39364409k44915k75672k20358j87039k63512l12925k44081k13325k66611k67148
2015.1H36868823k31326k48909k97248k75910k12550k09094k65359k80619k43843k24292
2035.5H34379673k38419k64406k52247k15470j90556j88470j85550j83999j95146k03728
2055.9H32261682j65105j17302j40846j83761j78933j24574j11997j52052j37746o5565
2076.3H30883801n2631r1910q4520o3121j00553j44005r8765n9962q8990q1181N424
2098.7H30023587O2704N960m8518p689M172o7949n6207M3929M4882k5928K1517J08957
$$ plain form
2123.2 830109417 830167174 830160201 830235302 830387533 830463946 830458701 830513477 830662668 830768585 830809951 830925405
2145.6 830925405 831107676 831206441 831249774 831405580 831603050 831679344 831749916 831950963 832141638 832209706
2166 832209706 832280517 832457602 832638383 832733691 832850575 833051085 833211660 833275318 833380938 833589315
2186.4 833589315 833744168 833758295 833780825 833892882 833957970 833958805 834025383 834132016 834179163 834211051 834308207
2208.8 834308207 834420621 834439039 834409595 834479392 834576488 834547937 834513962 834606171 834671021 834597528 834546268
2231.3 834546268 834615707 834665239 834611535 834571421 834638536 834699392 834629357 834544420 834530592 834459543 834332705
2253.7 834332705 834308386 834383190 834391892 834308743 834284008 834353089 834388018 834378839 834445119 834554493 834589481 834607840
2278.2 834607840 834761739 834976137 835052788 835049808 835127234 835214317 835222065 835259795 835387826 835478723 835454166
$$ packed form
2123.2H30109417N7757o973P5101J52231P6413n245N4776J49191J05917M1366J15454
2145.6H30925405J82271R8765M3333J55806J97470P6294P0572K01047J90675O8068
2166H32209706P0811J77085J80781R5308J16884K00510J60575O3658J05620K08377
2186.4H33589315J54853J4127K2530J12057O5088Q35O6578J06633M7147L1888R7156
2208.8H34308207J12414J8418k9444O9797R7096k8551l3975R2209O4850p3493n1260
2231.3H34546268O9439M9532n3704m0114O7115O0856p0035q4937j3828p1049j26838
2253.7H34332705k4319P4804Q702q3149k4735O9081L4929r179O6280J09374L4988J8359
2278.2H34607840J53899K14398P6651k980P7426Q7083P748L7730J28031R0897k4557
$$ plain form
2300.6 835454166 835478246 835641325 835771978 835788429 835817754 835948527 836089194 836134076 836146832 836219668 836289346
2323.1 836289346 836316884 836415827 836595654 836687326 836710453 836778224 836792946 836724102 836738765 836986899 837458491
2345.5 837458491 837925375 838134170 838088691 837947965 837818384 837749958 837784946 837968111 838223100 838542461
2365.9 838542461 839002132 839456022 839817941 840214193 840684533 841159999 841586292 841973245 842361212 842666924
2386.3 842666924 842812002 842896998 843033075 843178749 843264639 843348861 843501151 843629539 843636096 843637109 843738556
2408.7 843738556 843814373 843783081 843777120 843839169 843824446 843649685 843405366 843207121 843100250 843163311 843432605
2431.2 843432605 843725324 843797147 843698084 843673229 843725979 843696296 843622267 843635440 843666077 843585014 843482256
2453.6 843482256 843491077 843493640 843360841 843238831 843257725 843259037 843102574 842951477 842929661 842868209 842684627
$$ packed form
2300.6H35454166K4080J63079J30653J6451K9325J30773J40667M4882J2756P2836O9678
2323.1H36289346K7538R8943J79827R1672K3127O7771J4722o8844J4663K48134M71592
2345.5H37458491M66884K08795m5479j40726j29581o8426L4988J83165K54989L19361
2365.9H38542461M59671M53890L61919L96252M70340M75466M26293L86953L87967L05712
2386.3H42666924J45078Q4996J36077J45674Q5890Q4222J52290J28388O557J013J01447
2408.7H43738556P5817l1292n961O2049j4723j74761k44319j98245j06871O3061K69294
2431.2H43432605K92719P1823r9063k4855N2750k9683p4029J3173L0637q1063j02758
2453.6H43482256Q821K563j32799j22010J8894J312j56463j51097k1816o1452j83582
$$ plain form
2476 842684627 842581213 842597783 842485428 842242002 842124045 842123747 842030942 841859579 841802061 841828048 841720641
2498.5 841720641 841512322 841406822 841358125 841200829 841027975 840988815 840957761 840785623 840585172 840500891
2518.9 840500891 840435028 840263486 840108752 840072870 839995325 839777887 839584827 839498281 839383483 839189172
2539.2 839189172 839038193 838984132 838890314 838697970 838556647 838498294 838374615 838174880 838013768 837871790
2559.6 837871790 837660789 837447822 837332368 837246478 837064564 836800694 836562574 836338222 836031139 835704267
2580 835704267 835488737 835300863 834968746 834563255 834263146 833997905 833613455 833188534 832863629 832558990
2600.4 832558990 832123280 831642389 831252754 830854535 830341756 829856694 829491138 829086959 828573048 828080058
2620.8 828080058 827686369 827275574 826752126 826229870 825790644 825335801 824822247 824356556 823955834 823515415
$$ packed form
2476H42684627j03414J6570j12355k43426j17957k98r2805j71363n7518K5987j07407
2498.5H41720641k08319j05500m8697j57296j72854l9160l1054j72138k00451q4281
2518.9H40500891o5863j71542j54734l5882p7545k17438j93060q6546j14798j94311
2539.2H39189172j50979n4061r3818j92344j41323n8353j23679j99735j61112j41978
2559.6H37871790k11001k12967j15454q5890j81914k63870k38120k24352l07083l26872
2580H35704267k15530j87874l32117m05491l00109k65241l84450m24921l24905l04639
2600.4H32558990m35710m80891l89635l98219n12779m85062l65556m04179n13911m92990
2620.8H28080058l93689m10795n23448n22256m39226m54843n13554m65691m00722m40419
$$ plain form
2641.2 823515415 823011756 822539926 822134912 821695149 821188390 820739865 820370138 819940805 819452763 819027185
2661.6 819027185 818632841 818152189 817646801 817257166 816891730 816391110 815867722 815461934 815034866 814487636
2682 814487636 813979506 813586712 813153327 812613308 812093675 811636031 811121523 810525119 809982836 809505284
2702.4 809505284 808958232 808327258 807727933 807202399 806630373 805968046 805338383 804781556 804205954 803580284
2722.8 803580284 802981019 802404642 801757634 801100135 800549746 800019860 799404621 798767507 798171103 797593117
2743.2 797593117 797010005 796437860 795874953 795262277 794592619 793941915 793323815 792665124 791943312 791237831
2763.6 791237831 790589273 789902985 789131820 788383663 787684679 786908090 785990298 785015225 784108102 783270895
2784 783270895 782432616 781583130 780673385 779651940 778577447 777506351 776411772 775243461 774041414
$$ packed form
2641.2H23515415n03659m71830m05014m39763n06759m48525l69727m29333m88042m25578
2661.6H19027185l94344m80652n05388l89635l65436n00620n23388m05788m27068n47230
2682H14487636n08130l92794m33385n40019n19633m57644n14508n96404n42283m77552
2702.4H09505284n47052o30974n99325n25534n72026o62327o29663n56827n75602o25670
2722.8H03580284n99265n76377o47008o57499n50389n29886o15239o37114n96404n77986
2743.2G97593117n83112n72145n62907o12676o69658o50704o18100o58691p21812p05481
2763.6G91237831o48558o86288p71165p48157o98984p76589r17792r75073r07123q37207
2784G83270895q38279q49486r09745j021445j074493j071096j094579j168311j202047
$$ plain form
2802.3 774041414 772872686 771691442 770449400 769162357 767838418 766479552 765090227 763698161
2818.7 763698161 762318134 760868490 759271801 757587194 755894363 754163980 752313197 750266850
2835 750266850 747961342 745298326 742134988 738407075 734177053 729619980 725202143 721596301 719092190
2853.3 719092190 717439115 716256320 715174556 713871658 712165713 709987760 707427382 704709053
2869.7 704709053 702042580 699537456 697252333 695243895 693450511 691689134 689870954 688015401
2886 688015401 686087549 684033990 681900918 679747880 677509964 675146401 672756732 670361698 667837977
2904.3 667837977 665106535 662132323 658802569 655019581 650854588 646582246 642579198 639118731
2920.6 639118731 636342883 634319246 633042097 632422566 632291377 632607579 633467257 634889305 636823773
$$ packed form
2802.3G74041414j168728j181244j242042j287043j323939j358866j389325j392066
2818.7G63698161j380027j449644j596689j684607j692831j730383j850783k046347
2835G50266850k305508k663016l163338l727913m230022m557073m417837l605842k504111
2853.3G19092190j653075j182795j081764j302898j705945k177953k560378k718329
2869.7G04709053k666473k505124k285123k008438j793384j761377j818180j855553
2886F88015401j927852k053559k133072k153038k237916k363563k389669k395034k523721
2904.3F67837977k731442k974212l329754l782988m164993m272342m003048l460467
2920.6F39118731k775848k023637j277149o19531j31189L16202Q59678J422048J934468
$$ plain form
2939 636823773 639210165 641838133 644279897 646208704 647625744 648651421 649261057 649483681 649596632
2957.4 649596632 649816811 650155008 650525272 650904059 651294708 651633859 651955366 652341306 652778268 653277397
2977.8 653277397 653884113 654506505 655051410 655566454 656072915 656539023 656805277 656663179 656220198 655570090
2998.1 655570090 654619277 653502166 652364373 651175559 649990797 648878455 647700191 646297336
3014.5 646297336 644694865 643000782 641300738 639571905 637715578 635766625 633860111 631998003
3030.8 631998003 630093873 628029823 625775158 623525381 621353447 619082391 616636634 614103556
3047.1 614103556 611579239 609073937 606518030 603887796 601189673 598496735 595936596 593491137
3063.4 593491137 591079354 588621736 586032033 583402038 580904305 578561246 576234519 573744357
$$ packed form
2939F36823773K386392K627968K441764J928807J417040J025677O09636K22624J12951
2957.4F49596632K20179L38197L70264L78787L90649L39151L21507L85940M36962M99129
2977.8F53277397O06716O22392N44905N15044N06461M66108K66254j42098m42981o50108
2998.1F55570090r50813j117111j137793j188814j184762j112342j178264j402855
3014.5F46297336j602471j694083j700044j728833j856327j948953j906514j862108
3030.8F31998003j904130k064050k254665k249777k171934k271056k445757k533078
3047.1F14103556k524317k505302k555907k630234k698123k692938k560139k445459
3063.4E93491137k411783k457618k589703k629995k497733k343059k326727k490162
$$ plain form
3079.7 573744357 571107805 568473101 565837502 563175976 560525239 557820380 555029571 552257001
3096 552257001 549566209 546838462 543928564 540947378 538090169 535289049 532316744 529246509 526285708
3114.4 526285708 523345411 520283282 517013848 513526976 510038078 506707489 503444850 500090778
3130.7 500090778 496596277 493124604 489805102 486475319 482912540 479162008 475453585 471840322
3147 471840322 468275607 464755237 461132407 457290471 453382611 449555278 445788413 442007631 438176990
3165.4 438176990 434347183 430539399 426745147 422969729 419174194 415355444 411570638 407816797
3181.7 407816797 404072016 400321633 396560878 392826557 389115721 385408908 381711870 378056765
3198 378056765 374463260 370900273 367356509 363876730 360468745 357092440 353736848 350431472 347201258
$$ packed form
3079.7E73744357k636552k634704k635599k661526k650737k704859k790809k772570
3096E52257001k690792k727747k909898k981186k857209k801120k972305l070235k960801
3114.4E26285708k940297l062129l269434l486872l488898l330589l262639l354072
3130.7E00090778l494501l471673l319502l329783l562779l750532l708423l613263
3147D71840322l564715l520370l622830l841936l907860l827333l766865l780782l830641
3165.4D38176990l829807l807784l794252l775418l795535l818750l784806l753841
3181.7D07816797l744781l750383l760755l734321l710836l706813l697038l655105
3198C78056765l593505l562987l543764l479779l407985l376305l355592l305376l230214
$$ plain form
3216.4 347201258 344004810 340817302 337661266 334561199 331538022 328594893 325759500 323031992
3232.7 323031992 320296109 317515850 314812481 312230825 309746414 307359546 305013269 302646697
3249 302646697 300316930 298069596 295860350 293654352 291468978 289321631 287179291 285021484 282902777
3267.4 282902777 280865401 278825313 276706666 274552912 272399217 270240754 268087357 265945703
3283.7 265945703 263825804 261731923 259675533 257650495 255581230 253432423 251219064 248999864
3300 248999864 246892884 244917706 242911264 240727842 238421887 236147046 233981758 231873319 229762629
3318.4 229762629 227687806 225683779 223717049 221706182 219638839 217594251 215608567 213755190
3334.7 213755190 212036163 210266382 208393902 206517383 204645038 202856779 201266944 199681848
$$ packed form
3216.4C47201258l196448l187508l156036l100067l023177k943129k835393k727508
3232.7C23031992k735883k780259k703369k581656k484411k386868k346277k366572
3249C02646697k329767k247334k209246k205998k185374k147347k142340k157807k118707
3267.4B82902777k037376k040088k118647k153754k153695k158463k153397k141654
3283.7B65945703k119899k093881k056390k025038k069265k148807k213359k219200
3300B48999864k106980j975178k006442k183422k305955k274841k165288k108439k110690
3318.4B29762629k074823k004027j966730k010867k067343k044588j985684j853377
3334.7B13755190j719027j769781j872480j876519j872345j788259j589835j585096
$$ plain form
3351 199681848 197901681 196074054 194458470 193077952 191705525 190276876 189025432 187946916 186717510
3369.3 186717510 185248792 183815733 182653263 181676537 180743903 179850951 179075748 178490281 178167880
3387.7 178167880 178071871 177909479 177466378 176992521 176925570 177135453 177026495 176550150 176299751 176475555
3408.1 176475555 176801458 177104920 177307621 177469403 177823529 178359270 178914502 179633066 180632636 181776732
3428.5 181776732 182863221 183972865 185252473 186407238 187219113 188070044 189298034 190809950 192452416
3446.8 192452416 194072604 195720389 197521836 199451506 201532051 203746706 205853403 207958624
3463.2 207958624 210472882 213226035 215625256 217499733 219397739 221746489 224502712 227298856
3479.5 227298856 229806140 232280433 235047549 237897754 240639508 243480727 246530250 249749273
$$ packed form
3351A99681848j780167j827627j615584j380518j372427j428649j251444j078516j229406
3369.3A86717510j468718j433059j162470r76726r32634q92952p75203n85467l22401
3387.7A78167880r6009j62392m43101m73857o6951K09883j08958m76345k50399J75804
3408.1A76475555L25903L03462K02701J61782L54126N35741N55232P18564R99570J144096
3428.5A81776732J086489J109644J279608J154765Q11875Q50931J227990J511916J642466
3446.8A92452416J620188J647785J801447J929670K080545K214655K106697K105221
3463.2B07958624K514258K753153K399221J874477J898006K348750K756223K796144
3479.5B27298856K507284K474293K767116K850205K741754K841219L049523L219023
$$ plain form
3495.8 249749273 252922148 255967557 259108424 262250245 265168428 268181473 271631002 275389940
3512.1 275389940 279072911 282494009 285919994 289608508 293664545 297740102 301525652 305368632
3528.4 305368632 309474170 313722223 318201721 322833925 327275306 331765473 336616397 341656774
3544.7 341656774 346502900 351121068 355911911 361078769 366300613 371497720 376985341 382604539
3561.1 382604539 387906104 393287480 399903655 406898707 412931144 418693751 424945235 431619853
3577.4 431619853 438539743 445586801 452479631 459420711 467058778 474795818 481775165 488923699
3593.7 488923699 496822298 504902601 512924254 520881295 528442800 535783112 543817163 552221715
3610 552221715 560335636 568454981 576254129 584294498 593194008 601193845 607854843 614315391 622464955
$$ packed form
3495.8B49749273L172875L045409L140867L141821K918183L013045L449529L758938
3512.1B75389940L682971L421098L425985L688514M056037M075557L785550L842980
3528.4C05368632M105538M248053M479498M632204M441381M490167M850924N040377
3544.7C41656774M846126M618168M790843N166858N221844N197107N487621N619198
3561.1C82604539N301565N381376O616175O995052O032437N762607O251484O674618
3577.4D31619853O919890P047058O892830O941080P638067P737040O979347P148534
3593.7D88923699P898599Q080303Q021653P957041P561505P340312Q034051Q404552
3610E52221715Q113921Q119345P799148Q040369Q899510P999837O660998O460548Q149564
$$ plain form
3628.4 622464955 631766081 639255524 646035731 652968049 659723997 666392386 672838032 678723574
3644.7 678723574 684482694 691361010 698443294 703659296 708124757 713427365 718725026 723113358
3661 723113358 727068663 730900764 734489799 738190830 742152512 745282352 748122334 751316786 754065752
3679.4 754065752 756564617 759135902 761702716 764340818 766884565 768928409 770695210 772439599
3695.7 772439599 774085164 775549710 777071536 778762519 780323148 781588256 782637477 783741176
3712 783741176 785004795 786192477 787249804 788203835 789054394 789802849 790554523 791476905 792410016
3730.3 792410016 793268144 794149041 795101464 796046913 796654463 796712160 796898127 797815740 798470438 798685133
3750.7 798685133 799234211 800024569 800536931 800873458 801378369 801854134 802252829 802676976 802986562 803305924
$$ packed form
3628.4F22464955R301126P489443O780207O932318O755948O668389O445646N885542
3644.7F78723574N759120O878316P082284N216002M465461N302608N297661M388332
3661G23113358L955305L832101L589035L701031L961682L129840K839982L194452K748966
3679.4G54065752K498865K571285K566814K638102K543747K043844J766801J744389
3695.7G72439599J645565J464546J521826J690983J560629J265108J049221J103699
3712G83741176J263619J187682J057327R54031Q50559P48455P51674R22382R33111
3730.3G92410016Q58128Q80897R52423R45449O07550N7697J85967R17613O54698K14695
3750.7G98685133N49078P90358N12362L36527N04911M75765L98695M24147L09586L19362
$$ plain form
3771.1 803305924 803785443 804356277 804895461 805266619 805515409 805691302 805860877 806116581 806469142 806869507
3791.5 806869507 807173252 807459891 807826340 807921529 807900608 808198214 808385909 808511078 808892071 809308529
3811.9 809308529 809468687 809576392 809900939 809941292 809882224 810052395 810218215 810406864 810587287 810828149
3832.3 810828149 811210990 811392486 811212659 811104119 811231434 811493695 811815679 812088966 812002182 811308146
3852.7 811308146 811031759 811532021 811962962 812126994 812106609 812176764 812313020 812250316 812222660 812287629
3873.1 812287629 812389612 812524855 812533259 812684178 812903225 812898874 812900484 812835753 812709808 812823653 812999427
3895.5 812999427 812998772 812912643 812812865 812732279 812795222 812869132 812852859 812874436 812916458 812888026 812887073 812972605
3920 812972605 813015163 812957048 812919736 812954307 812966049 812994063 813113868 813190818 813188970 813204765 813254416 813328207
$$ packed form
3771.1H03305924M79519N70834N39184L71158K48790J75893J69575K55704L52561M00365
3791.5H06869507L03745K86639L66449R5189k0921K97606J87695J25169L80993M16458
3811.9H09308529J60158J07705L24547M0353n9068J70171J65820J88649J80423K40862
3832.3H10828149L82841J81496j79827j08540J27315K62261L21984K73287q6784o94036
3852.7H11308146k76387N00262M30941J64032k0385P0155J36256o2704k7656O4969
3873.1H12287629J01983J35243Q404J50919K19047m351J610o4731j25945J13845J75774
3895.5H12999427o55q6129r9778q0586O2943P3910j6273K1577M2022k8432r53Q5532
3920H12972605M2558n8115l7312L4571J1742K8014J19805P6950j848J5795M9651P3791
$$ plain form
3944.5 813328207 813392222 813426554 813445508 813468456 813514173 813580930 813693881 813825428 813904107 813958824 814037859
3966.9 814037859 814107537 814178050 814314663 814455807 814548910 814653575 814794123 814941347 815026820 815029740 815036535
3989.4 815036535 815115333 815273881 815469623 815615356
3997.5 815615356
$$ packed form
3944.5H13328207O4015L4332J8954K2948M5717O6757J12951J31547P8679N4717P9035
3966.9H14037859O9678P0513J36613J41144R3103J04665J40548J47224Q5473K920O795
3989.4H15036535P8798J58548J95742J45733
3997.5H15615356
##END=$$ End of the data block
