##TITLE=$$ Begin of the data block
##JCAMP-DX=5.00 $$ ACD/SpecManager v 10.08
##SPECTROMETER/DATA SYSTEM=Alpha
##DATE=15 Apr 2014 09:00:42
##DATA TYPE=INFRARED SPECTRUM
##DATA CLASS=XYDATA
##ORIGIN=
##OWNER=
##NPOINTS=1765
##FIRSTX=399.75695801
##LASTX=3997.56933594
##MAXX=3997.56933594
##MINX=399.75695801
##MAXY=0.83513957
##MINY=0.29430234
##XFACTOR=1.0000000000
##YFACTOR=1.000000000000000e-9
##FIRSTY=0.59182173
##DELTAX=2.03957629
##XUNITS=1/CM
##YUNITS=ARBITRARY UNITS
##XYDATA=(X++(Y..Y))
399.8E91821730q56578j358092j913309r53019j288593j837432l78609J10686p68781
418.1E82578003l24487l58224j042605k62618j93000j227021l74675L85762j128853
436.5E78052282j147389M06146p0691n39661N54026K0146p71284K48194N8174j029492
456.9E75780451l51727m45664j784205j043201k80797j336277q16762J25229j153171
475.2E68693876j204014K09928l52502r07302K91705j02281j211226k74301j68621
493.6E64975262j448214q01027j46628j284241j025260j41561j200437j427889l90053
511.9E57109952j036644j509130l05355p27176k037347j269281q44776j692176r57847
530.3E46730220m16219j653433j320958q1956q67963r80973L88860k35855j318813
$$ plain form
399.8 591821730 590965152 589607060 587693751 586740732 585452139 583614707 583236098 583346784 582578003
418.1 582578003 582253516 581895292 580852687 580590069 580397069 579170048 578795373 579181135 578052282
436.5 578052282 576904893 577311039 577240348 576700687 577254713 577274859 576503575 576751769 576809943 575780451
456.9 575780451 575428724 574983060 573198855 572155654 571874857 570538580 569721818 569847047 568693876
475.2 568693876 567489862 567699790 567347288 566439986 566731691 566629410 565418184 565143883 564975262
493.6 564975262 563527048 562726021 562579393 561295152 560269892 560128331 558927894 557500005 557109952
511.9 557109952 556073308 554564178 554258823 553531647 551494300 550225019 549380243 547688067 546730220
530.3 546730220 546314001 544660568 543339610 543257654 542389691 541408718 541797578 541561723 540242910
548.6E40242910m01437l98576j489043r27806o10769j747370j567006j000047k151370
567E29949486k433061j515150k087951k478182j276195j249135k033114j223863q66949
585.4E14785886j846969j483620p94172j510083j168073n3346p76708j501203p18534
603.7E04933178m90307m15087Q07345P76827l75032N32508K302169K707601L410637
622.1E14189839M335523L533602L028571L880084L436983K386748K741278K352774
638.4E39885402O77764L64125J036704J414537K368629K460837q2135j764715M09544
656.7E46770692L625333N194903N428314L918826K492905L714919L419399J794279
673.1E76359570K115548L100693K423882J830280K573669K193392J237094J697600
$$ plain form
548.6 540242910 539841473 539442897 537953854 537026048 536415279 534667909 533100903 532100856 529949486
567 529949486 527516425 526001275 523913324 521435142 520158947 518909812 516876698 515652835 514785886
585.4 514785886 512938917 511455297 510661125 509151042 507982969 507929623 507152915 505651712 504933178
603.7 504933178 504442871 504027784 504835129 505611956 505236924 505769432 508071601 510779202 514189839
622.1 514189839 518525362 522058964 525087535 528967619 532404602 534791350 537532628 539885402
638.4 539885402 540563166 540927291 541963995 543378532 545747161 548207998 548125863 546361148 546770692
656.7 546770692 550396025 555590928 561019242 564938068 567430973 571145892 574565291 576359570
673.1 576359570 578475118 581575811 583999693 585829973 588403642 590597034 591834128 593531728
689.4E93531728J618802M69447O23583J012266K60830N36919J701891J496613J307130
707.7F02559209K203703K052724J412094K063691K158463J263321J906156K910972
724F18530333K207518J852572K545893K160311J589477K112507J737118Q40068J497388
742.4F35073185J950860J134992J346528K038658J423597J267255K062678J723468
758.7F48021221J142144J733125J645445Q73983J251400J339376J89125o0260J56701
777.1F56292260q85368j522720r44912r73165j005590M27306J642525K167523L712594
795.4F58910453N169869N187988N487084N990506N007744M127860M207789L204942
811.7F97294235J759649J616835J004815p73132j649201k276778l942489m774034m491508
$$ plain form
689.4 593531728 595150530 595619977 596243560 597255826 597516656 598053575 599755466 601252079 602559209
707.7 602559209 604762912 606815636 608227730 610291421 612449884 613713205 615619361 618530333
724 618530333 620737851 622590423 625136316 627296627 628886104 630998611 632735729 633575797 635073185
742.4 635073185 637024045 638159037 639505565 641544223 642967820 644235075 646297753 648021221
758.7 648021221 649163365 650896490 652541935 653415918 654667318 656006694 656195819 656135559 656292260
777.1 656292260 655406892 653884172 652939260 651966095 650960505 651387811 653030336 655197859 658910453
795.4 658910453 664080322 669268310 674755394 680745900 685753644 689881504 694089293 697294235
811.7 697294235 699053884 700670719 701675534 700902402 699253201 696976423 693033934 688259900 683768392
830.1F83768392m979432n240381m220366l800810m033625l305673k586007k348781
846.4F53253317p67648J658499L294706N243838P643044Q536697Q635818R295643R012103
864.8G05806017P649004O952763O019711M092694L149509K941609J566410K96831j0371
883.1G38464177j168728k499223k376437k348006k727866j649737j59264K16544Q87394
901.5G26638854J813888J354814O20126N29707n07414k140224k802730l521681m623830
919.8G17361510m307926l104687k425372j242936L34442O41167N22375J019836P66336
938.2G09564745m5716O2942j0311r74238j401425j769602l246009m473031n063355
956.6F92644000o543696q308649r277582j0573804j2283743j3011098j3097524j3038040
$$ plain form
830.1 683768392 678788960 673548579 669328213 665527403 661493778 658188105 655602098 653253317
846.4 653253317 652485669 654144168 657438874 662682712 670325756 678862453 687498271 696793914 705806017
864.8 705806017 713455021 720407784 726427495 730520189 733669698 736611307 738177717 738474548 738464177
883.1 738464177 737295449 734796226 732419789 730071783 727343917 725694180 725534916 725751460 726638854
901.5 726638854 728452742 729807556 730427682 730957389 730449975 728309751 725507021 721985340 717361510
919.8 717361510 713053584 709948897 707523525 706280589 706615031 707256198 707778573 708798409 709564745
938.2 709564745 709519029 709581971 709571660 708597422 707195997 705426395 702180386 697707355 692644000
956.6 692644000 686100304 677791655 668514073 657940269 645656526 632645428 619547904 606509864
972.9F06509864j1788308r738267q378088p288397n980432n380571n168914m382253
989.2E48404634l740311l544032k906204k226293k163469j937211j537740j991213
1005.5E28358161k850472l380657m148304m942000m965663m787326m779458m290611
1021.8D94213670l672182l574193l327310k727359k481580k319783j780570j465111
1038.1D72865582j473815j225918j109422j476496j579285j333862j205385o46382
1054.5D62815017N53309J555592K130777K434820J911133N85318o60986j700163k619892
1072.8D67004925k880424k579898k432883k373606k259612k578705l220767l489822
1089.1D45189208l315807k706855j395077J47343J245320K005517K516330K466291
$$ plain form
972.9 606509864 594721556 584983289 576605201 569316804 563336372 557955801 552786887 548404634
989.2 548404634 544664323 541120291 538214087 535987794 533824325 531887114 530349374 528358161
1005.5 528358161 525507689 522127032 517978728 513036728 508071065 503283739 498504281 494213670
1021.8 494213670 490541488 486967295 483639985 480912626 478431046 476111263 474330693 472865582
1038.1 472865582 471391767 470165849 469056427 467579931 466000646 464666784 463461399 462815017
1054.5 462815017 463368326 464923918 467054695 469489515 471400648 471985966 471324980 469624817 467004925
1072.8 467004925 464124501 461544603 459111720 456738114 454478502 451899797 448679030 445189208
1089.1 445189208 441873401 439166546 437771469 437918812 439164132 441169649 443685979 446152270
1105.4D46152270K128124J871646J306682L24518p44641k241105m194707n080401l607989
1123.8D35914397p97421J377285K143025J405865J07170Q2820J297683K394348K959520
1142.2D46884692K954125K375662J847208J672387J542926J628399K184570K885759
1158.5D63975728L664135M846395O157964P152498P973730Q560986Q588671Q331895
1174.8E19252002Q031726P400513O525993N612850M183650K137661J77205j487553
1191.1E51834047k830088l224314k604126j601518l69012Q78513J461685J350879J014471
1209.5E45910537M23253l79682q57174r65655j074374j039207p57694n57303l16561
1227.8E40386140J90914N91576P85768J129210J458883J463116J435160J441181J152217
$$ plain form
1105.4 446152270 448280394 450152040 451458722 451783240 451038599 448797494 444602787 439522386 435914397
1123.8 435914397 435116976 436494261 438637286 440043151 440150321 440233141 441530824 443925172 446884692
1142.2 446884692 449838817 452214479 454061687 455734074 457277000 458905399 461089969 463975728
1158.5 463975728 467639863 472486258 478644222 485796720 493770450 502331436 510920107 519252002
1174.8 519252002 527283728 534684241 541210234 546823084 551006734 553144395 553321600 551834047
1191.1 551834047 549003959 545779645 543175519 541574001 541204989 542083502 543545187 544896066 545910537
1209.5 545910537 546333790 545954108 545096934 544131279 543056905 542017698 541260004 540702701 540386140
1227.8 540386140 540577054 541168630 541954398 543083608 544542491 546005607 547440767 548881948 550034165
1246.2E50034165P96676O16133L36349P3672J99914M89533P85172J357197K031029
1264.5E56719840K510011L038108L658533M003227M199505M542529M759789M790127
1280.8E88221669M983008N225480N259037N247354N200088M885555M471540M155636
1297.2F27649367L726303L241778K945602K638101K211571J947940J799762J486659
1313.5F47647083J245498J318813J353621J291395J412689J457274J265228J107931
1329.8F58099532Q74221L96073R9063J77503J96576J63317L99172N90384N46277N33580
1350.2F62075698M63009J66238j57953m42624r33170j600146j999736j951337j783550
1368.5F53836429j776695k113342k636016k387523j365543r31203j133502p23779j5497
$$ plain form
1246.2 550034165 550830841 551446974 551783323 551856995 552056909 552546442 553331614 554688811 556719840
1264.5 556719840 559229851 562267959 565926492 569929719 574129224 578671753 583431542 588221669
1280.8 588221669 593204677 598430157 603689194 608936548 614136636 619022191 623493731 627649367
1297.2 627649367 631375670 634617448 637563050 640201151 642412722 644360662 646160424 647647083
1313.5 647647083 648892581 650211394 651565015 652856410 654269099 655726373 656991601 658099532
1329.8 658099532 658973753 659369826 659468889 659646392 659842968 660006285 660405457 660995841 661542118 662075698
1350.2 662075698 662538707 662704945 662546992 662104368 661171198 659571052 657571316 655619979 653836429
1368.5 653836429 652059734 649946392 647310376 644922853 643557310 642626107 641492605 640768826 640753329
1386.9F40753329j79947o84917r44078j360476j855671k350092k910972l108918l009439
1405.3F24348819k951860k778828k343953j961410j662016j168787q76844j109779
1421.6F09495342j068056q23498q75592j044333j102924j042128p26759l30329k80917
1439.9F02200806j62899J88529N98908Q06212Q23200R19997J487196L651142N982578
1458.3F16495669N168557M749596O202638P471502Q123100J0252297J2963354J1435032
1474.6F82861745P884860O132901M971504L688395K456308J345396j9610j469374k350926
1493G05501199k947092l664315m264295m587472m476785m708827o393313o849826n986571
1511.3F61622703n500913m910111l980875k974689k755463k971351k828598k805889
$$ plain form
1386.9 640753329 640573382 639888465 638944387 637583911 635728240 633378148 630467176 627358258 624348819
1405.3 624348819 621396959 618618131 616274178 614312768 612650752 611481965 610605121 609495342
1421.6 609495342 608427286 607603788 606728196 605683863 604580939 603538811 602812052 602481723 602200806
1439.9 602200806 602037907 602226436 602825344 603631556 604454756 605374753 606861949 610513091 616495669
1458.3 616495669 621664226 626413822 632616460 640087962 648211062 658463359 671426713 682861745
1474.6 682861745 690746605 696879506 701851010 705539405 707995713 709341109 709321499 707852125 705501199
1493 705501199 702554107 698889792 694625497 690038025 685561240 680852413 674459100 667609274 661622703
1511.3 661622703 656121790 651211679 647230804 644256115 641500652 638529301 635700703 632894814
1527.6F32894814k639890k119362j914978j937747j295149m33982o33418q02875l16560
1546F20800853K49624R70364J666665J999795K147615L136218K823412M79818n8532
1564.3F34215832k7299n09739j351535k241970k911746l904223m647196n000293n519927
1582.7F08101904n861997o192744o550550o761432o875217p081211p080137o920755
1599E54777861o892264o842852o713450o735504o887257o808817o491899o505430o850690
1617.4D94049698o021052n267531n376727n241096m854381m331439l342450k267212
1633.7D57347810j431435q35389l10987M62413J357853K594948L053129K261668L413856
1652D67913866N413145L785968L179013M306108N609185O034612N477339O242276P362663
$$ plain form
1527.6 632894814 630254924 628135562 626220584 624282837 622987688 622553706 621920288 621117413 620800853
1546 620800853 621050477 622020841 623687506 625687301 627834916 630971134 633794546 634274364 634215832
1564.3 634215832 634188533 633678794 632327259 630085289 627173543 623269320 618622124 613621831 608101904
1582.7 608101904 602239907 596047163 589496613 582735181 575859964 568778753 561698616 554777861
1599 554777861 547885597 541042745 534329295 527593791 520706534 513897717 507405818 500900388 494049698
1617.4 494049698 488028646 482761115 477384388 472143292 467288911 462957472 459615022 457347810
1633.7 457347810 455916375 455080986 454769999 455232412 456590265 459185213 462238342 464500010 467913866
1652 467913866 473327011 477112979 480291992 484598100 490207285 496241897 501719236 507961512 515324175
1670.4E15324175O594479O785989P568538O851137O436348P741511J0102034Q712053
1686.7E76116264P054984P565618P347941Q330584R560823R977043J1497021R591043
1703F47041321Q107185Q289576P275402O533504O198406O160975O560862N472898L851175
1721.4G05491304L681541L781974L435612L351509L403903L915250L737628K949536
1737.7G33748257L265858L645062L794790M176437M583061N067528M921674L904999
1754G67107666L515899L413081K934217K750039K487421K165497K107501K172768K139568
1772.4G90793657J665294J375199J549482J556635J440704J495600J392424J268565
1788.7H02537560J500369J557350J090407R66072J118362J080930J000286R54210Q22485
$$ plain form
1670.4 515324175 521918654 528704643 536273181 543124318 549560666 557302177 567404211 576116264
1686.7 576116264 583171248 590736866 598084807 606415391 615976214 625953257 637450278 647041321
1703 647041321 655148506 663438082 670713484 677246988 683445394 689606369 696167231 701640129 705491304
1721.4 705491304 709172845 712954819 716390431 719741940 723145843 727061093 730798721 733748257
1737.7 733748257 737014115 740659177 744453967 748630404 753213465 758280993 763202667 767107666
1754 767107666 770623565 774036646 776970863 779720902 782208323 784373820 786481321 788654089 790793657
1772.4 790793657 792458951 793834150 795383632 796940267 798380971 799876571 801268995 802537560
1788.7 802537560 804037929 805595279 806685686 807651758 808770120 809851050 810851336 811805546 812628031
1807H12628031Q05199R15646P57695O04808P32958P61450O06477P02321Q56936P07627
1827.4H20079148O28769N94557M15861L92199N61654N84960N45621O77586N57124K14577
1847.8H25252056K73407M85241M05967L13938M16040L95596K66493L50594M88282M30047
1868.2H29077661K82228K02954J40607J50085K72333K47956J65462K54989K90215J93775
1888.6H31278265J76429K02835J43647J30594J85907J14143O1929J88529J86503N1379
1909H32720160J03415J61826Q1420J12891J49548K1398r775P8202K5570r3341j8537
1931.5H33332777M1425r7394q0108O9856n185j46032j02758j25408k11597j10149p4148
1953.9H32491279j94848j47700m7386j63376k09630q7082j40131k37703j26183p9930
$$ plain form
1807 812628031 813433230 814348876 815106571 815711379 816444337 817205787 817812264 818514585 819371521 820079148
1827.4 820079148 820707917 821302474 821718335 822110534 822672188 823257148 823802769 824480355 825037479 825252056
1847.8 825252056 825525463 826010704 826416671 826730609 827146649 827542245 827808738 828159332 828647614 829077661
1868.2 829077661 829359889 829562843 829703450 829853535 830125868 830373824 830539286 830794275 831084490 831278265
1888.6 831278265 831454694 831657529 831801176 831931770 832117677 832231820 832293749 832482278 832668781 832720160
1909 832720160 832823575 832985401 833066821 833179712 833329260 833350658 833340883 833419085 833444655 833351314 833332777
1931.5 833332777 833374202 833276808 833196700 833266556 833261371 833115339 833012581 832887173 832675576 832565427 832491279
1953.9 832491279 832296431 832148731 832101345 831937969 831728339 831641257 831501126 831263423 831137240 831057310
1974.3H31057310j71482j23859n5134j34766j48595o8426j20997j66655r6559j61529
1994.7H29809308k67386j71006j07050k34604k32756j29700k19047l03507j83224j30177
2015.1H27830851j98781j84298k04205k89143k32339j24454j93119k34902j41323j95980
2035.5H25832307k93910j71244r7275k00451j52051p3314j89244k02358p3493j05321
2055.9H24273646j46032m4763o9499j72674q8871j9014j11341p2897L8147n9068j24931
2078.3H23402703J3113R835r1315J6868M0114j32858q5652P6413j371k6584J17839
2100.7H23339105N4299o5147N4836P8916o6101Q404J16646J8716M0889J76966R6739
2123.2H23854268K7120J60396J35243L099J10626K00808J01567J38938K14279Q8692
$$ plain form
1974.3 831057310 830885828 830761969 830706835 830572069 830423474 830355048 830234051 830067396 829970837 829809308
1994.7 829809308 829541922 829370916 829263866 829029262 828796506 828666806 828447759 828144252 827961028 827830851
2015.1 827830851 827632070 827447772 827243567 826954424 826722085 826597631 826404512 826169610 826028287 825832307
2035.5 825832307 825538397 825367153 825269878 825069427 824917376 824844062 824654818 824452460 824378967 824273646
2055.9 824273646 824127614 824082851 824013352 823840678 823751807 823732793 823621452 823548555 823586702 823527634 823402703
2078.3 823402703 823415816 823425651 823334336 823351204 823391318 823258460 823172808 823249221 823247850 823221266 823339105
2100.7 823339105 823393404 823328257 823383093 823462009 823395908 823404312 823520958 823539674 823580563 823757529 823854268
2123.2 823854268 823881388 824041784 824177027 824180126 824290752 824491560 824593127 824732065 824946344 825035036
2143.6H25035036N4299J80662J49489Q6963J99795J92224O5625J60575K55346J06514
2164H26486528Q6307K30432J66476J06334K63751K70903J18077J55270K12073J04726
2184.4H28200877J05440J89782J18434P3135J53482J08540L5465J34825J36793k325
2204.8H29254448N0426J51336O1393K5034Q8990L8683J4484J31071J11818j7583K8073
2227.2H29938173N7161m3988J967Q2433k7239q0586K1100N544n5850K0444L159j32024
2251.7H29790294j05381k8550r3818r0122L8683J6928o2943J4127P2538L5346L6359
2274.1H29623461K9444j7941P0155J84953P6414l7790L1591K0325p2658j610M8399
2296.5H29954743l6597k9862Q583j10388k08199j45375q1897k7418K8193j11580l26932
$$ plain form
2143.6 825035036 825089335 825269997 825419486 825506449 825706244 825898468 825964093 826124668 826380014 826486528
2164 826486528 826572835 826803267 826969743 827076077 827339828 827610731 827728808 827884078 828096151 828200877
2184.4 828200877 828306317 828496099 828614533 828687668 828841150 828949690 828985155 829119980 829256773 829254448
2204.8 829254448 829304874 829456210 829517603 829542637 829631627 829670310 829684794 829815865 829927683 829910100 829938173
2227.2 829938173 829995334 829951346 829953313 830035746 830008507 829927921 829949021 829954565 829898715 829919159 829922318 829790294
2251.7 829790294 829684913 829656363 829562545 829472423 829511106 829528034 829465091 829479218 829551756 829587102 829623461
2274.1 829623461 829652905 829634964 829705119 829890072 829966486 829928696 829960287 829980612 829907954 829906344 829954743
2296.5 829954743 829918146 829888284 829896867 829786479 829578280 829432905 829351008 829323590 829351783 829240203 828913271
2319H28913271k23696N4062N9902m7505j6331M291m2379r5486r2924J1683J57892L69132
2343.5H29051912O50048N18143o4790n18918n15640l11613l03864k14816J67728N17189
2363.8H28975379O60480O36458N68449N77748O31571O05643N30422N24103M94957L46661
2384.2H34551871K01583J44839Q1122K4080N7638P8440o56m9531j4425l815j3709j3291
2408.7H35044146l5704m6908k0862l1531p6234p4327p1347j29223j49608q7380p0989
2431.2H34250033j08421j03414j05321j34170j11819r6023j34170j11341p3910j49012
2451.5H33122432k09510j47760j01388j35958j53541j44601j45674j29342j23918j57535
2471.9H31673205j76251j66893j81615k24173k08378j33157j25706j82867k03371j91450
$$ plain form
2319 828913271 828689575 828743637 828803539 828756034 828739703 828743994 828701615 828606129 828513205 828524888 828682780 829051912
2343.5 829051912 829701960 830220103 830155313 829636395 829120755 828809142 828505278 828290462 828458190 828975379
2363.8 828975379 829635859 830272317 830840766 831418514 832050085 832655728 833186150 833710253 834205210 834551871
2384.2 834551871 834753454 834898293 834979415 835003495 835061133 835139573 835138917 835089386 835074961 835071146 835057437 835044146
2408.7 835044146 835008442 834961534 834940672 834909141 834832907 834758580 834687233 834558010 834408402 834321022 834250033
2431.2 834250033 834141612 834038198 833932877 833798707 833686888 833590865 833456695 833345354 833271444 833122432
2451.5 833122432 832912922 832765162 832663774 832527816 832374275 832229674 832084000 831954658 831830740 831673205
2471.9 831673205 831496954 831330061 831148446 830924273 830715895 830582738 830457032 830274165 830070794 829879344
2492.3H29879344j68086j36673j44243j69039j67966j92702k19702j81616j41680j70171
2512.7H28187466j98245j75655j91093k41995k13265j42574j54019j98781j84596j63853
2533.1H26323390j57416j27315j34886j87516j74165j39117j64986j80840j72496j99020
2553.5H24685633k05815j44779j54317k41637k31683k04265k59638k63751k55584l26336
2573.9H22397828l41236k90216k93970l05175k85507l46183m40002m00364l40760l96609
2594.3H18957806m23789l93987m54545n18203m62413m39107m78029m30763m23730n33700
2614.7H14399540n24699m37677m68016m95136m58836m95970n58258n12898m71234n03301
2635.1H09473515m61698m15981n03898n15222m06742m40002m93347m17471m59075n51522
$$ plain form
2492.3 829879344 829711258 829574585 829430342 829261303 829093337 828900635 828680933 828499317 828357637 828187466
2512.7 828187466 827989221 827813566 827622473 827380478 827167213 827024639 826870620 826671839 826487243 826323390
2533.1 826323390 826165974 826038659 825903773 825716257 825542092 825402975 825237989 825057149 824884653 824685633
2553.5 824685633 824479818 824335039 824180722 823939085 823707402 823503137 823243499 822979748 822724164 822397828
2573.9 822397828 822056592 821766376 821472406 821167231 820881724 820535541 820095539 819695175 819354415 818957806
2594.3 818957806 818534017 818140030 817685485 817167282 816704869 816265762 815787733 815356970 814933240 814399540
2614.7 814399540 813874841 813437164 812969148 812474012 812015176 811519206 810960948 810448050 809976816 809473515
2635.1 809473515 809011817 808595836 808091938 807576716 807169974 806729972 806236625 805819154 805360079 804808557
2655.5H04808557m53532l81469m46499m32551l93688m95851n56708m42982l90172m19020
2675.9H00396085l64602l97086n30004m73023l84211m75884m57883l77714m90249n46574
2696.3G95898855m44353m69327n82218n41329n17309o67811p19606o35505o77645p05719
2716.7G89938033n81742n90622p03693o53803o05345o62803n86212m74751n35846n30898
2737.1G84012318m14312m68076n48899m67181m83930n93126n49912n47529o90400o76692
2757.5G78572261n88119o81102p15733o44505p20858q10862p77483q30292r38416q74877
2777.9G70990014q68738j010656r48608q41856r90689j095354j035393j099646j195073
2796.2G61904001j149237j212776j370072j353443j330614j443386j497090j531899
$$ plain form
2655.5 804808557 804355025 803973556 803527057 803094506 802700818 802204967 801648259 801205277 800815105 800396085
2675.9 800396085 800031483 799634397 799104393 798631370 798247159 797771275 797313392 796935678 796445429 795898855
2696.3 795898855 795454502 794985175 794402957 793861628 793344319 792676508 791956902 791321397 790643752 789938033
2716.7 789938033 789356291 788765669 788061976 787408173 786802828 786140025 785553813 785079062 784543216 784012318
2737.1 784012318 783598006 783129930 782581031 782113850 781629920 781036794 780486882 779939353 779248953 778572261
2757.5 778572261 777984142 777303040 776587307 775942802 775221944 774411082 773633599 772803307 771864891 770990014
2777.9 770990014 770121276 769110620 768162012 767320156 766329467 765234113 764198720 763099074 761904001
2796.2 761904001 760754764 759541988 758171916 756818473 755487859 754044473 752547383 751015484
2812.5G51015484j697302j808822j795292j937151k205133k361059k596736l033817
2828.9G33580172l449619l990650m937589o101370p405937r024501j0751605j2354612
2845.2F75564289j3651073j3681590j1260212o469846q76188L563821N625427N275190
2861.5F44089818L428161J215816n24879j183450n50270O53326J388848J331985O10173
2879.9F50459528n56231j761555k781034l678918m346966m646600m806399m996657
2896.2F22885168n100966n225241n541861n986035o683648p837236r352982j1054754
2912.5E66102445j2677789j3532459j2883008j0625541p041633k581179J930833N617082
2928.8E14308751Q125305R653330J0405361J0456026R900153Q684933O760359M406154
$$ plain form
2812.5 751015484 749318182 747509360 745714068 743776917 741571784 739210725 736613989 733580172
2828.9 733580172 730130553 726139903 721202314 715100944 707695007 698670506 687918901 675564289
2845.2 675564289 661913216 648231626 636971414 630501568 629625380 633189201 638814628 644089818
2861.5 644089818 647517979 648733795 648208916 647025466 646475196 647128522 648517370 649849355 650459528
2879.9 650459528 649903297 648141742 645360708 641681790 637334824 632688224 627881825 622885168
2896.2 622885168 617784202 612558961 607017100 601031065 594347417 586510181 577157199 566102445
2912.5 566102445 553424656 539892197 527009189 516383648 509342015 506760836 508691669 514308751
2928.8 514308751 522434056 532087386 542492747 552948773 562848926 571533859 578294218 582700372
2945.1E82700372J990616n4359j107812r43423J55867J821875L631115N182862O326437
2963.5E99703550P144869P581770P455528O927073O239116N384505M551947L954530
2979.8F48942888L389060K810896K422452K133488J806736J424134R55761N33104K25186
2998.1F64643705m5896k94745m99844n49972m57287l92437m16279n66900p69496q24749
3018.5F59826100q24213r47535j094580j183867j246691j254857j198530j268923j476646
3036.9F49330258j510143j456022j566112j704931j730204j703143j699031j690626
3053.2F36270046j691222j748323j755357j653671j560033j472771j424253j547515
3069.5F23416901j613737j449048j281202j256764j370609j523256j581073j561165
$$ plain form
2945.1 582700372 584690988 584636629 583528817 582585394 582741261 584563136 588194251 593377113 599703550
2963.5 599703550 606848419 614430189 621885717 628812790 635051906 640436411 644988358 648942888
2979.8 648942888 652331948 655142844 657565296 659698784 661505520 662929654 663885415 664418519 664643705
2998.1 664643705 664597809 664303064 663803220 663253248 662795961 662403524 661987245 661420345 660650849 659826100
3018.5 659826100 659001887 658054352 656959772 655775905 654529214 653274357 652075827 650806904 649330258
3036.9 649330258 647820115 646364093 644797981 643093050 641362846 639659703 637960672 636270046
3053.2 636270046 634578824 632830501 631075144 629421473 627861440 626388669 624964416 623416901
3069.5 623416901 621803164 620354116 619072914 617816150 616445541 614922285 613341212 611780047
3085.8F11780047j528382j531601j593411j616418j594544j609861j650751j755655
3102.2E98899424j851499j789749j732528j877725j991808j875937j828790k009511
3118.5E83941877k219856k351224k368629k276957k209545k269983k350211k329826
3134.8E65565646k287448k346575k516687k620757k581596k552509k525211k459287
3151.1E45675576k540231k736807k788365k722382k690196k726674k767504k747118
3167.4E23956299k747238k786994k776325k717018k669811k685487k787888k848983
3183.7E01936555k772480k667427k654434k714276k730012k688587k663523k665549
3200.1D80380267k656728k634436k598345k546430k499968k461105k458573k493769
$$ plain form
3085.8 611780047 610251665 608720064 607126653 605510235 603915691 602305830 600655079 598899424
3102.2 598899424 597047925 595258176 593525648 591647923 589656115 587780178 585951388 583941877
3118.5 583941877 581722021 579370797 577002168 574725211 572515666 570245683 567895472 565565646
3134.8 565565646 563278198 560931623 558414936 555794179 553212583 550660074 548134863 545675576
3151.1 545675576 543135345 540398538 537610173 534887791 532197595 529470921 526703417 523956299
3167.4 523956299 521209061 518422067 515645742 512928724 510258913 507573426 504785538 501936555
3183.7 501936555 499164075 496496648 493842214 491127938 488397926 485709339 483045816 480380267
3200.1 480380267 477723539 475089103 472490758 469944328 467444360 464983255 462524682 460030913
3216.4D60030913k504319k461671k405703k394319k403647k360075k286315k252281
3232.7D40962583k276629k295792k262444k199739k125174k064049k036333k057225
3249D23645198k058923j979917j924008j940757j936287j902342j879334j854569j836658
3267.4D06332403j794099j759619j787662j817286j826793j800090j742304j748472
3283.7C92056078j764208j690448j632243j664788j731425j770824j758904j730322
3300C78312916j710892j663983j655191j765788j891106j931131j895845j850814j830667
3318.4C62117499j828760j840889j859695j911253j952171j939029j922696j884312
3334.7C46978694j834482j864046j926869j954585k002865j989395j856595j840561
$$ plain form
3216.4 460030913 457526594 455064923 452659220 450264901 447861254 445501179 443214864 440962583
3232.7 440962583 438685954 436390162 434127718 431927979 429802805 427738756 425702423 423645198
3249 423645198 421586275 419606358 417682350 415741593 413805306 411902964 410023630 408169061 406332403
3267.4 406332403 404538304 402778685 400991023 399173737 397346944 395546854 393804550 392056078
3283.7 392056078 390291870 388601422 386969179 385304391 383572966 381802142 380043238 378312916
3300 378312916 376602024 374938041 373282850 371517062 369625956 367694825 365798980 363948166 362117499
3318.4 362117499 360288739 358447850 356588155 354676902 352724731 350785702 348863006 346978694
3334.7 346978694 345144212 343280166 341353297 339398712 337395847 335406452 333549857 331709296
3351C31709296j986892k067804k020031j935840j890033j866490j786411j726776j824021
3369.3C14604998j966536j905084j653314j457363j392067j391559j323104j147360
3385.7C02368611r03517o66112p08133r46045r27597o01440l25323m47183p56205o78211
3406.1B95408845l50058k04265j81258j68085j55419m7416Q7470J46777K61843M83811
3426.5B95282245O77913O94990P52390R33349Q70913O45876P06285R96799J217633
3444.8C02778393J362145J420140J442671J523167J626521J742870J847356J829595
3461.1C15572858J840889K075315K244651K064198J767010J771420K020151K259403
3477.4C31615895K316505K181202K139985K289922K338528K273351K344281K485573
$$ plain form
3351 331709296 329722404 327654600 325634569 323698729 321808696 319942206 318155795 316429019 314604998
3369.3 314604998 312638462 310733378 309080064 307622701 306230634 304839075 303515971 302368611
3385.7 302368611 301465094 300798982 300090849 299144804 298217207 297615767 297290444 296843261 296087056 295408845
3406.1 295408845 295058787 294854522 294673264 294505179 294349760 294302344 294389814 294536591 294798434 295282245
3426.5 295282245 295960158 296655148 297407538 298340887 299211800 299857676 300563961 301560760 302778393
3444.8 302778393 304140538 305560678 307003349 308526516 310153037 311895907 313743263 315572858
3461.1 315572858 317413747 319489062 321733713 323797911 325564921 327336341 329356492 331615895
3477.4 331615895 333932400 336113602 338253587 340543509 342882037 345155388 347499669 349985242
3493.8C49985242K588838K567798K531231K620875K580405K403408K496690K768993
3510.1C70543480K885759K846688K780169K799749K927155L161907L183097K983182
3526.4C94111186L008724L165453L249169L440976L550470L367871L387183L688007
3542.7D20969039L893376L738165L429353L509640L835381L924787L897130M029393
3559D51226264M141808M057735M267693M955738M939437M347205M315526M652708M887820
3577.4D91791934N027205N062699N056321N387903N865335N575836N039155N326867
3593.7E34133255N790949N858422N905091N901695N655169N594433O110131O390214
3610E81339359O165743N941510N696655O122291O662369N907237N042672N278886O794333
$$ plain form
3493.8 349985242 352574080 355141878 357673109 360293984 362874389 365277797 367774487 370543480
3510.1 370543480 373429239 376275927 379056096 381855845 384783000 387944907 391128004 394111186
3526.4 394111186 397119910 400285363 403534532 406975508 410525978 413893849 417281032 420969039
3542.7 420969039 424862415 428600580 432029933 435539573 439374954 443299741 447196871 451226264
3559 451226264 455368072 459425807 463693500 468649238 473588675 477935880 482251406 486904114 491791934
3577.4 491791934 496819139 501881838 506938159 512326062 518191397 523767233 528806388 534133255
3593.7 534133255 539924204 545782626 551687717 557589412 563244581 568839014 574949145 581339359
3610 581339359 587505102 593446612 599143267 605265558 611927927 617835164 622877836 628156722 634951055
3628.4F34951055P104814N524635N146861N349160N236387N182326N019069M708170
3644.7F78222477M942179N957723N705178L944814L571272M365146M163623L485739
3661G14358151L291488L228843L208756L569424L562868K855837K891899K775013K098024
3679.4G41840303K036869K182663K250433K587497K634585J867831J405477J479090
3695.7G58284748J547694J584470J669407J509726J253009J263678J458347J468420
3712G70039499J053691P49469Q01086Q75711Q65043Q47160P52747O82056Q20160J091183
3732.4G78577805J167178Q80003M39286J60396L38137Q60214Q00252M66109N29587
3750.7G84218967M13299K51174L62515M48346L36290K74360M03225M35114M10140L73959
$$ plain form
3628.4 634951055 642055869 647580504 652727365 658076525 663312912 668495238 673514307 678222477
3644.7 678222477 683164656 689122379 694827557 698772371 702343643 706708789 710872412 714358151
3661 714358151 717649639 720878482 724087238 727656662 731219530 734075367 736967266 739742279 741840303
3679.4 741840303 743877172 746059835 748310268 750897765 753532350 755400181 756805658 758284748
3695.7 758284748 759832442 761416912 763086319 764596045 765849054 767112732 768571079 770039499
3712 770039499 771093190 771842659 772643745 773519456 774384499 775231659 775984406 776666462 777486622 778577805
3732.4 778577805 779744983 780624986 781064272 781224668 781562805 782423019 783223271 783689380 784218967
3750.7 784218967 784632266 784883440 785245955 785694301 786030591 786304951 786708176 787143290 787553430 787927389
3771.1G87927389K30670K62916M89354N03362K52008J46985J75059J79469K58983L15070
3791.5G90741265K82347L62635L99410L06368K99931J81138Q5950J28687O1571L9220
3811.9G92888522J91927L91483L52979K64406K20776M589o4134l278Q8691K31207L08454
3834.4G94875622L20017J26600j07765k3305Q9228o139m3750J05440K65480J52528
3854.8G95753956j09077j49667K384K12491J98960n9783j5736J96993Q1897o4015q6367
3877.2G95962036K9266J13368K6106L9459m649m1187N8233o9856j93894K7180K50697
3899.6G96196759J69098K39j17600k08021j64449n6982N245P8738J06692K1160l7312
3922.1G95993567J9252J2040n7995Q165Q6666M4047l814j5557j4484O3241J16825L3676
$$ plain form
3771.1 787927389 788158059 788420975 788910329 789413691 789665699 789812684 789987743 790167212 790426195 790741265
3791.5 790741265 791023612 791386247 791785657 792092025 792391956 792573094 792659044 792787731 792849302 792888522
3811.9 792888522 793080449 793471932 793824911 794089317 794310093 794314682 794250548 794247270 794335961 794567168 794875622
3834.4 794875622 795195639 795322239 795214474 795191169 795280397 795274258 795230508 795335948 795601428 795753956
3854.8 795753956 795644879 795495212 795497596 795710087 795909047 795849264 795833528 796030521 796112418 796048403 795962036
3877.2 795962036 795991302 796104670 796130776 796170235 796165586 796124399 796182632 796112776 795918882 795946062 796196759
3899.6 796196759 796365857 796366096 796248496 796040475 795876026 795819044 795824289 795903027 796009719 796030879 795993567
3922.1 795993567 796012819 796024859 795966864 795975029 796061695 796105742 796101928 796086371 796071887 796135128 796251953 796285629
3946.5G96285629j1086m709n0247l2723O7711J13249J04606J04070O8188K7895M6730
3969G96719313K0325l4213J3828R7394J29044J43647J69516Q4996o0439k2531J02103
3991.4G97362983R7513M4883P9870
3997.5G97585249
$$ plain form
3946.5 796285629 796274543 796269834 796219587 796186864 796254575 796367824 796472430 796576500 796644688 796672583 796719313
3969 796719313 796739638 796705425 796719253 796816647 796945691 797089338 797258854 797343850 797283411 797260880 797362983
3991.4 797362983 797460496 797505379 797585249
3997.5 797585249
##END=$$ End of the data block
