##TITLE=$$ Begin of the data block
##JCAMP-DX=5.00 $$ ACD/SpecManager v 10.08
##SPECTROMETER/DATA SYSTEM=Alpha
##DATE=15 Apr 2014 09:00:42
##DATA TYPE=INFRARED SPECTRUM
##DATA CLASS=XYDATA
##ORIGIN=
##OWNER=
##NPOINTS=1765
##FIRSTX=399.75695801
##LASTX=3997.56933594
##MAXX=3997.56933594
##MINX=399.75695801
##MAXY=0.83520073
##MINY=0.29424253
##XFACTOR=1.0000000000
##YFACTOR=1.000000000000000e-9
##FIRSTY=0.58903438
##DELTAX=2.03957629
##XUNITS=1/CM
##YUNITS=ARBITRARY UNITS
##XYDATA=(X++(Y..Y))
399.8 589034379 588719904 587637961 585796893 584863961 583812833 582366765 582349420 582498789 581370175
418.1 581370175 580687523 580183089 579022467 578941524 579464614 578687847 578068256 578183115 576870501 575576901
438.5 575576901 576059461 576038539 575493455 576019883 575860977 574953914 575415313 575758755 574559152 573906362
458.9 573906362 573513329 571895182 570919871 570737064 569514036 568618357 568620503 567580223 566677153 567097843
479.3 567097843 566642404 565544307 565862656 565928519 564883828 564629436 564208150 562480152 561723292
497.7 561723292 561764419 560486913 559461176 559421301 558204293 556729913 556372583 555311441 553844631
516 553844631 553659618 552840292 550665259 549539387 548918724 547158480 545874298 545300364 543851793
534.4 543851793 542798042 542945325 542293012 541244984 541246712 540694535 539362311 539060175 538661838 537159026
554.8 537159026 536220253 535496354 533670247 532165051 531323671 529346168 526947796 525279999 523120463
573.1 523120463 520864129 519785106 518431365 516236007 514974356 514121234 512412131 511102080 510301828
591.5 510301828 508733034 507500768 507292449 506498873 505229056 504683316 504221320 503841877 504644871
609.8 504644871 505364716 504933536 505387723 507733464 510677397 514212847 518424869 521863878 524898052
628.2 524898052 528684318 531994998 534374952 537220061 539702594 540443838 540764570 541684806 543081403
646.5 543081403 545564413 548087358 547975659 546177804 546620905 550298214 555440247 560811460 564749777
664.9 564749777 567212343 570903242 574425578 576319277 578460515 581573367 584086239 585968554
681.2 585968554 588445187 590514600 591741979 593515992 595155895 595567167 596207082 597357929 597780406
699.6 597780406 598380625 599986017 601306200 602501988 604748487 606934309 608443260 610524714 612675190
717.9 612675190 613956094 615823925 618562818 620643914 622627556 625391066 627606928 629114270
734.2 629114270 631063282 632667124 633514464 635018945 636918664 638093591 639557004 641629398 642978251
752.6 642978251 644174814 646211863 647916138 649069667 650824368 652488887 653452933 654816151 656204760
771 656204760 656373501 656251371 656343162 655392647 653848410 652946591 652010024 651008844 651457787 653092921
791.4 653092921 655151606 658748627 663907230 669154227 674685121 680717647 685774982 689888060
807.7 689888060 694063365 697298825 699113846 700781643 701793432 700938642 699221313 696959317 693015814
826 693015814 688206255 683695793 678693712 673432887 669245660 665527284 661554575 658267796 655687451
844.4 655687451 653350294 652623713 654331923 657613695 662779272 670346677 678813934 687391341 696669340
862.7 696669340 705685258 713351071 720302522 726303399 730444312 733677030 736630738 738171577
879.1 738171577 738442838 738385558 737201154 734738708 732397020 730077088 727381706 725734293 725550115
897.4 725550115 725747049 726606190 728389442 729744077 730389178 730937541 730439484 728291571 725418270
915.8 725418270 721804798 717182398 712979853 709981143 707572877 706300199 706647336 707332313 707865238
934.1 707865238 708842993 709569275 709513843 709560752 709530413 708559573 707166433 705390811 702144921 697667658
954.5 697667658 692573667 686001778 677707076 668472350 657887638 645532787 632480741 619398594
970.8 619398594 606411934 594702303 585009277 576601624 569288969 563324809 557961345 552827060
987.1 552827060 548464596 544659853 541019022 538075447 535871744 533742249 531810462 530248463
1003.5 530248463 528245926 525397241 522016406 517875254 512927711 507956862 503192425 498444885
1019.8 498444885 494168192 490512490 486981124 483687520 480960965 478440285 476079345 474308103
1036.1 474308103 472868800 471400380 470161498 469076812 467684656 466136038 464743018 463485181
1052.4 463485181 462831408 463411182 464997143 467123181 469538420 471451283 472043812 471368462 469645292
1070.8 469645292 466994762 464091063 461541712 459160000 456812620 454562634 451977253 448756039
1087.1 448756039 445302457 441998512 439229906 437786728 437955230 439212918 441198528 443728596
1103.4 443728596 446225971 448354125 450225204 451569498 451937497 451176554 448880523 444673896 439622730
1121.8 439622730 436001986 435135394 436464578 438608676 440046310 440189451 440279603 441566855 443958402
1140.1 443958402 446926564 449901938 452301145 454160392 455844313 457382470 458982319 461172879
1156.4 461172879 464084536 467740983 472575784 478725821 485855639 493826360 502398014 510957122
1172.7 510957122 519252896 527284324 534682631 541199863 546806633 550958335 553057849 553235114
1189.1 553235114 551779389 548972726 545747280 543140769 541534543 541145265 542027473 543528199 544908047
1207.4 544908047 545903146 546253264 545810401 544967353 544051647 542994201 541950166 541204095 540684462
1225.8 540684462 540405989 540603638 541187048 541991353 543146849 544591248 546032846 547476411 548918843
1244.1 548918843 550048351 550826311 551450551 551812470 551904142 552101374 552590013 553389847 554744303
1262.5 554744303 556747079 559228778 562247396 565885544 569880903 574100852 578655899 583396494
1278.8 583396494 588163018 593136549 598347247 603581905 608836949 614086032 619014025 623483181
1295.1 623483181 627615154 631337941 634588718 637537777 640182078 642408490 644368052 646170318
1311.4 646170318 647656560 648907244 650226414 651571512 652878881 654317260 655788898 657080472
1327.8 657080472 658210456 659078538 659456849 659523368 659645498 659812093 659981549 660385430 660974681 661520123
1348.1 661520123 662062228 662542164 662728131 662595093 662161469 661197960 659558356 657566428 655650496
1366.5 655650496 653869569 652058482 649904191 647255123 644883037 643528938 642614961 641508222
1382.8 641508222 640795112 640786111 640623152 639928937 638933659 637522936 635655642 633329570 630460441
1401.2 630460441 627395391 624429703 621508479 618739843 616402328 614445627 612777174 611579061
1417.5 611579061 610672891 609575450 608536482 607732356 606850624 605776310 604643822 603583574 602857709
1435.9 602857709 602547884 602281868 602119982 602301955 602882981 603675246 604488969 605379462 606804729
1454.2 606804729 610365868 616334379 621579468 626368284 632547915 640020907 648189962 658438683
1470.5 658438683 671314955 682698011 690616965 696794391 701795697 705488443 707900822 709196866
1486.8 709196866 709178627 707748175 705416679 702433109 698715687 694462597 689917445 685422957 680631876
1505.2 680631876 674233735 667479575 661530077 655997992 651046216 647043228 644039154 641258180
1521.5 641258180 638334632 635565162 632787585 630188525 628081679 626153409 624231458 622909844
1537.8 622909844 622392178 621762633 621051192 620819449 621104598 622072279 623733521 625730872 627838552
1556.2 627838552 630884111 633707583 634272516 634278238 634286046 633759379 632376432 630146623 627233863
1574.5 627233863 623318851 618713796 613747597 608226895 602352440 596150875 589602828 582831442
1590.9 582831442 575940073 568867028 561810374 554904819 547996581 541107297 534370482 527645767
1607.2 527645767 520754576 513940692 507469654 500969827 494108617 488104463 482837409 477423102
1623.5 477423102 472143114 467268348 462952524 459624261 457324654 455849051 455019534 454765022 455281705
1641.8 455281705 456629455 459159791 462184936 464450896 467835873 473264456 477133751 480369031
1658.2 480369031 484706193 490337074 496377558 501832426 508045137 515411317 522027493 528815567
1674.5 528815567 536351740 543168187 549570918 557242036 567304015 576065898 583172023 590760767
1690.8 590760767 598086655 606359243 615881145 625826895 637305081 646921098 655059278 663369834
1707.1 663369834 670673668 677231669 683404744 689515173 696092188 701654136 705574334 709272265
1723.4 709272265 713054419 716490567 719820678 723165870 727034032 730823159 733841181 737121642
1739.7 737121642 740768552 744572818 748736382 753280282 758323729 763272405 767214239 770719707
1756.1 770719707 774092257 777002811 779772758 782320678 784523964 786606967 788728416 790855289
1772.4 790855289 792555988 793950438 795479298 797029316 798500836 800002813 801365435 802607298
1788.7 802607298 804082811 805635393 806762040 807761729 808885634 809954584 810936630 811882377 812720299
1807 812720299 813541114 814446151 815200329 815828443 816588759 817363203 817954481 818608761 819420278 820125759
1827.4 820125759 820772290 821370363 821783483 822194993 822775245 823334396 823828697 824482143 825084031 825371683
1847.8 825371683 825680315 826156020 826540351 826843858 827256441 827646971 827902019 828236043 828686953 829070032
1868.2 829070032 829362094 829616964 829798281 829967439 830223322 830438495 830603063 830886424 831183255 831354797
1888.6 831354797 831528485 831743300 831873059 831981838 832178831 832317889 832367420 832514703 832692146 832777560
1909 832777560 832899570 833041608 833101392 833214879 833385050 833422720 833407938 833467364 833475709 833390296 833392799
1931.5 833392799 833446503 833365202 833303213 833375812 833355367 833180070 833044708 832915723 832739413 832646370 832555115
1953.9 832555115 832349122 832195818 832142591 831984401 831783891 831706524 831577718 831342936 831213713 831135571
1974.3 831135571 830966771 830841720 830760479 830572605 830411136 830393314 830333471 830196083 830088496 829894364
1994.7 829894364 829603195 829427421 829313040 829061508 828832448 828741014 828562200 828283906 828103006 827920616
2015.1 827920616 827648759 827447951 827271640 827000678 826777637 826649785 826437175 826186955 826022863 825819612
2035.5 825819612 825562119 825422108 825328350 825130701 824972630 824878514 824677706 824481905 824425459 824328125
2055.9 824328125 824173033 824117124 824027956 823829591 823731422 823711455 823604107 823560119 823629439 823577225 823454082
2078.3 823454082 823471487 823482275 823386312 823387802 823423684 823310375 823229253 823285699 823284090 823257506 823341489 823386848
2102.8 823386848 823353708 823431611 823522985 823466599 823475599 823590457 823611617 823649645 823812187 823901892 823933184
2125.2 823933184 824076176 824185193 824199140 824330688 824525356 824604511 824728668 824954987 825061202 825121999
2145.6 825121999 825319231 825490952 825583458 825778723 825976133 826050639 826201141 826430917 826521218 826606989
2166 826606989 826836050 827005327 827117980 827371299 827622056 827726543 827874064 828093588 828223288 828350723
2186.4 828350723 828547001 828657031 828734934 828909039 829010963 829017639 829146445 829314053 829351902 829421759
2206.8 829421759 829570174 829619884 829644442 829751730 829791486 829788744 829922438 830040693 830007136 830023110 830099106
2229.2 830099106 830067277 830055475 830130041 830108464 830047250 830090046 830101609 830022514 829993844 829962850 829845369
2251.7 829845369 829775333 829762161 829687119 829618990 829631269 829607427 829559565 829606533 829663217 829660773 829693675 829726398
2276.1 829726398 829696774 829771936 829971254 830070138 830061913 830106199 830127537 830038369 829981029 829970181 829918146
2298.6 829918146 829901099 829915881 829809666 829644620 829579234 829551041 829519451 829511821 829388261 829090118 828886449
2321 828886449 828930557 828990757 828959823 828935206 828885794 828818619 828791738 828792632 828881323 829083145 829411328 829971373
2345.5 829971373 830456018 830429673 829938352 829371929 829033017 828815162 828648686 828759491 829199910 829816163
2365.9 829816163 830455124 831043184 831632495 832271218 832880795 833403945 833889604 834321201 834637284 834854484
2386.3 834854484 835001945 835052669 835049808 835106194 835197389 835200727 835157871 835166574 835172713 835165739 835187256 835175931
2410.8 835175931 835102558 835045338 835003555 834907949 834809482 834739625 834628820 834492385 834405363 834345460 834244430
2433.2 834244430 834105492 833957613 833821237 833715200 833615959 833489120 833381295 833304524 833164752 832972825
2453.6 832972825 832822025 832695305 832556486 832428813 832282662 832094014 831934988 831813455 831672788 831515312
2474 831515312 831352890 831176937 830977499 830784559 830627739 830471933 830301106 830132782 829958975 829779983
2494.4 829779983 829618037 829460144 829281271 829104066 828922451 828703940 828494489 828336716 828169942 827960134
2514.8 827960134 827756882 827586472 827417970 827239692 827082157 826917112 826718926 826545417 826376557 826167881
2535.2 826167881 825984061 825837851 825682521 825519919 825340569 825155318 825006783 824861884 824656546 824447513
2555.6 824447513 824309528 824141443 823878407 823637724 823432088 823170066 822908878 822684109 822398543 822074175
2576 822074175 821784735 821464896 821120679 820830107 820477664 820016921 819629729 819321215 818951666 818548322
2596.4 818548322 818139076 817647755 817142487 816750050 816355467 815866411 815406680 814955115 814402938 813879967
2616.8 813879967 813467264 813003242 812475026 812003374 811508954 810937643 810441673 810021818 809543848 809072971
2637.1 809072971 808631003 808101296 807590544 807193637 806747556 806250215 805834115 805403948 804893553 804427743
2657.5 804427743 803992391 803504288 803072751 802713931 802255571 801740468 801318645 800900280 800444961 800064802
2677.9 800064802 799669862 799162209 798711002 798338175 797880411 797425330 797026575 796514571 795937955 795463860
2698.3 795463860 794981480 794403851 793883264 793367565 792686403 791989982 791377842 790690184 789982021 789390266
2718.7 789390266 788762689 788039386 787389934 786787689 786141753 785591960 785149992 784632981 784098387 783649266
2739.1 783649266 783138633 782583833 782132208 781645477 781038642 780474007 779913843 779221773 778556526 777963400
2759.5 777963400 777233064 776458979 775814891 775136471 774338961 773545861 772728145 771853030 771017909 770147920
2779.9 770147920 769154489 768202901 767321289 766306996 765193641 764135718 763055205 761909723 760794103
2798.3 760794103 759592772 758205712 756826580 755497158 754071176 752585769 751061916 749366701
2814.6 749366701 747547388 745730758 743769526 741555989 739195883 736603439 733579934 730116248
2830.9 730116248 726089418 721132159 715038061 707653940 698657811 687933683 675588667 661919832
2847.2 661919832 648195326 636892259 630399704 629530787 633138359 638783991 644016147 647416711
2863.5 647416711 648676038 648191869 646985114 646394312 647035658 648431122 649780691 650420427 649892092
2881.9 649892092 648159623 645406127 641733110 637389421 632739484 627886295 622833729 617719769
2898.2 617719769 612532020 607032537 601016402 594265461 586421013 577120125 566115677 553455412
2914.5 553455412 539909542 527009666 516399145 509377897 506791830 508704245 514300764 522418320
2930.8 522418320 532078028 542501569 552985907 562888741 571541190 578271925 582671523 584670484
2947.2 584670484 584632933 583552837 582637072 582796156 584603965 588232636 593433440 599792242 606960356
2965.5 606960356 614528716 621945977 628838062 635045528 640386820 644932568 648957908 652422130
2981.8 652422130 655255795 657665253 659771383 661545217 662963986 663957238 664522409 664763808 664752185
3000.2 664752185 664495528 664003372 663434148 662948847 662548363 662162304 661656380 660945773 660129428 659272492
3020.6 659272492 658291340 657173038 655991018 654766560 653509974 652274191 650983155 649533570
3036.9 649533570 648056507 646617174 645067990 643372297 641624093 639871120 638142109 636464775
3053.2 636464775 634799957 633073151 631339014 629705608 628144383 626639605 625158429 623566508
3069.5 623566508 621952891 620521843 619230926 617953658 616587043 615069389 613478363 611904800
3085.8 611904800 610371351 608827055 607214570 605570078 603930295 602281094 600610793 598894536
3102.2 598894536 597128630 595368326 593575239 591648638 589697599 587876320 586052060 584030986
3118.5 584030986 581810474 579457283 577096045 574863851 572683930 570394158 568034708 565684974
3134.8 565684974 563312352 560929894 558513939 555981934 553388715 550833225 548323214 545809805
3151.1 545809805 543202162 540454566 537668407 534955323 532273471 529551089 526826084 524103165
3167.4 524103165 521332979 518545806 515788376 513059318 510336459 507591009 504776835 501927018
3183.7 501927018 499158114 496481925 493800849 491074026 488354385 485678613 483028769 480367959
3200.1 480367959 477692574 475041240 472454071 469919086 467395037 464881986 462392360 459912598
3216.4 459912598 457422197 454949051 452508092 450060129 447635233 445291579 443019599 440782338
3232.7 440782338 438512444 436202765 433946848 431765616 429629296 427549958 425499588 423443079
3249 423443079 421411246 419437021 417502016 415561885 413614064 411675632 409773767 407948911 406179458
3267.4 406179458 404417157 402617842 400795907 399013281 397232711 395430923 393683910 391979426
3283.7 391979426 390260011 388566554 386928439 385301322 383632481 381893516 380094886 378305763
3300 378305763 376614213 375000983 373337626 371529341 369596571 367663205 365817636 364020377 362213016
3318.4 362213016 360384285 358550996 356711566 354797423 352795541 350819468 348920941 347058684
3334.7 347058684 345207900 343317926 341367632 339408904 337421149 335443199 333582491 331693172
3351 331693172 329629213 327542484 325565279 323658437 321767360 319889516 318117529 316458941 314685613
3369.3 314685613 312695235 310762107 309112132 307621956 306160063 304748058 303452075 302314699
3385.7 302314699 301404178 300731957 300039858 299139738 298277318 297745019 297405869 296871960 296090662 295425773
3406.1 295425773 295048714 294830382 294654399 294478327 294312716 294242531 294336915 294533759 294829786 295328230
3426.5 295328230 296024054 296741664 297501892 298431784 299295425 299930036 300639302 301647842 302881211
3444.8 302881211 304248035 305620939 306998223 308508933 310156971 311899930 313744247 315577596
3461.1 315577596 317403048 319493115 321810573 323901176 325601727 327323526 329355121 331620842
3477.4 331620842 333926201 336096764 338220894 340488672 342823476 345116645 347472012 349952191
3493.8 349952191 352528065 355082601 357635647 360315800 362900317 365236163 367676228 370431602
3510.1 370431602 373361319 376240075 378962755 381724864 384723336 387998432 391240329 394208044
3526.4 394208044 397202402 400384545 403654158 407095969 410618633 413966477 417382032 421139538
3542.7 421139538 425048143 428728044 432149351 435705930 439537555 443395376 447263539 451311111
3559 451311111 455433011 459453970 463698357 468640000 473618388 478015691 482348084 487013042 491902620
3577.4 491902620 496948451 502084911 507193327 512534678 518323958 523890853 528943837 534288049
3593.7 534288049 540121078 546011448 551936150 557830155 563442528 569040239 575195730 581601679
3610 581601679 587776661 593736053 599415362 605480731 612113714 618063331 623162448 628405571 635102451
3628.4 635102451 642218471 647811532 652967036 658296943 663550794 668778658 673845351 678597093
3644.7 678597093 683510721 689333737 694986880 699011803 702623010 706954062 711108267 714655459
3661 714655459 718006313 721225321 724362552 727819264 731293917 734097242 736990154 739844978 741992474
3679.4 741992474 744050026 746253490 748498440 751086593 753774047 755706787 757125437 758577406
3695.7 758577406 760101855 761684418 763358235 764840305 766032934 767255962 768699586 770183861
3712 770183861 771320879 772143185 772935331 773751080 774536192 775341928 776150107 776897907 777720809 778746009
3732.4 778746009 779804587 780674934 781221151 781466961 781782568 782543361 783277810 783687472 784168780
3750.7 784168780 784623444 784934521 785285175 785700977 786093414 786471128 786881804 787253737 787656784 788058996
3771.1 788058996 788288474 788522124 788992703 789528668 789838791 790005922 790170789 790359139 790656686 791033208
3791.5 791033208 791354358 791655362 791911364 792111635 792438745 792742908 792917252 793076158 793166876 793219507
3811.9 793219507 793405414 793808222 794137359 794307351 794419348 794373095 794334352 794397652 794490099 794600785
3832.3 794600785 794800699 795130610 795352697 795388639 795456946 795533955 795508087 795467377 795498073 795650780 795890927
3854.8 795890927 795933783 795801759 795759618 795930445 796118438 796072125 796009123 796145022 796248496 796280980
3875.2 796280980 796286106 796312392 796420872 796515822 796586156 796535134 796428025 796455264 796411514 796263993 796309650
3897.6 796309650 796501815 796608925 796647251 796612740 796479642 796341956 796251297 796210945 796266556 796397150
3918 796397150 796461761 796414733 796376646 796342731 796279371 796306610 796411157 796468675 796433568 796358109 796374738 796519399
3942.5 796519399 796652079 796709836 796756804 796727061 796593964 796530664 796620488 796759665 796873510 796997726
3962.9 796997726 797089994 797071218 797061622 797153413 797257364 797325611 797373950 797451019 797577441 797702074 797763050
3985.3 797763050 797747314 797754407 797835052 797933280 798035741 798124731
3997.5 798124731
##END=$$ End of the data block
