##TITLE=$$ Begin of the data block
##JCAMP-DX=5.00 $$ ACD/SpecManager v 10.08
##SPECTROMETER/DATA SYSTEM=Alpha
##DATE=15 Apr 2014 09:00:42
##DATA TYPE=INFRARED SPECTRUM
##DATA CLASS=XYDATA
##ORIGIN=
##OWNER=
##NPOINTS=1765
##FIRSTX=399.75695801
##LASTX=3997.56933594
##MAXX=3997.56933594
##MINX=399.75695801
##MAXY=0.83556867
##MINY=0.29494569
##XFACTOR=1.0000000000
##YFACTOR=1.000000000000000e-9
##FIRSTY=0.59339863
##DELTAX=2.03957629
##XUNITS=1/CM
##YUNITS=ARBITRARY UNITS
##XYDATA=(X++(Y..Y))
399.8E93398631j511574j848459j846016n19395j209736k116263k90870K67267j065135
$$ 593398631 591887057 590038598 588192582 587673187 586463451 584347188 584056318 584323585 583258450
418.1E83258450o85394m95672j101732J42812O02603j072466r68575m530j162708j225650
$$ 583258450 582573056 582077384 580975652 581118464 581721067 580648601 579680026 579675496 578512788 577287138
438.5E77287138K91526n9247m20630M86612k22981q84890L61621K57969j030028n80072
$$ 577287138 577578664 577519417 577098787 577585399 577362418 576477528 576839149 577097118 576067090 575487018
458.9E75487018n40495j687885j061141l10481j207173q16226P8977r74179j097500
$$ 575487018 574946523 573258638 572197497 571887016 570679843 569863617 569942594 568968415 567870915
477.3E67870915J26183l41833q56220J68085k56896j180172j61469j87636j603663
$$ 567870915 567997098 567655265 566799045 566967130 566710234 565530062 565368593 565180957 563577294
495.6E63577294r90808l20553j379431r64880j5676j159012j375437k03609r55344
$$ 563577294 562586486 562265933 560886502 559921622 559905946 558746934 557371497 557167888 556212544
514E56212544j657486m72962q38638j996517j056313q13127j959920j232386m45723
$$ 556212544 554555058 554082096 553243458 551246941 550190628 549377501 547417581 546185195 545739472
532.3E45739472j423121j110255o914p96318j045228J03653m24743j289367l16442
$$ 545739472 544316351 543206096 543199182 542402864 541357636 541461289 541036546 539747179 539430737
550.7E39430737l46779j495600j001299p12037j694440j430393j048267k241671k323985
$$ 539430737 539083958 537588358 536587059 535875022 534180582 532750189 531701922 529460251 527136266
569E27136266j348495k034009k467692j309514j339435k062440j177728q49128j807988
$$ 527136266 525787771 523753762 521286070 519976556 518637121 516574681 515396953 514547825 512739837
587.4E12739837j380086p45177j504421j164079j25706q63016j466751o86049n06461
$$ 512739837 511359751 510614574 509110153 507946074 507820368 506957352 505490601 504804552 504298091
605.8E04298091l28660R00388Q07762l62873M16338K119422K737045L678441M544199
$$ 504298091 503969431 504869819 505677581 505314708 505731046 507850468 510587513 514265954 518810153
624.1E18810153L516734K903461L725827L325641K399206K798557K404213P95663M47869
$$ 518810153 522326887 525230348 528956175 532281816 534681022 537479579 539883792 540679455 541127324
642.5E41127324R49741J373410K486109K465904k91645j925052N42999L894388N300463
$$ 541127324 542077065 543450475 545936584 548402488 548110843 546185791 546728790 550623178 555923641
660.8E55923641N412876L891409K376377L626049L509998J946390K243400L065824
$$ 555923641 561336517 565227926 567604303 571230352 574740350 576686740 578930140 581995964
677.1E81995964K316713J821936K614438K199411J247764J739740J579822L61085O35385
$$ 581995964 584312677 586134613 588749051 590948462 592196226 593935966 595515788 595876873 596512258
695.5E96512258J119375L30627N86033J693726J422345J286924K242923K052963J409888
$$ 596512258 597631633 597962260 598548293 600242019 601664364 602951288 605194211 607247174 608657062
713.8F08657062K118230K192616J261592J853824K722025K030969J925647K696514
$$ 608657062 610775292 612967908 614229500 616083324 618805349 620836318 622761965 625458479
730.2F25458479K162516J553714K104819J759946Q75056J438737J871348J196920J441002
$$ 625458479 627620995 629174709 631279528 633039474 633914530 635353267 637224615 638421535 639862537
748.5F39862537K004028J344681J208543J966894J635373J188397J852751J684844
$$ 639862537 641866565 643211246 644419789 646386683 648022056 649210453 651063204 652748048
764.8F52748048Q64268J255273J336098J25826j62661J09195q68976j440048p95901
$$ 652748048 653612316 654867589 656203687 656329513 656166852 656276047 655407071 653967023 653171122
783.2F53171122q52883r50992M60804J602769K016544L581881N154372N237698N541384
$$ 653171122 652318239 651367247 651828051 653430820 655447364 659029245 664183617 669421315 674962699
801.6F74962699O093383N157769M163504M131615L139138J708686J622677J054228
$$ 674962699 681056082 686213851 690377355 694508970 697648108 699356794 700979471 702033699
817.9G02033699p92087j685381k268791l990709m842818m493475m996836n274237m210293
$$ 702033699 701241612 699556231 697287440 693296731 688453913 683960438 678963602 673689365 669479072
836.2F69479072l758311l942311l215373k565145k337754p23421J714527L298283N187034
$$ 669479072 665720761 661778450 658563077 655997932 653660178 652936757 654651284 657949567 663136601
854.6F63136601P601977Q495152Q581519R292960R043932P632673O910920O018698
$$ 663136601 670738578 679233730 687815249 697108209 706152141 713784814 720695734 726714432
870.9G26714432M119694L193915K989889J587688K74122o9916j211464k520144k417922
$$ 726714432 730834126 734028041 737017930 738605618 738879740 738809824 737598360 735078216 732660294
889.3G32660294k368093k689660j602828j63198J60158Q57651J835466J363039O24656
$$ 732660294 730292201 727602541 725999713 725836515 725996673 726854324 728689790 730052829 730677485
907.6G30677485N68927m97818k205014k873660l534257m575849m249274l095806k454221
$$ 730677485 731246412 730748594 728543580 725669920 722135663 717559814 713310540 710214734 707760513
926G07760513j247585L69966O88791N08964R07004O71149m6790J07467K7239r86039
$$ 707760513 706512928 706882894 707571685 708080649 708987653 709658802 709612012 709719479 709746718 708760679
946.4G08760679j437485j792312l279090m520953n104840o552994q274197r248615
$$ 708760679 707323194 705530882 702251792 697730839 692625999 686073005 677798808 668550193
962.7F68550193j0599971j2302577j2945890j3011516j2993455j1764824r744644q394957
$$ 668550193 657950222 645647645 632701755 619690239 606696784 594931960 585187316 576792359
979E76792359p278561n989552n414128n167723m363060l754556l589928k947390k241790
$$ 576792359 569513798 563524246 558110118 552942395 548579335 544824779 541234851 538287461 536045671
997.3E36045671k171636j965582j595080k047420k869546l353119m084587m894019
$$ 536045671 533874035 531908453 530313373 528265953 525396407 522043288 517958701 513064682
1013.7E13064682m969179m783273m740894m272878l654867l519476l261059k698064
$$ 513064682 508095503 503312230 498571336 494298458 490643591 487124115 483863056 481164992
1030D81164992k540350k380788j733959j384586j452595j248420j099824j409352j554072
$$ 481164992 478624642 476243854 474509895 473125309 471672714 470424294 469324470 467915118 466361046
1048.3D66361046j384616j238257o41048N55992J534969K085060K376020J880020O18309
$$ 466361046 464976430 463738173 463097125 463653117 465188086 467273146 469649166 471529186 472147495
1066.7D72147495o23286j721323k653211k852976k513886k391189k324969k216428
$$ 472147495 471524209 469802886 467149675 464296699 461782813 459391624 457066655 454850227
1083D54850227k631337l295392l479272l288924k725453j401692J93059J276195J978785
$$ 454850227 452218890 448923498 445444226 442155302 439429849 438028157 438221216 439497411 441476196
1101.4D41476196K484739K471119K153933J872808J283198L26693p23093k231837m175454
$$ 441476196 443960935 446432054 448585987 450458795 451741993 452068686 451345593 449113756 444938302
1119.7D44938302n052566l614516q62538J290887K103091J407861J26958J23352J326591
$$ 444938302 439885736 436271220 435408682 436699569 438802660 440210521 440337479 440460831 441787422
1138.1D41787422K380281K934844K954781K372831J821518J657784J551181J655072
$$ 441787422 444167703 447102547 450057328 452430159 454251677 455909461 457460642 459115714
1154.4D59115714K215803K863705L619313M850387O161958P131339P976025Q566171
$$ 459115714 461331517 464195222 467814535 472664922 478826880 485958219 493934244 502500415
1170.7E02500415Q540451Q272529Q022726P413089O528377N601347M155159K110541
$$ 502500415 511040866 519313395 527336121 534749210 541277587 546878934 551034093 553144634
1187E53144634J63495j500547k849578l239453k592743j564264l28898R11355J467406
$$ 553144634 553308129 551807582 548958004 545718551 543125808 541561544 541232646 542144001 543611407
1205.4E43611407J324356R91702M00066m08291q28922r10044j078486j059056p32481
$$ 543611407 544935763 545927465 546327531 545919240 545090318 544180274 543101788 542042732 541310251
1223.7E41310251n07653k78652J96338N76258P79330J135707J464129J482189J467168
$$ 541310251 540802598 540523946 540720284 541296542 542075872 543211579 544675708 546157897 547625065
1242.1E47625065J454890J166045Q22842O19948L11733M7564J97232N06163P78436
$$ 547625065 549079955 550246000 551068842 551688790 552000523 552048087 552245319 552751482 553529918
1260.4E53529918J311660J994431K510488L038228L632903L972649M169286M515230
$$ 553529918 554841578 556836009 559346497 562384725 566017628 569990277 574159563 578674793
1276.8E78674793M737318M763543M981459N235314N255699N274654N248367M905343
$$ 578674793 583412111 588175654 593157113 598392427 603648126 608922780 614171147 619076490
1293.1F19076490M458249M132748L714919L239631K947927K657533K257883J992226
$$ 619076490 623534739 627667487 631382406 634622037 637569964 640227497 642485380 644477606
1309.4F44477606J804232J479626J245558J292885J345575J336813J441419J465916
$$ 644477606 646281838 647761464 649007022 650299907 651645482 652982295 654423714 655889630
1325.7F55889630J290500J108408Q36015L68476Q9586J52767J86324J95265M26411
$$ 655889630 657180130 658288538 659124553 659493029 659582615 659735382 659921706 660116971 660543382
1344.1F60543382O03140N54084N26727M49657J64092j42455m36485r68159j641631
$$ 660543382 661146522 661700606 662227333 662676990 662841082 662698627 662262142 661293983 659652352
1362.4F59652352j978755j916289j801431j807034k140522k642632k337277j324176
$$ 659652352 657673597 655757308 653955877 652148843 650008321 647365689 645028412 643704236
1378.7F43704236r32157j143158p54297l4809j36793o52134r80139j428842j896024
$$ 643704236 642772079 641628921 640874624 640839815 640703022 640050888 639070749 637641907 635745883
1397.1F35745883k342463k860069l042340k965212k930462k764643k340197j981199
$$ 635745883 633403420 630543351 627501011 624535799 621605337 618840694 616500497 614519298
1413.4F14519298j710772j232684r05156j077831j018047p96378r05454j088441j112341
$$ 614519298 612808526 611575842 610670686 609592855 608574808 607778430 606872976 605784535 604672194
1431.8F04672194j070321p76351l12745k22504j47939J72198N81980P94351Q11576
$$ 604672194 603601873 602825522 602512777 602290273 602142334 602314532 602896512 603690863 604502439
1450.1F04502439Q75772J389324L532589N976081N273819M821240O210745P492661
$$ 604502439 605378211 606767535 610300124 616276205 621550024 626371264 632582009 640074670
1466.4F40074670Q146882J0180414J2844801J1439621P984043O208717N004347L700435
$$ 640074670 648221552 658401966 671246767 682686388 690670431 696879148 701883495 705583930
1482.8G05583930K425551J246691j13129j453042k305031k988458l706038m180789
$$ 705583930 708009481 709256172 709143043 707690001 705384970 702396512 698690474 694509685
1499.1F94509685m514039m556477m907131o466508o677985n822658n477071m996777
$$ 694509685 689995646 685439169 680532038 674065530 667387545 661564887 656087816 651091039
1515.4F51091039m047930l012240k800405k920806k701521k663672k533675k112984
$$ 651091039 647043109 644030869 641230464 638309658 635608137 632944465 630410790 628297806
1531.7F28297806j926244j910448j340270n39899o40928p29740k39074L01540J006782
$$ 628297806 626371562 624461114 623120844 622580945 621940017 621210277 620971203 621272743 622279525
1550.1F22279525J698017J997650K067446K999187K877593O65784L5584m3989n99503
$$ 622279525 623977542 625975192 628042638 631041825 633919418 634585202 634620786 634576797 633977294
1568.4F33977294j408875k212942k875924l891229m633904m972041n470335n846202
$$ 633977294 632568419 630355477 627479553 623588324 618954420 613982379 608512044 602665842
1584.7F02665842o228567o566345o767512o908416p090032p040382o879926o913960
$$ 602665842 596437275 589870930 583103418 576195002 569104970 562064588 555184662 548270702
1601.1E48270702o936013o788612o730616o850660o787419o488919o515920o818116
$$ 548270702 541334689 534546077 527815461 520964801 514177382 507688463 501172543 494354427
1617.4D94354427n964160n293816n457789n276948m842937m297257l338486k338350
$$ 494354427 488390267 483096451 477638662 472361714 467518777 463221520 459883034 457544684
1633.7D57544684j517653q40217k65658M92722J334727K556205L088057K304643L374070
$$ 457544684 456027031 455186814 454921156 455413878 456748605 459304810 462392867 464697510 468071580
1652D68071580N402297L876418L245264M339576N640000O055087N486518O231844P319212
$$ 468071580 473473877 477350295 480595559 484935135 490575135 496630222 502116740 508348584 515667796
1670.4E15667796O559670O786168P581651O830931O361544P636964J0069490Q775055
$$ 515667796 522227466 529013634 536595285 543426216 549787760 557424724 567494214 576269269
1686.7E76269269P108450P589996P325172Q261204R488165R885133J1437058R618044
$$ 576269269 583377719 590967715 598292887 606554091 616042256 625927389 637364447 646982491
1703F46982491Q146167Q336663P327676O543279O145894O085813O573022N621492L987551
$$ 646982491 655128658 663465321 670792997 677336276 683482170 689567983 696141005 701762497 705750048
1721.4G05750048L724396L780246L403425L276289L312230L881574L848791L059327
$$ 705750048 709474444 713254690 716658115 719934404 723246634 727128208 730976999 734036326
1737.7G34036326L286720L671169L851473M181922M518211N007744M922211L906369
$$ 734036326 737323046 740994215 744845688 749027610 753545821 758553565 763475776 767382145
1754G67382145L475308L395915K953768K777934K529443K160549K049923K142846K158344
$$ 767382145 770857453 774253368 777207136 779985070 782514513 784675062 786724985 788867831 791026175
1772.4G91026175J693428J377642J536131J560032J466513J520633J407802J249671
$$ 791026175 792719603 794097245 795633376 797193408 798659921 800180554 801588356 802838027
1788.7H02838027J428485J508713J109243R91642J123965J085996J031161R89675Q40247
$$ 802838027 804266512 805775225 806884468 807876110 809000075 810086071 811117232 812106907 812947154
1807H12947154Q05378Q98004P48336O21855P62701P82073N95093O49631Q09907P04527
$$ 812947154 813752532 814650536 815398872 816020727 816783428 817565501 818160594 818810225 819620132 820324659
1827.4H20324659O57320O43015M59433M21166N55635N34296M84884O43551N87106K73049
$$ 820324659 820981979 821624994 822084427 822505593 823061228 823595524 824080408 824723959 825311065 825584114
1847.8H25584114L01420M84824M04120L25978M22418L75271K34723L26276M43399L75628
$$ 825584114 825885534 826370358 826774478 827100456 827522874 827898145 828132868 828459144 828902543 829278171
1868.2H29278171K99215K62559J78039J78933K79784K34902J69933K62916K69652J56760
$$ 829278171 829577386 829839945 830017984 830196917 830476701 830711603 830881536 831144452 831414104 831570864
1888.6H31570864J75595K31445J41084J12474K01523J39416M4167J32560J46747P1585
$$ 831570864 831746459 831977904 832118988 832231462 832432985 832572401 832616568 832749128 832895875 832967460
1909H32967460J55807J80304N6386J01626J73449J7762l7789N7161P570o9440K3246
$$ 832967460 833123267 833303571 833359957 833461583 833635032 833652794 833615005 833672166 833679736 833610296 833633542
1931.5H33633542M3392r8824n9128O8963l7373j52707p7545j06275k00570j23620j03176
$$ 833633542 833676934 833578110 833518982 833587945 833550572 833397865 833320320 833214045 833013475 832889855 832786679
1953.9H32786679j95086j38581o5565j73866j85430o4075j34945k37942j25825q3268
$$ 832786679 832591593 832453012 832387447 832213581 832028151 831964076 831829131 831591189 831465364 831382096
1974.3H31382096j83106j24693m7743j52111j68204o0380j13785j74761j03652j63734
$$ 831382096 831198990 831074297 831026554 830874443 830706239 830645859 830532074 830357313 830253661 830089927
1994.7H30089927k65599j68263j12534k28107j96636r9778k11716k91645j76966j56045
$$ 830089927 829824328 829656065 829543531 829315424 829118788 829019010 828807294 828515649 828338683 828182638
2015.1H28182638k23875j85132k23756l19839k29239j15872k03788k35021j25825j70589
$$ 828182638 827958763 827773631 827549875 827230036 827000797 826884925 826681137 826446116 826320291 826149702
2035.5H26149702k60770j65701j17004k05994j47223p5817j89364j82271n5194j27077
$$ 826149702 825888932 825723231 825606227 825400233 825253010 825177193 824987829 824805558 824750364 824623287
2055.9H24623287j76728l1710m9710j90973j08540k1875j15752p1049M4524m8160j00494
$$ 824623287 824446559 824414849 824365139 824174166 824065626 824043751 823927999 823856950 823901474 823853314 823752820
2078.3H23752820K7061%j08182o0M1425r2864n7280O1810q762k4199R6082K9982o3420
$$ 823752820 823779881 823779881 823671699 823671639 823713064 823620200 823562920 823624730 823615968 823591769 823687851 823717833 823654413
2104.8H23654413O7771J02102k5212K6226Q8691j2219L4094J73509R9242M0531J60575
$$ 823654413 823722184 823824286 823799074 823825300 823913991 823901772 823935866 824109375 824208617 824249148 824409723
2127.3H24409723J34290J5139J11640J92821J02222J38163J97709O9260N7161J93715
$$ 824409723 824544013 824559152 824670792 824863613 824965835 825103998 825301707 825370967 825428128 825621843
2147.7H25621843J47820P2121J87338K11835J08540J74701K41339R7692Q3328K34842
$$ 825621843 825769663 825841784 826029122 826240957 826349497 826524198 826765537 826863229 826946557 827181399
2168H27181399J89900J24097K56419K52784R3877J36852K07663J00672J10567K18629
$$ 827181399 827371299 827495396 827751815 828004599 828098476 828235328 828442991 828543663 828654230 828872859
2188.4H28872859J57118J17660J82986Q1122j9908J13487J65820N0784P9810J42992
$$ 828872859 829029977 829147637 829330623 829411745 829391837 829505324 829671144 829721928 829801738 829944730
2208.8H29944730L8862Q881J02043N8830o616J01089J25289J3054L5167O1035l5823
$$ 829944730 829983592 829992473 830094516 830153346 830146730 830247819 830373108 830386162 830421329 830482364 830446541
2231.3H30446541j6033M7803l8922m7624N5730N484o4493%l1590j35005p4625l993
$$ 830446541 830430508 830478311 830439389 830391765 830447495 830452979 830388486 830388486 830356896 830221891 830147266 830143273
2255.8H30143273p8142p1227M2438J1563l1590M8995M7803N36L9578J2398p1049M0889
$$ 830143273 830065131 829993904 830036342 830047905 830016315 830065310 830113113 830113649 830153227 830165625 830094576 830135465
2280.2H30135465K03192J27435m232K9504L6240m3869k4796l338m1187O855K7239j17361
$$ 830135465 830338657 830466092 830461860 830491364 830527604 830483735 830458939 830455601 830414414 830421269 830448508 830331147
2304.7H30331147j79529n5850N901j0133j6153j23501k60174j64449L1710L5762j6868
$$ 830331147 830151618 830095768 830101669 830091536 830075383 829951882 829691708 829527259 829558969 829594731 829577863
2327.1H29577863k444j9848l8564o1929p7010Q9944K95341L29733M53889M29750o974
$$ 829577863 829575419 829555571 829517007 829455078 829378068 829468012 829763353 830093086 830546975 830976725 830969751
2349.6H30969751m12166m58718k84969j96994j41322R2566M30643O36637O21260N21898
$$ 830969751 830557585 830098867 829813898 829616904 829475582 829568148 829998791 830635428 831256688 831778586
2370H31778586M81009N29230N65887N18381M46439L74138K73586J95145J70469J06276
$$ 831778586 832259595 832788825 833354712 833873093 834319532 834693670 834967256 835162401 835332870 835439146
2390.4H35439146M1008N0842L7670k1636j0014L1472j2160m5299k4796m4882n4002
$$ 835439146 835480154 835530996 835568666 835547030 835537016 835568488 835556328 835511029 835486233 835441351 835387349
2412.8H35387349J2279J0430q4400j04606q4817j42157j73092r4950n1201r0539j19508
$$ 835387349 835399628 835410058 835325658 835221052 835136235 834994078 834820986 834726036 834674835 834584296 834464788
2435.2H34464788j42097j42455r1672o6817j08421j27375j24097j78635j94609j08659
$$ 834464788 834322691 834180236 834088564 834021747 833913326 833785951 833661854 833483219 833288610 833179951
2455.6H33179951q0228j29879j30593j24991j68205j73509j41501j34707j62065j92284
$$ 833179951 833099723 832969844 832839251 832714260 832546055 832372546 832231045 832096338 831934273 831741989
2476H31741989j89245j95205j91570j50561j47521j66834j60634j70291j88291j60038
$$ 831741989 831552744 831357539 831165969 831015408 830867887 830701053 830540419 830370128 830181837 830021799
2496.4H30021799j52231j90079j84119j67966j94549j95384j65820j84179k12013k12610
$$ 830021799 829869568 829679489 829495370 829327404 829132855 828937471 828771651 828587472 828375459 828162849
2516.8H28162849k17140k08258j54019j02043j39654j99556j88112j65224j66118j59920
$$ 828162849 827945709 827737451 827583432 827481389 827341735 827142179 826954067 826788843 826622725 826462805
2537.2H26462805j60157j75417j81496j65403j55747j83999k06650k02298j66476j22428
$$ 826462805 826302648 826127231 825945735 825780332 825624585 825440586 825233936 825031638 824865162 824742734
2557.6H24742734j81078k62678k20180j86562k43306k62082k60174l04520l09229k80559
$$ 824742734 824561656 824298978 824078798 823892236 823648930 823386848 823126674 822822154 822512925 822232366
2578H22232366l21091l41057k87652l37184m45306l90232k92659l60727m30167m18365
$$ 822232366 821911275 821570218 821282566 820945382 820500076 820109844 819817185 819456458 819026291 818607926
2598.4H18607926m83453n20766m32729m20392m86314m31776m03107n42163n47171m11868
$$ 818607926 818124473 817603707 817170978 816750586 816264272 815832496 815429389 814887226 814340055 813928187
2618.8H13928187m38988n17130n05507n26011n39065m52697m38332n30303m87030m04119
$$ 813928187 813489199 812972069 812466562 811940551 811401486 810948789 810510457 809980154 809493124 809089005
2639.2H09089005m82082n06223m14192m43995m97997m27485m19080m89890m65215m32551
$$ 809089005 808606923 808100700 807686508 807242513 806744516 806317031 805897951 805408061 804942846 804510295
2659.6H04510295m85241m62770m02809m77016n05507l92973l88980m43876l59535l79205
$$ 804510295 804025054 803562284 803159475 802682459 802176952 801783979 801394999 800951123 800591588 800212383
2680H00212383n36680m75347l63410m54604m59016l75449m73321n45263m58717n06938
$$ 800212383 799675703 799200356 798836946 798382342 797923326 797547877 797074556 796529293 796070576 795563638
2700.4G95563638o29544n52356n03600o48558o78837o18399p05003p02799n56767o00934
$$ 795563638 794934094 794381738 793878138 793229580 792550743 791932344 791227341 790524542 789967775 789366841
2720.8G89366841p24494o55651o13570o80745n73099m55320n39720n36501m35233m97520
$$ 789366841 788642347 787986696 787373126 786692381 786119282 785663962 785124242 784587741 784152508 783654988
2741.2G83654988n37753m30823m86135o22511n63920n58018o90460o55413n66006o74128
$$ 783654988 783117235 782686412 782200277 781577766 781013846 780455828 779765368 779109955 778543949 777869821
2761.6G77869821p43330o74903p27296q17359p68482p94650r08732q81851q75353r79245
$$ 777869821 777126491 776451588 775724292 774906933 774138451 773343801 772435069 771553218 770677865 769698620
2782G69698620r42111q74877j008511j098454j024306j067936j176119j144290j201808
$$ 769698620 768756509 767881632 766873121 765774667 764750361 763682425 762506306 761362016 760160208
2800.3G60160208j386047j396596j341939j436234j519560j545132j678109j806021
$$ 760160208 758774161 757377565 756035626 754599392 753079832 751534700 749856591 748050570
2816.6G48050570j819610j975775k228498k329052k556562l051818l502905m026294
$$ 748050570 746230960 744255185 742026687 739697635 737141073 734089255 730586350 726560056
2832.9G26560056m934251o069362p379592r019613j0746181j2341619j3646423j3686717
$$ 726560056 721625805 715556443 708176851 699157238 688411057 676069438 662423015 648736298
2849.3F48736298j1256277o458164q58962L586411N594373N190730L404260J256346
$$ 648736298 637480021 631021857 630162895 633749306 639343679 644534409 647938669 649195015
2865.6F49195015n14149j192451n27978O92964J401067J324415O10769n71192j791715
$$ 649195015 648680866 647488415 646960437 647653401 649054468 650378883 650989652 650418460 648626745
2883.9F48626745k775967l635586m322350m677891m868329n022407n076527n201221
$$ 648626745 645850778 642215192 637892842 633214951 628346622 623324215 618247688 613046467
2900.2F13046467n548834o003380o681502p828295r338975j1047542j2709976j3543784
$$ 613046467 607497633 601494253 594812751 586984456 577645481 566597939 553887963 540344179
2916.6E40344179j2819410j0560870p044911k610863J934827N633056Q104146R613573
$$ 540344179 527524769 516963899 509918988 507308125 509242952 514876008 522980154 532593727
2932.9E32593727J0376573J0431647R900332Q728206O791055M391074J993716j1981
$$ 532593727 542970300 553401947 563302279 572030485 578821540 583212614 585206330 585194349
2949.2E85194349j065910r19222J46925J814425L660917N195856O291390P100940P545292
$$ 585194349 584128439 583209217 583356142 585170567 588831484 594027340 600318730 607419670 614964962
2967.6F14964962P422209O907105O210804N355358M587710M023314L424763K827466
$$ 614964962 622387171 629294276 635505080 640860438 645448148 649471462 652896225 655723691
2983.9F55723691K427816K141118J814664J405597R46998N56410K58386j8597k83241
$$ 655723691 658151507 660292625 662107289 663512886 664459884 665016294 665274680 665256083 664972842
3002.2F64972842m96030n63920m89473m08709l88503m87745p06494q54909q85964r55820
$$ 664972842 664476812 663912892 663423419 663014710 662626207 662138462 661431968 660577059 659691095 658735275
3022.6F58735275j081049j163125j191616j218498j236677j315177j474082j515985
$$ 658735275 657654226 656491101 655299485 654080987 652844310 651529133 650055051 648539066
3038.9F48539066j471936j544357j669824j734733j752735j729488j676977j666546
$$ 648539066 647067130 645522773 643852949 642118216 640365481 638635993 636959016 635292470
3055.3F35292470j710355j694918j621544j578271j494050j443088j576066j653076
$$ 635292470 633582115 631887197 630265653 628687382 627193332 625750244 624174178 622521102
3071.6F22521102j495897j305342j242280j322687j464724j570881j612961j577616
$$ 622521102 621025205 619719863 618477583 617154896 615690172 614119291 612506330 610928714
3087.9F10928714j547456j577794j610637j625061j607775j626969j749635j826226
$$ 610928714 609381258 607803464 606192827 604567766 602959991 601333022 599583387 597757161
3104.2E97757161j771570j775920j931548j973093j826167j827657k039373k236664
$$ 597757161 595985591 594209671 592278123 590305030 588478863 586651206 584611833 582375169
3120.5E82375169k349794k351999k241552k179206k261936k344072k351761k361000
$$ 582375169 580025375 577673376 575431824 573252618 570990682 568646610 566294849 563933849
3136.8E63933849k387762k474546k573252k583980k541602k487779k498626k633691
$$ 563933849 561546087 559071541 556498289 553914309 551372707 548884928 546386302 543752611
3153.2E43752611k781570k784550k687455k652764k719462k773106k762079k757967
$$ 543752611 540971041 538186491 535499036 532846272 530126810 527353704 524591625 521833658
3169.5E21833658k751589k732038k753079k775788k736807k737880k795279k757549
$$ 521833658 519082069 516350031 513596952 510821164 508084357 505346477 502551198 499793649
3185.8D99793649k665788k682328k760947k750367k689600k673239k675473k662123
$$ 499793649 497127861 494445533 491684586 488934219 486244619 483571380 480895907 478233784
3202.1D78233784k629727k562850k518118k523184k507746k472848k480179k499729
$$ 478233784 475604057 473041207 470523089 467999905 465492159 463019311 460539132 458039403
3218.4D58039403k443790k404124k460063k472192k378463k269477k229154k293348
$$ 458039403 455595613 453191489 450731426 448259234 445880771 443611294 441382140 439088792
3234.7D39088792k337218k244055k178341k191693k119362k027214k043664k049804
$$ 439088792 436751574 434507519 432329178 430137485 428018123 425990909 423947245 421897441
3251.1D21897441j979828j931607j937002j942933j926929j902371j850218j786888
$$ 421897441 419917613 417986006 416049004 414106071 412179142 410276771 408426553 406639665
3267.4D06639665j757025j785875j829266j812816j781762j755952j728386j751810
$$ 406639665 404882640 403096765 401267499 399454683 397672921 395916969 394188583 392436773
3283.7C92436773j767517j693427j598656j597435j672774j749247j804322j779020
$$ 392436773 390669256 388975829 387377173 385779738 384106964 382357717 380553395 378774375
3300C78774375j675785j599550j627386j776159j950413j974016j852781j792192j820475
$$ 378774375 377098590 375499040 373871654 372095495 370145082 368171066 366318285 364526093 362705618
3318.4C62705618j823842j814723j850695j918971j963437j960874j932352j862079
$$ 362705618 360881776 359067053 357216358 355297387 353333950 351373076 349440724 347578645
3334.7C47578645j785398j837462j955897j993537k031624k022236j887441j867503
$$ 347578645 345793247 343955785 341999888 340006351 337974727 335952491 334065050 332197547
3351C32197547j997829k074182k027690j922399j911849j920729j743526j590728j732886
$$ 332197547 330199718 328125536 326097846 324175447 322263598 320342869 318599343 317008615 315275729
3369.3C15275729j973033j955956j687646j468838j414507j408130j297593j087576
$$ 315275729 313302696 311346740 309659094 308190256 306775749 305367619 304070026 302982450
3385.7C02982450q55059o83069p58886r84908r45180n77629l07172m56900p30842o35773
$$ 302982450 302127391 301444322 300685436 299700528 298755348 298177719 297870547 297413647 296682805 296047032
3406.1B96047032l41177k18868k27929k04652j08719L3557J32293J62125K84046M91261
$$ 296047032 295705855 295486987 295259058 295054406 294945687 294979244 295111537 295273662 295557708 296048969
3426.5B96048969O34909O67214P51555R18329Q87215O81877P06881R95517J239807
$$ 296048969 296683878 297351092 298102647 299020976 299908191 300590068 301296949 302292466 303532273
3444.8C03532273J364767J374781J387954J494080J591235J696021J850307J874774
$$ 303532273 304897040 306271821 307659775 309153855 310745090 312441111 314291418 316166192
3461.1C16166192J832843K017737K272754K164692J783639J705498J948297K232134
$$ 316166192 317999035 320016772 322289526 324454218 326237857 327943355 329891652 332123786
3477.4C32123786K373368K227425K103478K260119K359181K269179K303481K468258
$$ 332123786 334497154 336724579 338828057 341088176 343447357 345716536 348020017 350488275
3493.8C50488275K587408K542138K500028K637446K606958K392322K487719K772331
$$ 350488275 353075683 355617821 358117849 360755295 363362253 365754575 368242294 371014625
3510.1C71014625K888679K803535K691269K785325L015756L268451L252655L024071
$$ 371014625 373903304 376706839 379398108 382183433 385199189 388467640 391720295 394744366
3526.4C94744366L044933L172279L229439L408641L501326L344088L430874L762155
$$ 394744366 397789299 400961578 404191017 407599658 411100984 414445072 417875946 421638101
3542.7D21638101L878951L672243L452718L568113L841757L897608L907174M079669
$$ 421638101 425517052 429189295 432642013 436210126 440051883 443949491 447856665 451936334
3559D51936334M144013L989607M183531M916460M972517M398048M340410M677773M907876
$$ 451936334 456080347 460069954 464253485 469169945 474142462 478540510 482880920 487558693 492466569
3577.4D92466569N043596N135685N111098N325556N798281N619585N129159N391597
$$ 492466569 497510165 502645850 507756948 513082504 518880785 524500370 529629529 535021126
3593.7E35021126N785466N794465N887568N929589N647242N586028O118179O397486
$$ 535021126 540806592 546601057 552488625 558418214 564065456 569651484 575769663 582167149
3610E82167149O192147N961538N672276O077289O656766N942583N061210N228281O724417
$$ 582167149 588359296 594320834 599993110 606070399 612727165 618669748 623730958 628959239 635683656
3628.4F35683656P155359N632936N188942N348981N254507N215049N030393M662931
$$ 635683656 642839015 648471951 653660893 659009874 664264381 669479430 674509823 679172754
3644.7F79172754M829645N815626N671382M037916L655792M397928M159749L479898
$$ 679172754 684002399 689818025 695489407 699527323 703183115 707581043 711740792 715220690
3661G15220690L333270L271759L139615L382623L425598K828181K907932K830088K179563
$$ 715220690 718553960 721825719 724965334 728347957 731773555 734601736 737509668 740339756 742519319
3679.4G42519319K127767K210736K220809K613247K703190J906871J415074J470745
$$ 742519319 744647086 746857822 749078631 751691878 754395068 756301939 757717013 759187758
3695.7G59187758J518548J534521J646638J520157J232862J190842J364409J470983
$$ 759187758 760706306 762240827 763887465 765407622 766640484 767831326 769195735 770666718
3712G70666718J177669Q10325P54535Q65162R13501Q57412P33197O66380Q11756J036465
$$ 770666718 771844387 772654712 773409247 774274409 775187910 776045322 776778519 777444899 778256655 779293120
3732.4G79293120J019657Q37981N70894K63094L25799P51913O92070M06265N10871
$$ 779293120 780312777 781150758 781721652 781984746 782310545 783062458 783754528 784160793 784671664
3750.7G84671664M93527L53157L67105M29750M16279L78429M08829L96609M21822L91424
$$ 784671664 785165191 785518348 785885453 786315203 786731482 787109911 787518740 787915349 788337171 788728595
3771.1G88728595K53021L15309M99725M60208K28584J42157J76191K07782K78711L04640
$$ 788728595 788981616 789296925 789796650 790256858 790485442 790627599 790803790 791011572 791290283 791594923
3791.5G91594923K88844L56137L03746J58786K75493L55601K42174J57476N8054L5942
$$ 791594923 791883767 792239904 792543650 792702436 792977929 793333530 793575704 793733180 793791234 793827176
3811.9G93827176J56462L32654K80380J41919J34408N5492L9101N0127M2200J45913
$$ 793827176 793983638 794316292 794596672 794738591 794872999 794928491 794967592 795017719 795059919 795205832
3832.3G95205832K72452L00229J01805o1214P3254J12295n4836p1168O6876J87755
$$ 795205832 795478284 795778513 795880318 795819104 795892358 796004653 795949817 795878649 795945525 796133280
3852.7G96133280K32518R5427l3260j430J19686J27911m4822n9963P0155M8757M8399
$$ 796133280 796365798 796461225 796427965 796426535 796546221 796674132 796629310 796569347 796639502 796688259 796736658
3875.2G96736658P3850J33395J50979K4139K3067j3470j03951p8082j21951j13010
$$ 796736658 796810508 796943903 797094882 797119021 797142088 797128618 797024667 796946585 796824634 796711624
3895.5G96711624J03235K31743P5757o8962o5387n3107l5167m9055p8141J0371J07527
$$ 796711624 796814859 797046602 797122359 797053397 796988010 796934903 796899736 796850681 796772540 796782911 796890438
3918G96890438L9041q1361n0723K0206k9922l0637O6281J07050L0279o5744j4067J36793
$$ 796890438 796929479 796848118 796797395 796817601 796787679 796757042 796823323 796930373 796960652 796894908 796880841 797017634
3942.5G97017634J56939M7505Q702p570p9691l2663J30713J72674M9949j2457K8371
$$ 797017634 797174573 797222078 797230780 797223210 797143519 797110856 797241569 797414243 797464192 797451735 797480106
3964.9G97480106M1962O9559N1260q762L0875J08004J21474Q4996Q1837P4446K8670
$$ 797480106 797522068 797591627 797642887 797634125 797665000 797773004 797894478 797979474 798061311 798135757 798164427
3987.3G98164427M6492J10328J15812Q0883O8963
$$ 798164427 798210919 798321247 798437059 798517942 798586905
3997.5G98586905
$$ 798586905
##END=$$ End of the data block
