##TITLE=$$ Begin of the data block
##JCAMP-DX=5.00 $$ ACD/SpecManager v 10.08
##SPECTROMETER/DATA SYSTEM=Alpha
##DATE=15 Apr 2014 09:00:42
##DATA TYPE=INFRARED SPECTRUM
##DATA CLASS=XYDATA
##ORIGIN=
##OWNER=
##NPOINTS=1765
##FIRSTX=399.75695801
##LASTX=3997.56933594
##MAXX=3997.56933594
##MINX=399.75695801
##MAXY=0.83594841
##MINY=0.29545146
##XFACTOR=1.0000000000
##YFACTOR=1.000000000000000e-9
##FIRSTY=0.59115517
##DELTAX=2.03957629
##XUNITS=1/CM
##YUNITS=ARBITRARY UNITS
##XYDATA=(X++(Y..Y))
399.8E91155171j129150j886129j977027o19173j213550j943887j81675K70427r63569
$$ 591155171 590026021 588139892 586162865 585543692 584330142 582386255 582204580 582475007 581511438
418.1E81511438m64678m48227j268744j25349L94642j013278o83308J89423j098632
$$ 581511438 581046760 580598533 579329789 579204440 579599082 578585804 577902496 578091919 576993287
436.5E76993287j029194O02126k9742p61152L17037j95503r95159K53916K37465r52423
$$ 576993287 575964093 576566219 576536477 575775325 576092362 575896859 574901700 575155616 575393081 574440658
456.9E74440658l75569m30107j584947p92921j53839j328469r19342J44959j010776
$$ 574440658 574065089 573634982 572050035 571257114 571103275 569774806 568855464 569000423 567989647
475.2E67989647j249551N6564l06427p29382L02076j37269j079023k67267m36426j636922
$$ 567989647 566740096 566796660 566490233 565760851 566062927 565925658 564846635 564579368 564142942 562506020
495.6E62506020q03590j08719j179874q70645q5830j205027j306534k31147j065612
$$ 562506020 561702430 561593711 560413837 559543192 559457362 558252335 556945801 556714654 555649042
514E55649042j654923m29690q81731k072573j034796o64354j881003j352429n49138
$$ 555649042 553994119 553564429 552682698 550610125 549575329 548910975 547029972 545677543 545128405
532.3E45128405j311719q79467J21057q69274j148641Q1658n20885j446068l81589
$$ 545128405 543816686 542937219 543058276 542189002 541040361 541122019 540601134 539155066 538773477
550.7E38773477l41952j444041r01223o32286j696765j402319r04083k126276k345443
$$ 538773477 538431525 536987484 536086261 535453975 533757210 532354891 531450808 529324532 526979089
569E26979089j458347k121210k436996j150310j187443k059877j346469j014650j803041
$$ 526979089 525520742 523399532 520962536 519812226 518624783 516564906 515218437 514203787 512400746
587.4E12400746j303732o82771j448214j121104r9242q23498j360535n77927n16295
$$ 512400746 511097014 510414243 508966029 507844925 507745683 506922185 505561650 504983723 504467428
605.8E04467428m29333Q19088P37011m50313M37736K298117K895474L649593M344463
$$ 504467428 504038095 504857183 505594194 505143881 505581617 507879734 510775208 514424801 518769264
624.1E18769264L353954K918303L805101L375887K506316K950430K450466P27117L61264
$$ 518769264 522123218 525041521 528846622 532222509 534728825 537679255 540129721 540856838 541218102
642.5E41218102R57906J449287K488017K480746j44780j837492L76522L660143N256057
$$ 541218102 542176008 543625295 546113312 548594058 548449278 546611786 546988308 550648451 555904508
660.8E55904508N492687L996491K591610L762841L347636J775443K189219L107846
$$ 555904508 561397195 565393686 567985296 571748137 575095773 576871216 579060435 582168281
677.1E82168281K392173J853347K529502K112567J286686J827001J656175L84986N69999
$$ 582168281 584560454 586413801 588943303 591055870 592342556 594169557 595825732 596210718 596780717
695.5E96780717J092375L75211N41389J594305J374543J255333K213776K077937J490295
$$ 596780717 597873092 598248303 598789692 600383997 601758540 603013873 605227649 607305586 608795881
713.8F08795881K152920K189338J293421J898885K770245K070844J908481K650559
$$ 608795881 610948801 613138139 614431560 616330445 619100690 621171534 623080015 625730574
730.2F25730574K129734J522779K107799J775444Q79347J447320J802862J066744J430154
$$ 625730574 627860308 629383087 631490886 633266330 634145677 635592997 637395859 638462603 639892757
748.5F39892757K126455J463950J284361J979410J582206J135111J839041J690686
$$ 639892757 642019212 643483162 644767523 646746933 648329139 649464250 651303291 652993977
764.8F52993977Q49187J222313J308262J13428j61052J27196q55624j473189q74936
$$ 652993977 653843164 655065477 656373739 656487167 656326115 656453311 655597687 654124498 653249562
783.2F53249562r12369r43481M68015J619756K115369L629625N054176N136728N550862
$$ 653249562 652337193 651393712 651861727 653481483 655596852 659226477 664280653 669417381 674968243
801.6F74968243O112694N091727M103482M115224L147781J796663J696884J041174
$$ 674968243 681080937 686172664 690276146 694391370 697539151 699335814 701032698 702073872
817.9G02073872q03232j744807k400279l999591m741907m448891m953563n197942m172683
$$ 702073872 701270640 699525833 697125554 693125963 688384056 683935165 678981602 673783660 669610977
836.2F69610977l785252m024148l260672k546669k330601p17103J714647L288090N196214
$$ 669610977 665825725 661801577 658540905 655994236 653663635 652946532 654661179 657949269 663145483
854.6F63145483P580757Q455991Q593440R318054R023249P609487O923199O039261
$$ 663145483 670726240 679182231 687775671 697093725 706116974 713726461 720649660 726688921
870.9G26688921M121662L134250K880872J551628L50058j4782j229823k515971k388239
$$ 726688921 730810583 733944833 736825705 738377333 738727391 738712609 737482786 734966815 732578576
889.3G32578576k356470k646983j555979j70648J48356Q53360J798868J295924N32866
$$ 732578576 730222106 727575123 726019144 725848496 725996852 726850212 728649080 729945004 730477870
907.6G30477870M76241m86374k083302k794444l533662m579127m253089l100157k433240
$$ 730477870 730954111 730467737 728384435 725589991 722056329 717477202 713224113 710123956 707690716
926G07690716j229882L38077O07431M69863R50993P08520m7505R0122N365r75013j407325
$$ 707690716 706460834 706798911 707406342 707876205 708827198 709535718 709488213 709578335 709583700 708608687 707201362
948.4G07201362j784265l278196m530549n129338o581843q291125r206712j0538936
$$ 707201362 705417097 702138901 697608352 692479014 685897171 677606046 668399334 657860398
964.7F57860398j2306869j3001501j3049901j2971163j1688351r691835q444130p350862
$$ 657860398 645553529 632552028 619502127 606530964 594842613 585150778 576706648 569355786
981E69355786n971849n340457n107224m365206l835380l662348k932787k191543k165079
$$ 569355786 563383937 558043480 552936256 548571050 544735670 541073322 538140535 535948992 533783913
999.4E33783913j971186j578569k052069k892375l368675m098833m881799m905462
$$ 533783913 531812727 530234158 528182089 525289714 521921039 517822206 512940407 508034945
1015.7E08034945m743875m767090m293650l660589l528744l240556k643198k488911
$$ 508034945 503291070 498523980 494230330 490569741 487040997 483800441 481157243 478668332
1032D78668332k360046j733988j396329j470357j245647j087815j419395j545012j326829
$$ 478668332 476308286 474574298 473177969 471707612 470461965 469374150 467954755 466409743 465082914
1050.4D65082914j203806o64651N28872J514316K054304K365380J878828N85019o37173
$$ 465082914 463879108 463214457 463743329 465257645 467311949 469677329 471556157 472141176 471504003
1068.7D71504003j677007k636432k905071k544642k363652k311676k208352k566725
$$ 471504003 469826996 467190564 464285493 461740851 459377199 457065523 454857171 452290446
1085D52290446l238887l487796l296584k710461j394928J87755J260012J972527K511173
$$ 452290446 449051559 445563763 442267179 439556718 438161790 438349545 439609557 441582084 444093257
1103.4D44093257K505839K154559J852125J274198L30180p21127k239346m186541n062789
$$ 444093257 446599096 448753655 450605780 451879978 452210158 451489031 449249685 445063144 440000355
1121.8D40000355l635406r03428J267016K127171J470357J99020J44660J303435K381980
$$ 440000355 436364949 435461521 436728537 438855708 440326065 440525085 440669745 441973180 444355160
1140.1D44355160K937824K923250K352804J823634J658439J537800J617849K191961
$$ 444355160 447292984 450216234 452569038 454392672 456051111 457588911 459206760 461398721
1156.4D61398721K902627L664314M832805O135761P138074P986307Q570194Q542717
$$ 461398721 464301348 467965662 472798467 478934228 486072302 494058609 502628803 511171520
1172.7E11171520Q270859Q029879P414639O476044N513668M103124K113998J95146
$$ 511171520 519442379 527472258 534886897 541362941 546876609 550979733 553093731 553288877
1189.1E53288877j467109k832830l230869k575756j554191l43024Q90374J465320J345098
$$ 553288877 551821768 548988938 545758069 543182313 541628122 541285098 542175472 543640792 544985890
1207.4E44985890J006663L79265m39525q48293r20236j073063j058221p36058m87208
$$ 544985890 545992553 546371818 545932293 545084000 544163764 543090701 542032480 541296422 540809214
1225.8E40809214k48492K18511N96642P91312J142382J472354J473010J450002J457930
$$ 540809214 540560722 540779233 541375875 542167187 543309569 544781923 546254933 547704935 549162865
1244.1E49162865J161873Q14557O46889L47138P1048K11955M94241P51019J297653
$$ 549162865 550324738 551139295 551786184 552133322 552204370 552416325 552910566 553661585 554959238
1262.5E54959238J986861K490520L014624L604293L944636M176497M526675M733086
$$ 554959238 556946099 559436619 562451243 566055536 570000172 574176669 578703344 583436430
1278.8E83436430M777729M961193N166351N209327N273342N277992M950165M503548
$$ 583436430 588214159 593175352 598341703 603551030 608824372 614102364 619052529 623556077
1295.1F23556077M152060L701806L222823K949775K661049K247870J981914J805067
$$ 623556077 627708137 631409943 634632766 637582541 640243590 642491460 644473374 646278441
1311.4F46278441J492739J265227J322091J363218J334727J441717J461148J289964
$$ 646278441 647771180 649036407 650358498 651721716 653056443 654498160 655959308 657249272
1327.8F57249272J124680Q54969L78728Q9884J55866J78933J75059M32372O22272N57304
$$ 657249272 658373952 659228921 659607649 659697533 659853399 660032332 660207391 660639763 661262035 661819339
1348.1F61819339N33044M59969J59323j52468m47452r86338j650095j985848j923084
$$ 661819339 662352383 662812352 662971675 662819207 662371755 661385417 659735322 657749474 655826390
1366.5F55826390j774490j795113k191782k678514k322316j309275r21309j131177
$$ 655826390 654051900 652256787 650065005 647386491 645064175 643754900 642833591 641702414
1382.8F41702414p41780l2246j60158o87182j013398j434624j864910k307535k847910
$$ 641702414 640960634 640928388 640768230 640081048 639067650 637633026 635768116 633460581 630612671
1401.2F30612671l048241k966285k934873k780914k324760j917004j658798j233101
$$ 630612671 627564430 624598145 621663272 618882358 616557598 614640594 612981796 611748695
1417.5F11748695r25958j101434j051366q02040q65639j048386j113355j087010p71463
$$ 611748695 610822737 609721303 608669937 607867897 607002258 605953872 604840517 603753507 602982044
1435.9F02982044l08990k34485j31845K03490N78880P74801P89463Q38519J353681
$$ 602982044 602673054 602438569 602306724 602510214 603089094 603863895 604653358 605491877 606845558
1454.2F06845558L510117N987704N308688M843592O217957P493377Q134305J0141611
$$ 606845558 610355675 616343379 621652067 626495659 632713616 640206993 648341298 658482909
1470.5F58482909J2808979J1444509P987797O185532M997849L726065K420068J191914
$$ 658482909 671291888 682736397 690724194 696909726 701907575 705633640 708053708 709245622
1486.8G09245622j48654j443088k292812k972662l699064m215122m529834m534959
$$ 709245622 709096968 707653880 705361068 702388406 698689342 694474220 689944386 685409427
1503.2F85409427m898370o481707o695389n837203n467176m970491m043043l015458
$$ 685409427 680511057 674029350 667333961 661496758 656029582 651059091 647016048 644000590
1519.5F44000590k764404k867937k698302k702713k556920k112866j925349j891613
$$ 644000590 641236186 638368249 635669947 632967234 630410314 628297448 626372099 624480486
1535.8F24480486j310408n45740o57976o81043j48236L68535J033247J681268J935959
$$ 624480486 623170078 622624338 621966362 621285319 621137083 621505618 622538865 624220133 626156092
1554.1F26156092J975476K929867K940237P40648N2750k5928n72861j390874k209008
$$ 626156092 628131568 631061435 634001672 634742320 634795070 634769142 634196281 632805407 630596399
1572.5F30596399k884328l880024m593074m951656n496800n883098o227433o561518
$$ 630596399 627712071 623832047 619238973 614287317 608790517 602907419 596679986 590118468
1588.8E90118468o796122o928086p079423p032215o893635o935477o931901o756067
$$ 590118468 583322346 576394260 569314837 562282622 555388987 548453510 541521609 534765542
1605.1E34765542o707788o849885o793439o510735o560802o859184n981922n285471
$$ 534765542 528057754 521207869 514414430 507903695 501342893 494483709 488501787 483216316
1621.4D83216316n446196n311936m878044m289866l344357k371162j518995q08358
$$ 483216316 477770120 472458184 467580140 463290274 459945917 457574755 456055760 455247402
1637.8D55247402k48343M94063J320988K542347L094018K291232L333121N420626L928959
$$ 455247402 454999059 455493122 456814110 459356457 462450475 464741707 468074828 473495454 477424413
1656.1D77424413L261834M344344N647183O059289N480111O234347P365406O594062
$$ 477424413 480686247 485030591 490677774 496737063 502217174 508451521 515816927 522410989
1672.4E22410989O771505P569134O831527O347656P595062J0023892Q778870P122219
$$ 522410989 529182494 536751628 543583155 549930811 557525873 567549765 576328635 583450854
1688.8E83450854P574797P278501Q198977R465992R906888J1460305R627819Q150697
$$ 583450854 591025651 598304152 606503129 615969121 625876009 637336314 646964133 655114830
1705.1F55114830Q363306P379830O587923O153583O072402O577015N631089L993929
$$ 655114830 663478136 670857966 677445889 683599472 689671874 696248889 701879978 705873907
1721.4G05873907L745973L808379L428936L296852L314734L878653L841877L042578
$$ 705873907 709619880 713428259 716857195 720154047 723468781 727347434 731189311 734231889
1737.7G34231889L299594L711164L862322M166305M506290N005300M941463L929734
$$ 734231889 737531483 741242647 745104969 749271274 753777564 758782864 763724327 767654061
1754G67654061L479541L381967K927184K764762K533257K168774K058447K117514K112747
$$ 767654061 771133602 774515569 777442753 780207515 782740772 784909546 786967993 789085507 791198254
1772.4G91198254J715541J433253J532376J517593J436055J510561J423955J262962
$$ 791198254 792913795 794347048 795879424 797397017 798833072 800343633 801767588 803030550
1788.7H03030550J410485J503527J160324J043498J141012J075923R94802R57846Q36671
$$ 803030550 804441035 805944562 807104886 808148384 809289396 810365319 811360121 812317967 813154638
1807H13154638Q00371Q89778P69854O46710P59900P68304N81562O31154P93516P04944
$$ 813154638 813955009 814844787 815614641 816261351 817021251 817789555 818371117 819002271 819795787 820500731
1827.4H20500731O59109O38902M60148M22835N58555N36800M82201O47485O02127K84194
$$ 820500731 821159840 821798742 822258890 822681725 823240280 823777080 824259281 824906766 825508893 825793087
1847.8H25793087K99275M79043M13954L48211M37140L65138K17021L28362M48286L75629
$$ 825793087 826092362 826571405 826985359 827333570 827770710 828135848 828352869 828681231 829129517 829505146
1868.2H29505146L19361K84791J69039J55270K76029K38121J66118K69711K70188J49786
$$ 829505146 829824507 830109298 830278337 830433607 830709636 830947757 831113875 831383586 831653774 831803560
1888.6H31803560J81377K30670J37747J18672J91033J30177P2181J73807J72377O2048
$$ 831803560 831984937 832215607 832353354 832472026 832663059 832793236 832865417 833039224 833211601 833273649
1909H33273649J07408J47342O7294J08659J64211L2783j5438O6042K0683n9307J2756
$$ 833273649 833381057 833528399 833595693 833704352 833868563 833901346 833885908 833951950 833972633 833913326 833926082
1931.5H33926082K6643j02937o1393N6863l7551j31786p6532j26243j98484j01208
$$ 833926082 833952725 833849788 833788395 833845258 833807707 833675921 833599389 833473146 833274662 833173454
1951.9H33173454j03772k28763j62959n2273j54018k02060q8275j17540j97112j05143
$$ 833173454 833069682 832840919 832677960 832625687 832471669 832269609 832181334 832063794 831866682 831761539
1972.3H31761539p5042j55449j12832q7201j85430j52052k9743r8764j56999q1897
$$ 831761539 831686497 831531048 831418216 831331015 831145585 830993533 830963790 830865026 830708027 830626130
1992.6H30626130j76012k98500j73808j03116k35736k02954q0645j91808k87711j74165
$$ 830626130 830450118 830151618 829977810 829874694 829638958 829436004 829355359 829163551 828875840 828701675
2013H28701675j63376k58923k27511k26617k86877k03431j11758k07544k34484j26064
$$ 828701675 828538299 828279376 828051865 827825248 827538371 827334940 827223182 827015638 826781154 826655090
2033.4H26655090j63794k50220j75118j33992k04742j52647j04904k07901j79172l4153
$$ 826655090 826491296 826241076 826065958 825931966 825727224 825574577 825469673 825261772 825082600 825048447
2053.8H25048447j06633j87457o2763p0513j81257r1315j5914j05500p2003J2279p2539
$$ 825048447 824941814 824754357 824691594 824621081 824439824 824348509 824332595 824227095 824155092 824167371 824094832
2076.3H24094832p3791O1155K980r6083J8835J8597j43170p6533O6877j7226k5988
$$ 824094832 824021041 824082196 824085176 823989093 824007928 824026525 823883355 823806822 823873699 823856473 823830485
2098.7H23830485J12832L0041q7321N0008J01268m828N9784R8646k0624L7611J83761
$$ 823830485 823943317 823973358 823886037 823936045 824037313 824032485 824092269 824190915 824170291 824207902 824391663
2121.1H24391663R4652K6107J52290J33932L9875J35064J59562O0379J44005K13802
$$ 824391663 824486315 824512422 824664712 824798644 824838519 824973583 825133145 825193524 825337529 825551331
2141.5H25551331P2718P1168K23279J83701J09255K10941J94788N6625J28030K19405
$$ 825551331 825624049 825695217 825918496 826102197 826211452 826422393 826617181 826673806 826801836 827021241
2161.9H27021241J11699J26064K56837J70111J08898K62260K49029J03533J65999K04801
$$ 827021241 827132940 827259004 827515841 827685952 827794850 828057110 828306139 828409672 828575671 828780472
2182.3H28780472Q0824J09852K11238J35422J01924J73986Q8751P689J29938J55211
$$ 828780472 828861296 828971148 829182386 829317808 829419732 829593718 829682469 829690158 829820096 829975307
2202.7H29975307K1815M9413J33812O1512M3690J12415M8577n126J00255Q7500k1994
$$ 829975307 829997122 830046535 830180347 830241859 830285549 830397964 830446541 830441415 830541670 830629170 830607176
2225.2H30607176N2929Q1062m0471l696P1347l2366n5134M7982K205p1764O199M17
$$ 830607176 830660105 830741167 830700696 830697000 830768347 830735981 830680847 830728829 830731034 830659270 830665469 830665886
2249.6H30665886j01089n8532l0041j30593j02163L9697J2517l8683O9558Q4043k742
$$ 830665886 830564797 830506265 830476224 830345631 830243468 830283165 830295682 830256999 830326557 830410600 830407858
2272.1H30407858J3709K2113k1219P8261K08795J28806N245J6451p928n7935K0742
$$ 830407858 830421567 830443680 830422461 830500722 830709517 830838323 830843568 830860019 830852091 830794156 830814898
2294.5H30814898L8624m9114j3829L8505p8797j60993q7499l2127O0K9861q0049k39729
$$ 830814898 830853522 830804408 830790579 830829084 830750287 830589294 830501795 830469668 830469728 830499589 830419540 830179811
2319H30179811j80603J3948P5579O1810N8174p928p0393n9664k6286O1572J86563L33070
$$ 830179811 829999208 830013156 830088735 830150545 830208719 830200791 830130398 830070734 830044448 830106020 830292583 830625653
2343.5H30625653N35250M07875p5341m15742l74019k21133k03908j10388J06812L51429
$$ 830625653 831160903 831568778 831493437 831077695 830703676 830482543 830278635 830168247 830275059 830626488
2363.8H30626488N48959N90562N44370N01692N17189N31733M66884M22716L80158K54393
$$ 830626488 831175447 831766009 832310379 832812071 833329260 833860993 834327877 834750593 835130751 835385144
2384.2H35385144J54078J28627P7545M2439Q5950P4625l2425m9770R775j073n36K7537
$$ 835385144 835539222 835667849 835745394 835787833 835873783 835948408 835915983 835866213 835875988 835874915 835874379 835901916
2408.7H35901916k2650p0035j9670j6451j17004j37925p8618q1480j08003q9407r6262
$$ 835901916 835879266 835809231 835789561 835773110 835656106 835518181 835439563 835358083 835250080 835160673 835064411
2431.2H35064411j37865j32978j17660j35660j12593o8486r7692j24037j12891j58251
$$ 835064411 834926546 834793568 834675908 834540248 834427655 834359169 834261477 834137440 834024549 833866298
2451.5H33866298j88589j18732q7321j42455j55688j49130j84775j70648j10984j07586
$$ 833866298 833677709 833558977 833471656 833329201 833173513 833024383 832839608 832668960 832557976 832450390
2471.9H32450390j55330j85966j90497k06768k01285j46091j31905j64509j56939j56820
$$ 832450390 832295060 832109094 831918597 831711829 831510544 831364453 831232548 831068039 830911100 830754280
2492.3H30754280j72496j43468j72138k50578k15948j38223j58787j95265j71184j66834
$$ 830754280 830581784 830438316 830266178 830015600 829799652 829661429 829502642 829307377 829136193 828969359
2512.7H28969359j89662j85191j94013k36810k17020j37091j27375j54257j51992j74582
$$ 828969359 828779697 828594506 828400493 828163683 827946663 827809572 827682197 827527940 827375948 827201366
2533.1H27201366j96576j72615j76072j97887j50144j23322j73390k00391j85549j89960
$$ 827201366 827004790 826832175 826656103 826458216 826308072 826184750 826011360 825810969 825625420 825435460
2553.5H25435460j94312j51395j72258k52664k31027j88709k24411k45512k60591l20196
$$ 825435460 825241148 825089753 824917495 824664831 824433804 824245095 824020684 823775172 823514581 823194385
2573.9H23194385l29435k72453k92242l45170l10004l34978m19498l72052l21686l95179
$$ 823194385 822864950 822592497 822300255 821955085 821645081 821310103 820890605 820518553 820196867 819801688
2594.3H19801688m35710m21285m67122m79996m11391m42267n10991m46379m39107n55813
$$ 819801688 819365978 818944693 818477571 817997575 817586184 817143917 816632926 816186547 815747440 815191627
2614.7H15191627n31078m25398m62532n07295m64619n04434n85377n10692m19736m55738
$$ 815191627 814660549 814235151 813772619 813265324 812800705 812296271 811710894 811200202 810780466 810324728
2635.1H10324728m66942m62592n21541m84466l86417m28915m78089m45604m90546n34058
$$ 810324728 809857786 809395194 808873653 808389187 808002770 807573855 807095766 806650162 806159616 805625558
2655.5H05625558m51982m24922m84407m18722l62873m89950n10633l69847l90232m63009
$$ 805625558 805173576 804748654 804264247 803845525 803482652 802992702 802482069 802112222 801721990 801258981
2675.9H01258981l78132l78430n01513m60029l88145m85242m82022l84569m67062n48304
$$ 801258981 800880849 800502419 800000906 799540877 799152732 798667490 798185468 797800899 797333837 796785533
2696.3G96785533m76777n00858o04749n50985n27024o82354p00593n99087o59763o74367
$$ 796785533 796308756 795807898 795203149 794652164 794125140 793442786 792742193 792143106 791483343 790808976
2716.7G90808976n65946o14286p13229o55294o33656o79672n49376m36962n31316n30243
$$ 790808976 790243030 789628744 788915515 788260221 787626565 786946893 786397517 785960555 785429239 784898996
2737.1G84898996m44352n15580n45264m50909m85837n66960n22077n50329o87361o71566
$$ 784898996 784454644 783939064 783393800 782942891 782457054 781890094 781368017 780817688 780130327 779458761
2757.5G79458761o23703p35163p47025o59049p36058q07941p35640p86245r12190q57412
$$ 779458761 778835058 778099895 777352870 776693821 775957763 775149822 774414182 773627937 772715747 771858335
2777.9G71858335q66175j018584r67979q60393r87709j081049j034975j113356j205682
$$ 771858335 770992160 769973576 769005597 768145204 767157495 766076446 765041471 763928115 762722433
2796.2G62722433j148999j198530j344979j330435j345694j494885j518607j515210
$$ 762722433 761573434 760374904 759029925 757699490 756353796 754858911 753340304 751825094
2812.5G51825094j681566j808763j822948j971364k190113k318382k600491l063262
$$ 751825094 750143528 748334765 746511817 744540453 742350340 740031958 737431467 734368205
2828.9G34368205l464103m010200m964233o108343p380784q986830j0721803j2345076
$$ 734368205 730904102 726893902 721929669 715821326 708440542 699453712 688731909 676386833
2845.2F76386833j3676762j3716340j1248947o439328q74579L552437N576193N192876
$$ 676386833 662710071 648993731 637744784 631305456 630430877 633983314 639559507 644752383
2861.5F44752383L414810J293182m65810j193643n69582O45280J382828J352012O27041
$$ 644752383 648167193 649460375 648994565 647800922 647231340 647876620 649259448 650611460 651238501
2879.9F51238501n81920j783669k763510l640771m302382m635692m848540n019486
$$ 651238501 650656581 648872912 646109402 642468631 638166249 633530557 628682017 623662531
2896.2F23662531n099117n246282n548894n975366o698549p866800r364187j1073411
$$ 623662531 618563414 613317132 607768238 601792872 595094323 587227523 577863336 566789925
2912.5E66789925j2722671j3529003j2785673j0499716o980001k589465J921952N623579
$$ 566789925 554067254 540538251 527752578 517252862 510272861 507683396 509605348 515228927
2928.8E15228927Q099139R608328J0391534J0452985R880007Q662462O758571M436731
$$ 515228927 523328066 532936394 543327928 553780913 563660920 572323382 579081953 583518684
2945.1E83518684K030730r954j045823r18627J02759J768171L642321N226970O362378
$$ 583518684 585549414 585539460 584493637 583575010 583677769 585445940 589088261 594315231 600677609
2963.5F00677609P154882P561863P415235O888807O227970N388021M555405L952980
$$ 600677609 607832491 615394354 622809589 629698396 635926366 641314387 645869792 649822772
2979.8F49822772L372788K809584K480865K207398J808584J385510R52244N40018K12967
$$ 649822772 653195560 656005144 658486009 660693407 662501991 663887501 664839745 665379763 665592730
2998.1F65592730l3796k44558m60803n54860m79758l85046l99530n46634p10904p96378
$$ 665592730 665558934 665314376 664853573 664298713 663818955 663433909 663034379 662487745 661776841 660980463
3018.5F60980463q71420r84967j092851j184523j251578j236022j171171j262427j452505
$$ 660980463 660109043 659124076 658031225 656846702 655595124 654359102 653187931 651925504 650472999
3036.9F50472999j480282j457691j576662j714408j738370j720488j710236j687169
$$ 650472999 648992717 647535026 645958364 644243956 642505586 640785098 639074862 637387693
3053.2F37387693j696587j735687j716673j644552j561701j457394j450181j578450
$$ 637387693 635691106 633955419 632238746 630594194 629032493 627575099 626124918 624546468
3069.5F24546468j594901j425564j275659j252770j352310j494289j563668j579046
$$ 624546468 622951567 621526003 620250344 618997574 617645264 616150975 614587307 613008261
3085.8F13008261j573742j572668j608849j630783j618147j600921j641214j762628
$$ 613008261 611434519 609861851 608253002 606622219 605004072 603403151 601761937 599999309
3102.2E99999309j830936j790106j798570j928628j962781j828193j817346k013266
$$ 599999309 598168373 596378267 594579697 592651069 590688288 588860095 587042749 585029483
3118.5E85029483k229214k364635k352834k221525k161503k271115k387584k380669
$$ 585029483 582800269 580435634 578082800 575861275 573699772 571428657 569041073 566660404
3134.8E66660404k346456k353728k441942k578855k606869k561450k537548k509833
$$ 566660404 564313948 561960220 559518278 556939423 554332554 551771104 549233556 546723723
3151.1E46723723k572536k729416k766728k711535k726436k770781k764225k731502
$$ 546723723 544151187 541421771 538655043 535943508 533217072 530446291 527682066 524950564
3167.4E24950564k731919k751530k750873k774060k782106k715290k722859k793432
$$ 524950564 522218645 519467115 516716242 513942182 511160076 508444786 505721927 502928495
3183.7E02928495k758622k668798k649098k708406k755135k734333k683193k643525
$$ 502928495 500169873 497501075 494851977 492143571 489388436 486654103 483970910 481327385
3200.1D81327385k621621k614647k576024k524644k529442k520710k481073k500654
$$ 481327385 478705764 476091117 473515093 470990449 468461007 465940297 463459224 460958570
3216.4D60958570k523958k475709k437294k436071k396643k324880k284735k265185
$$ 460958570 458434612 455958903 453521609 451085538 448688895 446364015 444079280 441814095
3232.7D41814095k276868k309561k264469k184570k135277k070785k033978k086640
$$ 441814095 439537227 437227666 434963197 432778627 430643350 428572565 426538587 424451947
3249D24451947k113342k030641j938164j921624j924694j905650j875728j848489j841933
$$ 424451947 422338605 420307964 418369800 416448176 414523482 412617832 410742104 408893615 407051682
3267.4D07051682j809656j794338j816422j798540j792104j785486j725257j712084
$$ 407051682 405242026 403447688 401631266 399832726 398040622 396255136 394529879 392817795
3283.7C92817795j726478j660198j604140j645326j730800j790762j786292j731455
$$ 392817795 391091317 389431119 387826979 386181653 384450853 382660091 380873799 379142344
3300C79142344j677364j627714j647472j795739j914084j926631j878827j811773j818031
$$ 379142344 377464980 375837266 374189794 372394055 370479971 368553340 366674513 364862740 363044709
3318.4C63044709j848519j829564j837969j907766j943052j918763j898527j857281
$$ 363044709 361196190 359366626 357528657 355620891 353677839 351759076 349860549 348003268
3334.7C48003268j815617j887351k011597k019137j961708j901925j834273j918942
$$ 348003268 346187651 344300300 342288703 340269566 338307858 336405933 334571660 332652718
3351C32652718k091438k114326k006828j883775j835913j857280j783520j679540j786977
$$ 332652718 330561280 328446954 326440126 324556351 322720438 320863158 319079638 317400098 315613121
3369.3C15613121j969606j907498j670718j495272j410186j372009j276553j107425
$$ 315613121 313643515 311736017 310065299 308570027 307159841 305787832 304511279 303403854
3385.7C03403854r05066p16627p36117q98868q39144n02110k92539n19812q16405o67483
$$ 303403854 302498788 301782161 301046044 300147176 299308032 298805922 298513383 297993571 297177166 296509683
3406.1B96509683l47227k06440j62393j60486j45674l6001J09077J74045K61128M74334
$$ 296509683 296162456 295956016 295793623 295633137 295487463 295451462 295560539 295734584 295995712 296470046
3426.5B96470046O82622P29859P89523R36896Q33064O00338P20978J059294J280874
$$ 296470046 297152668 297882527 298672050 299608946 300442010 301042348 301763326 302822620 304103494
3444.8C04103494J384228J380026J384646J470059J562566J682430J843572J886785
$$ 304103494 305487722 306867748 308252394 309722453 311285019 312967449 314811021 316697806
3461.1C16697806J899660K122730K280116K023011J647711J677960J988232K244443
$$ 316697806 318597466 320720196 323000312 325023323 326671034 328348994 330337226 332581669
3477.4C32581669K312720K191037K154410K294570K323896K257973K334773K495140
$$ 332581669 334894389 337085426 339239836 341534406 343858302 346116275 348451048 350946188
3493.8C50946188K617002K566635K499402K597868K564103K410531K537220K788991
$$ 350946188 353563190 356129825 358629227 361227095 363791198 366201729 368738949 371527940
3510.1C71527940K890408K842397K740889K781630K973527L201007L164292K976090
$$ 371527940 374418348 377260745 380001634 382783264 385756791 388957798 392122090 395098180
3526.4C95098180L026843L171563L289223L487765L540963L354609L416479L746420
$$ 395098180 398125023 401296586 404585809 408073574 411614537 414969146 418385625 422132045
3542.7D22132045L931344L740757L443063L540486L847867L882945L866076M070520
$$ 422132045 426063389 429804146 433247209 436787695 440635562 444518507 448384583 452455103
3559D52455103M174859M037261M206985M896581M955113M386336M330307M699677M949451
$$ 452455103 456629962 460667223 464874208 469770789 474725902 479112238 483442545 488142222 493091673
3577.4D93091673N044669N065381N020619N269944N813122N700588N152881N346239
$$ 493091673 498136342 503201723 508222342 513492286 519305408 525005996 530158877 535505116
3593.7E35505116N823851N907595N923092N889654N609453N586028O184220O447912
$$ 535505116 541328967 547236562 553159654 559049308 564658761 570244789 576429009 582876921
3610E82876921O146848N894422N648375O094277O696641N981744N104363N260825O727814
$$ 582876921 589023769 594918191 600566566 606660843 613357484 619339228 624443591 629704416 636432230
3628.4F36432230P140339N569875N142510N394578N293667N178333M984557M644215
$$ 636432230 643572569 649142444 654284954 659679532 664973199 670151532 675136089 679780304
3644.7F79780304M817963N837739N724668M049242L632784M383146M167378L513754
$$ 679780304 684598267 690436006 696160674 700209916 703842700 708225846 712393224 715906978
3661G15906978L366649L251612L103614L396153L414810K739012K856493K898455K270996
$$ 715906978 719273627 722525239 725628853 729025006 732439816 735178828 738035321 740933776 743204772
3679.4G43204772K188147K246737K210975K555907K661049J930654J447141J461804
$$ 743204772 745392919 747639656 749850631 752406538 755067587 756998241 758445382 759907186
3695.7G59907186J502872J518309J626908J542449J269460J185537J342296J481891
$$ 759907186 761410058 762928367 764555275 766097724 767367184 768552721 769895017 771376908
3712G71376908J194894P93755P16627Q32915R06527Q65817P64907P25805P81477R05216
$$ 771376908 772571802 773365557 774082184 774915099 775821626 776687443 777452350 778178155 778959632 779864848
3732.4G79864848J008629R36866O03497K56837K73525O84202P18057M47572N36799
$$ 779864848 780873477 781810343 782413840 782670677 782944202 783628404 784346461 784794033 785330832
3750.7G85330832N25653L47674L63291M65810M52757L85523M00245L57568L58939L91245
$$ 785330832 785856485 786204159 786567450 787033260 787486017 787871540 788271785 788629353 788988292 789379537
3771.1G89379537K91348K97486M79818N07414K60711J31070K07484K61426K83420K61069
$$ 789379537 789670885 789968371 790448189 790955603 791216314 791347384 791554868 791816294 792099714 792360783
3791.5G92360783K18987L00229L17216K02834K44498K86043K54870K31266R0301M77
$$ 792360783 792579770 792879999 793197215 793400049 793644547 793930590 794185460 794416726 794507027 794507504
3811.9G94507504J22547L83675L65555J74284J05977j8299n960P8678P2718J12116
$$ 794507504 794630051 795013726 795379281 795553565 795659542 795641243 795635283 795713961 795786679 795898795
3832.3G95898795K18988L06129K02060K4080M8995P3135m5776r2388l3855J19269K67506
$$ 795898795 796117783 796423912 796625972 796650052 796699047 796772182 796726406 796634018 796600163 796719432 796986938
3854.8G96986938R4175o7413p749J51396J54555m3988k3127J25528M8756K1100L6001
$$ 796986938 797081113 797013700 797005951 797157347 797311902 797267914 797244787 797370315 797419071 797440171 797476172
3877.2G97476172P3553J26183M9233L8385l0100j01268J7881j9610j47640m6909R6619
$$ 797476172 797549725 797675908 797725141 797763526 797733426 797632158 797650039 797630429 797482789 797435880 797532499
3899.6G97532499J37865J24872k7180j58190r5785l8326n0545L3319J13070N4300k5391
$$ 797532499 797670364 797795236 797768056 797609866 797514081 797475755 797425210 797458529 797571599 797625899 797600508
3922.1G97600508j5795k4438q8633k4020R5188R1553K6643j9908q583P8440J31130
$$ 797600508 797584713 797560275 797471642 797447622 797542810 797634363 797661006 797641098 797632515 797710955 797842085
3944.5G97842085Q4758L5286k8789j01626o9141L8743Q1837J03176J73032J29282K1518
$$ 797842085 797926843 797962129 797933340 797831714 797762573 797801316 797883153 797986329 798159361 798288643 798310161
3966.9G98310161N2154O9320l0577l2068Q5533J27852J18136J43588Q4758j9848K6464
$$ 798310161 798362315 798431635 798401058 798368990 798454523 798582375 798700511 798844099 798928857 798909009 798935473
3989.4G98935473R8526P4029P0930J05798
$$ 798935473 799033999 799108028 799178958 799284756
3997.5G99284756
$$ 799284756
##END=$$ End of the data block
