##TITLE=$$ Begin of the data block
##JCAMP-DX=5.00 $$ ACD/SpecManager v 10.08
##SPECTROMETER/DATA SYSTEM=Alpha
##DATE=15 Apr 2014 09:00:42
##DATA TYPE=INFRARED SPECTRUM
##DATA CLASS=XYDATA
##ORIGIN=
##OWNER=
##NPOINTS=1765
##FIRSTX=399.75695801
##LASTX=3997.56933594
##MAXX=3997.56933594
##MINX=399.75695801
##MAXY=0.83638537
##MINY=0.29616413
##XFACTOR=1.0000000000
##YFACTOR=1.000000000000000e-9
##FIRSTY=0.59295458
##DELTAX=2.03957629
##XUNITS=1/CM
##YUNITS=ARBITRARY UNITS
##XYDATA=(X++(Y..Y))
399.8E92954576r62496j929402k287448o99579q57055j601279m29392k17438j029909
$$ 592954576 591992080 590062678 587775230 587075651 586218596 584617317 584187925 583970487 582940578
418.1E82940578k77042j50919j038611l12805l8803j433193r06885J19150j231551
$$ 582940578 582663536 582512617 581474006 581161201 581122398 579689205 578782320 578901470 577669919
436.5E77669919j063288O58393o5028o69539M57644r2924p51793M61698J82271j181245
$$ 577669919 576606631 577265024 577199996 576530457 576988101 576895177 576143384 576605082 576787353 575606108
456.9E75606108n58615m78506j567602q52108k88964j400053r30369J35899q90136
$$ 575606108 575047493 574568987 573001385 572149277 571860313 570460260 569529891 569665790 568775654
475.2E68775654r53138K55108m57287j109421J17182j39057j158059k71261l11613
$$ 568775654 567822516 568077624 567620337 566510916 566628098 566489041 565330982 565059721 564748108
493.6E64748108j549363q51333l35455j436353q71241J56582j074970j469791m43578
$$ 564748108 563198745 562347412 562011957 560575604 559704363 559860945 558785975 557316184 556872606
511.9E56872606j097500j525641k56478p51376j985372j112282r06050j913965j109183
$$ 556872606 555775106 554249465 553992987 553241611 551256239 550143957 549237907 547323942 546214759
530.3E46214759m58181j589894j192152R2983o62327q93176J60158n42402j334250
$$ 546214759 545756578 544166684 542974532 543067515 542405188 541512012 541672170 541129768 539795518
548.6E39795518l22700m44591j456678p60912n34475j829207j641572r11534k001345
$$ 539795518 539472818 539028227 537571549 536810637 536276162 534446955 532805383 531893849 529892504
567E29892504k362251j522005k177059k509833j165032j227021k158523j317978q98480
$$ 529892504 527530253 526008248 523831189 521321356 520156324 518929303 516770780 515452802 514554322
585.4E14554322j774907j338840o82533j338243j014650j21474q80659j398086n86927
$$ 514554322 512779415 511440575 510758042 509419799 508405149 508283675 507403016 506004930 505418003
603.7E05418003m91321l83497R08256Q37683m08351M30286K327144K937734L568650
$$ 505418003 504926682 504543185 505451441 506289124 505880773 506311059 508638203 511575937 515144587
622.1E15144587M242241L465950L086925L757060L180861K355039K893090K429426
$$ 515144587 519386828 522852778 525939703 529696763 532877624 535232663 538125753 540555179
638.4E40555179P72178M75109R92536J419843K489209K432704j77562j726807M84348
$$ 540555179 541327357 541802466 542795002 544214845 546704054 549136758 548959196 547232389 547716737
656.7E47716737L666699N261659N485595L934204K537787L737688L320396J727820
$$ 547716737 551383436 556645095 562130690 566064894 568602681 572340369 575660765 577388585
673.1E77388585K185046L203035K435624J828611K558232K095699J190126J814306
$$ 577388585 579573631 582776666 585212290 587040901 589599133 591694832 592884958 594699264
689.4E94699264J750171M81128O11365J018405K54452N47767J630306J321078J232266
$$ 594699264 596449435 596930563 597541928 598560333 598814785 599362552 600992858 602313936 603546202
707.7F03546202K271235K155543J526176K132953K141773J272023J908660K767324
$$ 603546202 605817437 607972980 609499156 611632109 613773882 615045905 616954565 619721889
724F19721889K073229J910746K663672K204597J608074K064108J628757P97570J455426
$$ 619721889 621795118 623705864 626369536 628574133 630182207 632246315 633875072 634672642 636128068
742.4F36128068J851082J138985J475751K059222J334130J233101K003193J609564
$$ 636128068 637979150 639118135 640593886 642653108 643987238 645220339 647223532 648833096
758.7F48833096J129210J788318J645029Q61287J244783J319707J55210j40965P6115
$$ 648833096 649962306 651750624 653395653 654256940 655501723 656821430 656976640 656835675 656911790
777.1F56911790r16659j507998r02176r49681r79483N03898J687527K129316L657281
$$ 656911790 655995131 654487133 653584957 652635276 651655793 652159691 653847218 655976534 659633815
795.4F59633815N085588N129695N544901O075024N064965M142284M150927L153384
$$ 659633815 664719403 669849098 675393999 681469023 686533988 690676272 694827199 697980583
811.7F97980583J778960J630187R12011q84891j632929k193749l966272m876852m528463
$$ 697980583 699759543 701389730 702301741 701416850 699783921 697590172 693623900 688747048 684218585
830.1F84218585m966795n227447m215657l800750l946841l143608k493501k289712
$$ 684218585 679251790 674024343 669808686 666007936 662061095 658917487 656423986 654134274
846.4F54134274o82116J681566L243447N184114P592737Q445859Q531869R263813R001553
$$ 654134274 653452158 655133724 658377171 663561285 671154022 679599881 688131750 697395563 706397116
864.8G06397116P597983O887913O001711M152298L213644K921104J509130K63095n0306
$$ 706397116 713995099 720883012 726884723 731037021 734250665 737171769 738680899 738943994 738893688
883.1G38893688j183868k480864k389610k349556k659440j588702k13861O8009P80999
$$ 738893688 737709820 735228956 732839346 730489790 727830350 726241648 726027787 726095796 726876795
901.5G26876795J793862J367509O31571N31077m99308k138078k852917l591537m607320
$$ 726876795 728670657 730038166 730669737 731200814 730701506 728563428 725710511 722118974 717511654
919.8G17511654m218817l064990k451956j266957K96891N54681M35829R61066P61389
$$ 717511654 713292837 710227847 707775891 706508934 706805825 707360506 707796335 708757401 709518790
938.2G09518790q702O4433l6061r97782j445532j833737l273904m455626n093098o619513
$$ 709518790 709510088 709574521 709538460 708540678 707095146 705261409 701987505 697531879 692438781 685819268
958.6F85819268q320272r231686j0569811j2296200j2948811j2995720j2935579j1690438
$$ 685819268 677498996 668267310 657697499 645401299 632452488 619456768 606521189 594830751
974.9E94830751r729445q442819p299781n954742n373597n144119m375101l801405
$$ 594830751 585101306 576658487 569358706 563403964 558030367 552886248 548511147 544709742
991.2E44709742l631651k980471k294719k210081j933098j566231k080083k891362
$$ 544709742 541078091 538097620 535802901 533592820 531659722 530093491 528013408 525122046
1007.5E25122046l350794m103184m902720m920542m729986m707993m214525l593236
$$ 525122046 521771252 517668068 512765348 507844806 503114820 498406827 494192302 490599066
1023.9D90599066l487617l258496k708584k516240k312809j670212j350433j420855
$$ 490599066 487111449 483852953 481144369 478628129 476315320 474645108 473294675 471873820
1040.2D71873820j220584j106501j427859j540810j349628j216381o31959N47737J489043
$$ 471873820 470653236 469546735 468118876 466578066 465228438 464012057 463380098 463927835 465416878
1058.5D65416878K053619K414018J900732N47946p04706j735449k618849k827793k510816
$$ 465416878 467470497 469884515 471785247 472333193 471628487 469893038 467274189 464446396 461935580
1076.9D61935580k406627k369672k235025k571255l208816l429592l269553k708376
$$ 461935580 459528953 457159281 454924256 452353001 449144185 445714593 442445040 439736664
1093.2D39736664j377612K06590J269996J989037K520889K516001K204448J900345
$$ 439736664 438359052 438565642 439835638 441824675 444345564 446861565 449066013 450966358
1109.5D50966358J259953K70098p69466k258271m223019n127251l673464q88556J289129
$$ 450966358 452226311 452496409 451726943 449468672 445245653 440118402 436444938 435556382 436845511
1127.9D36845511K126426J472205K24590J87129J305371K335817K919435K933622K357036
$$ 436845511 438971937 440444142 440668732 440855861 442161232 444497049 447416484 450350106 452707142
1146.2D52707142J831293J676410J563519J622826K152622K865106L688574M871517
$$ 452707142 454538435 456214845 457778364 459401190 461553812 464418918 468107492 472979009
1162.6D72979009O119669P093489P955551Q565783Q551658Q264541Q000315P389962
$$ 472979009 479098678 486192167 494147718 502713501 511265159 519529700 527530015 534919977
1178.9E34919977O476760N518019M094065K108037J67847j526654k835572l175557
$$ 534919977 541396737 546914756 551008821 553116858 553284705 551758051 548922479 545746922
1195.2E45746922k546429j552463l48866Q78513J458049J333654R93609M04954l96311
$$ 545746922 543200493 541648030 541299164 542177677 543635726 544969380 545962989 546367943 545971632
1213.5E45971632q48889r55522j071513j009882p22646n11766k50041K23934N86868
$$ 545971632 545122743 544167221 543095708 542085826 541363180 540851414 540601373 540825307 541412175
1231.9E41412175Q05318J185060J489162J468003J475751J487017J158833Q13961O55413
$$ 541412175 542217493 543402553 544891715 546359718 547835469 549322486 550481319 551295280 551950693
1250.3E51950693L48389N8413J80065M75049P75934J328885J982808K456963K974809
$$ 551950693 552299082 552357495 552537560 553012609 553788543 555117428 557100236 559557199 562532008
1268.6E62532008L587544L937184M149497M498243M710973M752576M946172N174220
$$ 562532008 566119552 570056736 574206233 578704476 583415449 588168025 593114197 598288417
1284.9E98288417N240381N285680N246222M916429M494369M175544L752470L264845
$$ 598288417 603528798 608814478 614060700 618977129 623471498 627647042 631399512 634664357
1301.2F34664357K955675K656817K259493J994670J821398J519978J295627J329422
$$ 634664357 637620032 640276849 642536342 644531012 646352410 647872388 649168015 650497437
1317.6F50497437J338779J310707J449942J494765J291335J078248Q18312L86656J06573
$$ 650497437 651836216 653146923 654596865 656091630 657382965 658461213 659279525 659666181 659772754
1335.9F59772754J54614J90020J96516M23610N89908N39779N42999M77254J68681j38342
$$ 659772754 659927368 660117388 660313904 660737514 661327422 661867201 662410200 662887454 663056135 662917793
1356.3F62917793m32432r91940j671315j997828j919806j776695j797200k165556k648413
$$ 662917793 662485361 661493421 659822106 657824278 655904472 654127777 652330577 650165021 647516608
1374.7F47516608k320051j322508r28998j119971p52032p4565j56761o37829r88543
$$ 647516608 645196557 643874049 642945051 641825080 641073048 640998483 640841722 640203893 639215350
1393F39215350j448989j896024k336919k853095l037155k939224k881766k740562k335548
$$ 639215350 637766361 635870337 633533418 630680323 627643168 624703944 621822178 619081616 616746068
1411.4F16746068j963615j703799j257062r12130j049936r95278p78258q87692j078308
$$ 616746068 614782453 613078654 611821592 610909462 609859526 608864248 608085990 607198298 606119990
1429.7F06119990j101315j049816p51376l16978k65598j72794J63436N33342P38025
$$ 606119990 605018675 603968859 603217483 602900505 602634907 602462113 602625549 603158891 603896916
1448.1F03896916Q15987R22144J416564L507972N954265N291283M833758O217063P499695
$$ 603896916 604712903 605635047 607051611 610559583 616513848 621805131 626638889 632855952 640355647
1466.4F40355647Q115112J0093332J2746513J1397004Q004009O241799N021870L711879
$$ 640355647 648470759 658564091 671310604 682707608 690711617 696953416 701975286 705687165
1482.8G05687165K406001J192689j25885j409888k293229l036618l774643m207254
$$ 705687165 708093166 709285855 709159970 707750082 705456853 702420235 698645592 694438338
1499.1F94438338m481613m532159m963755o504476o595731n766571n464911m978419
$$ 694438338 689956725 685424566 680460811 673956335 667360604 661594033 656129122 651150703
1515.4F51150703m027962k999008k755642k848625k673924k670288k517283k082646
$$ 651150703 647122741 644123733 641368091 638519466 635845542 633175254 630657971 628575325
1531.7F28575325j904130j897335j382351o13809n77032n75006j41382L38137J038015
$$ 628575325 626671195 624773860 623391509 622777700 622200668 621625662 621484280 621822417 622860432
1550.1F22860432J690447J921177J963198K911866K907991P51913J00434m411n89788
$$ 622860432 624550879 626472056 628435254 631347120 634255111 635007024 635107458 635103047 634513259
1568.4F34513259j387000k196610k910793l908992m580199m936219n495190n873144
$$ 634513259 633126259 630929649 628018856 624109864 619529665 614593446 609098256 603225112
1584.7F03225112o216407o569087o812215o954015p112622p042348o878436o915211
$$ 603225112 597008705 590439618 583627403 576673388 569560766 562518418 555639982 548724771
1601.1E48724771o923616o766141o727218o865621o788313o475509o524622o854832
$$ 548724771 541801155 535035014 528307796 521442175 514653862 508178353 501653731 494798899
1617.4D94798899n982489n307674n502761n318701m853338m305303l375918k419233
$$ 494798899 488816410 483508736 478005975 472687274 467833936 463528633 460152715 457733482
1633.7D57733482j585871q19862k21878N13047J330674K537429L100604K307743L308713
$$ 457733482 456147611 455327749 455105871 455618918 456949592 459487021 462587625 464895368 468204081
1652D68204081N397260L967226L295988M339575N646080O103009N503625O206035P336140
$$ 468204081 473601341 477568567 480864555 485204130 490850210 496953219 502456844 508662879 515999019
1670.4E15999019O614745O817281P577002O807923O324828P572949J0033846Q815110
$$ 515999019 522613764 529431045 537008047 543815970 550140798 557713747 567747593 576562703
1686.7E76562703P110655P522702P238865Q166432R402812R851873J1485040R666979
$$ 576562703 583673358 591196060 598434925 606601357 616004169 625856042 637341082 647008061
1703F47008061Q126378Q319080P380963O620347O179810O082833O587028N685866M065394
$$ 647008061 655134439 663453519 670834482 677454829 683634639 689717472 696304500 701990366 706055760
1721.4G06055760L774465L805220L447115L346086L341674L862024L849208L086329
$$ 706055760 709830225 713635445 717082560 720428646 723770320 727632344 731481552 734567881
1737.7G34567881L339707L747464L895700M161358M461824M960061M898428L904701
$$ 734567881 737907588 741655052 745550752 749712110 754173934 759133995 764032423 767937124
1754G67937124L476739L371477K921998K771438K512454K135456K055168K118588K110958
$$ 767937124 771413863 774785340 777707338 780478776 782991230 785126686 787181854 789300442 791411400
1772.4G91411400J747668J463711J536310J529574J470983J509488J371383J243294
$$ 791411400 793159068 794622779 796159089 797688663 799159646 800669134 802040517 803283811
1788.7H03283811J452982J539707J162052J024008J099110J069486J030147R58800
$$ 803283811 804736793 806276500 807438552 808462560 809561670 810631156 811661303 812620103
1805H12620103Q09133Q11518R28640P68721O25908P55370P65085N88358O48320P76529
$$ 812620103 813429236 814240754 815169394 815938115 816564023 817319393 818084478 818672836 819321156 820097685
1825.4H20097685O68585O72996O82414M74572M12703N36501N16713M84943O48677N73218
$$ 820097685 820766270 821439266 822121680 822596252 823008955 823545456 824062169 824547112 825195789 825769007
1845.8H25769007K78354L48806N19038L99351L17871M27008L80993K36690L26395M37498
$$ 825769007 826047361 826396167 826915205 827314556 827632427 828059435 828440428 828677118 829003513 829441011
1866.2H29441011L71814L28004K91467J62661J42634K58267K36034J95563L01421K78294
$$ 829441011 829812825 830140829 830432296 830594957 830737591 830995858 831231892 831427455 831728876 832007170
1886.6H32007170J33931J54555K17796J46150J40727J98185J01566M5658J71721J78754
$$ 832007170 832141101 832295656 832513452 832659602 832800329 832998514 833100080 833145738 833317459 833496213
1907H33496213P1764J14620J51336P9393J28508J58727o616m2915P0452K5273p3374
$$ 833496213 833567977 833682597 833833933 833913326 834041834 834200561 834193945 834151030 834221482 834246755 834173381
1929.4H34173381P451M2736p9155l3557O3360p6175j72615o8367p7724j59621j06275
$$ 834173381 834180832 834223568 834144413 834110856 834174216 834098041 833925426 833857059 833779335 833619714 833513439
1951.9H33513439j25647k28822j38164l5166j60277j93656p4684j33217k26855j27435
$$ 833513439 833387792 833158970 833020806 832985640 832825363 832631707 832557023 832423806 832196951 832069516
1972.3H32069516q4221j65343j16826o0498j52469j60933p7307j27017j59800r0540
$$ 832069516 831985295 831819952 831703126 831642628 831490159 831329226 831251919 831124902 830965102 830874562
1992.6H30874562j53720k44439j50859j11103k36809j88113o7830j98722l19719k08139
$$ 830874562 830720842 830476403 830325544 830214441 829977632 829789519 829721689 829522967 829203248 828995109
2013H28995109j68205k41935k06292k15113k80499j90258j12772k32220k50578j23680
$$ 828995109 828826904 828584969 828378677 828163564 827883065 827692807 827580035 827347815 827097237 826973557
2033.4H26973557j77979k73764j62363r4831j72615j39892j26481k46048k01524o5148
$$ 826973557 826795578 826521814 826359451 826264620 826092005 825952113 825825632 825579584 825378060 825312912
2053.8H25312912j38759j75953l5644n9962j74761r0956k1518j03831m7982O7771l9160
$$ 825312912 825174153 824998200 824962556 824902594 824727833 824636877 824615359 824511528 824463546 824531317 824492157
2076.3H24492157j08541R835l6418j24216L8922P5638r9123o3598N3287k8014j8478
$$ 824492157 824383616 824393451 824357033 824232817 824271739 824347377 824248254 824184656 824237943 824209929 824191451
2098.7H24191451J14858L2008o8843N3465O6161m7147M0412J02758k622N3286J80483
$$ 824191451 824306309 824338317 824269474 824322939 824389100 824341953 824382365 824485123 824482501 824535787 824716270
2121.1H24716270Q5473M2975J73748J32381L0578J27613J70410R0897J58071K02537
$$ 824716270 824801743 824844718 825018466 825150847 825181425 825309038 825479448 825570345 825728416 825930953
2141.5H25930953N5671M6789K01345J86622J15633J82092J59264P2598J74284K40565
$$ 825930953 825986624 826033413 826234758 826421380 826537013 826719105 826878369 826950967 827125251 827365816
2161.9H27365816R9539J22607K80738J84417R8228K44141K50459J24871J73271K05040
$$ 827365816 827465355 827587962 827868700 828053117 828151345 828395486 828645945 828770816 828944087 829149127
2182.3H29149127R6202J33335K19763J13904P5341J56641Q0168K3007J50383J54555
$$ 829149127 829245329 829378664 829598427 829712331 829787672 829944313 830024481 830047488 830197871 830352426
2202.7H30352426L2484Q0466J37270K8789P510R2149O4373M1068J09314M6194m1544
$$ 830352426 830384910 830465376 830602646 830631435 830638945 830731094 830795467 830836535 830945849 830992043 830950499
2225.2H30950499O2346R3877j4484J7107O5505n4478n9843Q2791L3915o3479J0311
$$ 830950499 831012845 831106722 831092238 831109345 831174850 831120372 831060529 831143320 831177235 831113756 831124067
2247.6H31124067j2576j29283p1287J19p4207o6460L7074r417n3704N2691N5313j3054
$$ 831124067 831111491 830982208 830910921 830911040 830836833 830770373 830807447 830798030 830744326 830797017 830852330 830839276
2272.1H30839276L8803K9445n9367N1737J96934J08421K8550R3937M6134p5578j8597
$$ 830839276 830878079 830907524 830848157 830899894 831096828 831205249 831233799 831327736 831373870 831298292 831279695
2294.5H31279695M2498j7524n36J2577j12176j33574j9730p152N722O5088m6253k10047
$$ 831279695 831322193 831304669 831304133 831316710 831204534 831070960 831051230 831044078 831049800 831114888 831068635 830858588
2319H30858588j27971N3287N2332L517K802o8486j14322q8036l9697J22786K72274
$$ 830858588 830730617 830783904 830836236 830839753 830842555 830774069 830659747 830571711 830532014 830654800 830927074
2341.4H30927074L29018M84228M04119m9770m09245l78728j81198j71364j18792J39058
$$ 830927074 831256092 831740320 832144439 832094669 831685424 831306696 831125498 830954134 830835342 830974400
2361.8H30974400L44694N02169O05047N21957M28141M76360N18262M65274M06563L72291
$$ 830974400 831319094 831821263 832426310 832948267 833376408 833852768 834371030 834836304 835242867 835615158
2382.2H35615158K82705J67966J15990M5181j4544L3677N0187r000J2159N8711J1146
$$ 835615158 835897863 836065829 836181819 836227000 836212456 836246133 836296320 836287320 836299479 836358190 836369336
2404.6H36369336o020K2053m2438j10030n4241k4020r4474r3579l9697p6234j26839
$$ 836369336 836363316 836385369 836342931 836232901 836178660 836154640 836060166 835966587 835926890 835850656 835723817
2427.1H35723817j13845j14202j28806j18553j28329j25945o7353n6565j17361j36257
$$ 835723817 835609972 835495770 835366964 835248411 835120082 834994137 834926784 834870219 834752858 834616601
2447.5H34616601j36137j81436j90675j26303j07228j41383j22249j07824j57118j69278
$$ 834616601 834480464 834299028 834108353 833982050 833874822 833733439 833611190 833503366 833346248 833176970
2467.9H33176970j38044j47879j81317j87636j81734j92404j76072j24574j29342j77026
$$ 833176970 833038926 832891047 832709730 832522094 832340360 832147956 831971884 831847310 831717968 831540942
2488.3H31540942j99139k10166j88529j40667j51277j87457j91688k11775k28405j78814
$$ 831540942 831341803 831131637 830943108 830802441 830651164 830463707 830272019 830060244 829831839 829653025
2508.7H29653025j17719j32740j81139j94728j94788j95205j76132j55449j62184j69933
$$ 829653025 829535306 829402566 829221427 829026699 828831911 828636706 828460574 828305125 828142941 827973008
2529H27973008j60336j66297j84477j75178j68204j65820j38700j42098j81615k07245
$$ 827973008 827812672 827646375 827461898 827286720 827118516 826952696 826813996 826671898 826490283 826283038
2549.4H26283038j91629j77920j91629j76132k01642k47717j86265j70171k71678k89321
$$ 826283038 826091409 825913489 825721860 825545728 825344086 825096369 824910104 824739933 824468255 824178934
2569.8H24178934k60293l02554k97010k52544k99931l38972l05056l62933m48406l83377
$$ 824178934 823918641 823616087 823319077 823066533 822766602 822427630 822122574 821759641 821311235 820927858
2590.2H20927858l44157m23908m26293l98278m82678n10991m08172m13299n05090m51684
$$ 820927858 820583701 820159793 819733500 819335222 818852544 818341553 817933381 817520082 817014992 816563308
2610.6H16563308m10497n10871n14627m39405m67241m96209m80175n27262n68331n04255
$$ 816563308 816152811 815641940 815127313 814687908 814220667 813724458 813244283 812717021 812148690 811644435
2631H11644435m62532m91798m57823m31300m89652m54843l77416m56512m90070l81589
$$ 811644435 811181903 810690105 810232282 809800982 809311330 808856487 808479071 808022559 807532489 807150900
2651.4H07150900m15623n35726m97520m50254m91381m44412l94046m84407m95791l81828
$$ 807150900 806735277 806199551 805702031 805251777 804760396 804315984 803921938 803437531 802941740 802559912
2671.8H02559912l94702m41491l65436l93153n18918m78685m17590m86970m39763l61025
$$ 802559912 802165210 801723719 801358283 800965130 800446212 799967527 799549937 799062967 798623204 798262179
2692.2G98262179n05447n82219m56988m81189o01053n32269n14985o84619p01010n94318
$$ 798262179 797756732 797174513 796717525 796236336 795635283 795103014 794588029 793903410 793202400 792608082
2712.6G92608082o42538o80089o12378o72042p47085o41584n87046o26207n27382m53531
$$ 792608082 791965544 791285455 790673077 790001035 789253950 788612366 788025320 787399113 786871731 786418200
2733G86418200n46337n42163m55261n06878n27262m41671n16116o22094n27084n25057
$$ 786418200 785871863 785329700 784874439 784367561 783840299 783398628 782882512 782260418 781733334 781208277
2753.4G81208277o98447p03991o23107o96719p11321o34492p14779q05795p65324q03887
$$ 781208277 780509830 779805839 779182732 778486013 777774692 777140200 776425421 775619626 774854302 774050415
2773.8G74050415q89063q66354r20653j043737r58920q48114r86695j092315j032949
$$ 774050415 773161352 772294998 771374345 770330608 769371688 768523574 767536879 766444564 765411615
2792.2G65411615j099527j193761j133800j201033j384020j366735j326442j442670
$$ 765411615 764312088 763118327 761984527 760783494 759399474 758032739 756706297 755263627
2808.5G55263627j491011j505494j682937j841545j857221j974166k175092k311707
$$ 755263627 753772616 752267122 750584185 748742640 746885419 744911253 742736161 740424454
2824.8G40424454k603590l080786l504753m050731m958809o061077p369876r007633
$$ 740424454 737820864 734740078 731235325 727184594 722225785 716164708 708794832 699787199
2841.1F99787199j0714650j2340128j3693094j3716877j1241555o449640q83519L572702
$$ 699787199 689072549 676732421 663039327 649322450 638080895 631631255 630747736 634320438
2857.4F34320438N608678N183816L378331J274407m72903j202285n85497O51598J426816
$$ 634320438 639929116 645112932 648491263 649765670 649292767 648090482 647504985 648156583 649583399
2875.8F49583399J388669O44207n79297j812220k801418l667653m329979m640937m810929
$$ 649583399 650972068 651616275 651036978 649224758 646423340 642755687 638425708 633784771 628973842
2894.1F28973842m993499n106270n222142n511939n999983o739497p874787r374201
$$ 628973842 623980343 618874073 613651931 608139992 602140009 595400512 587525725 578151524
2910.4E78151524j1066556j2682140j3494253j2761116j0481834o958783k554178J943826
$$ 578151524 567084968 554402828 540908575 528147459 517665625 510706842 508152664 510096490
2926.8E10096490N614221Q078754R585083J0360420J0445416R901583Q675218O742715
$$ 510096490 515710711 523789465 533374548 543734968 554180384 564081967 572757185 579499900
2943.1E79499900M401446K016782Q35j044810r19998J41025J846135L685534N191683
$$ 579499900 583901346 585918128 585918963 584874153 583954155 584095180 585941315 589626849 594818532
2961.4E94818532O304801P141650P562458P389367O858051O194651N374610M595459
$$ 594818532 601123333 608264983 615827441 623216808 630074859 636269510 641644120 646239579
2977.8F46239579M007756L398955K824724K471507K158522J795292J426458R76444
$$ 646239579 650247335 653646290 656471014 658942521 661101043 662896335 664322793 665299237
2994.1F65299237N39839K24292m1067k73109m41551n01811m79341m50254m43339n37157
$$ 665299237 665839076 666063368 666022301 665749192 665307641 664805830 664326489 663876235 663432896 662895739
3014.5F62895739p04050p82728q32141r74118j106263j161336j211465j243174j215696
$$ 662895739 662191689 661408961 660576820 659602702 658496439 657335103 656123638 654880464 653664768
3032.8F53664768j282931j452446j493632j483381j577556j677454j743972j762450
$$ 653664768 652381837 650929391 649435759 647952378 646374822 644697368 642953396 641190946
3049.1F41190946j706183j660645j685798j768589j757562j592100j480281j430810
$$ 641190946 639484763 637824118 636138320 634369731 632612169 631020069 629539788 628108978
3065.5F28108978j406014j538932j623988j483202j321614j266360j354039j512825
$$ 628108978 626702964 625164032 623540044 622056842 620735228 619468868 618114829 616602004
3081.8F16602004j582742j560688j516938j551986j645029j655280j632572j636445
$$ 616602004 615019262 613458574 611941636 610389650 608744621 607089341 605456769 603820324
3098.1F03820324j642823j724005j803875j762152j770019j917899j955807j849115
$$ 603820324 602177501 600453496 598649621 596887469 595117450 593199551 591243744 589394629
3114.4E89394629j868665k022505k187490k340138k391339k300381k220929k262056
$$ 589394629 587525964 585503459 583315969 580975831 578584492 576284111 574063182 571801126
3130.7E71801126k322793k356350k377391k378404k461315k586186k589285k535760
$$ 571801126 569478333 567121983 564744592 562366188 559904873 557318687 554729402 552193642
3147E52193642k516806k509654k576351k715945k782226k759039k721370k716005k757430
$$ 552193642 549676836 547167182 544590831 541874886 539092660 536333621 533612251 530896246 528138816
3165.4E28138816k779185k747417k717078k730906k781391k781093k723515k740681
$$ 528138816 525359631 522612214 519895136 517164230 514382839 511601746 508878231 506137550
3181.7E06137550k782226k745926k686590k681583k735228k744346k713651k708524
$$ 506137550 503355324 500609398 497922808 495241225 492505997 489761651 487048000 484339476
3198D84339476k678603k634049k623409k607316k579838k553731k504378k459079k474249
$$ 484339476 481660873 479026824 476403415 473796099 471216261 468662530 466158152 463699073 461224824
3216.4D61224824k516746k491534k436876k441705k443254k374828k293020k259642
$$ 461224824 458708078 456216544 453779668 451337963 448894709 446519881 444226861 441967219
3232.7D41967219k279937k295196k243877k171576k123624k070725k051383k109438
$$ 441967219 439687282 437392086 435148209 432976633 430853009 428782284 426730901 424621463
3249D24621463k116680j998902j925289j966477j957953j886219j844108j829356j815736
$$ 424621463 422504783 420505881 418580592 416614115 414656162 412769943 410925835 409096479 407280743
3267.4D07280743j757383j720131j763940j823961j837760j786143j733691j743525
$$ 407280743 405523360 403803229 402039289 400215328 398377568 396591425 394857734 393114209
3283.7C93114209j766443j709282j605183j599223j706481j776069j750320j721204
$$ 393114209 391347766 389638484 388033301 386434078 384727597 382951528 381201208 379480004
3300C79480004j695662j643539j668155j778066j871050j913577j884222j820773j805335
$$ 379480004 377784342 376140803 374472648 372694582 370823532 368909955 367025733 365204960 363399625
3318.4C63399625j843542j855969j810194j834124j943529j973241j911759j844198
$$ 363399625 361556083 359700114 357889920 356055796 354112267 352139026 350227267 348383069
3334.7C48383069j802087j861632j992941k021998j970678j894474j808465j874775
$$ 348383069 346580982 344719350 342726409 340704411 338733733 336839259 335030794 333156019
3351C33156019k050548k107144j990795j862436j884699j938135j791417j612574j711250
$$ 333156019 331105471 328998327 327007532 325145096 323260397 321322262 319530845 317918271 316207021
3369.3C16207021j927435j923293j729995j539051j377821j297713j244336j116544
$$ 316207021 314279586 312356293 310626298 309087247 307709426 306411713 305167377 304050833
3385.7C04050833r24677p23064p43627r31800q65012n30541l39270n42074q10474o34611
$$ 304050833 303126156 302403092 301659465 300727665 299862653 299332112 298992842 298450768 297640294 297005683
3406.1B97005683k63870j29580j45614j63079j30414r001J05143J64896L00556N05865
$$ 297005683 296741813 296612233 296466619 296303540 296173126 296164125 296269268 296434164 296734720 297240585
3426.5B97240585O93709P47949P68304Q79913Q48860O93172P19607R36836J202136
$$ 297240585 297934294 298682243 299450547 300330460 301179320 301872492 302592099 303528935 304731071
3444.8C04731071J390845J384049J383126J516134J639336J737058J846999J844883
$$ 304731071 306121916 307505965 308889091 310405225 312044561 313781619 315628618 317473501
3461.1C17473501J833409K064079K276212K063304J683355J711040K008111K232790
$$ 317473501 319306910 321370989 323647201 325710505 327393860 329104900 331113011 333345801
3477.4C33345801K306938K183229K097100K241015K349138K292127K307623K439291
$$ 333345801 335652739 337835968 339933068 342174083 344523221 346815348 349122971 351562262
3493.8C51562262K562701K558172K529562K615869K586841K411753K482027K746433
$$ 351562262 354124963 356683135 359212697 361828566 364415407 366827160 369309187 372055620
3510.1C72055620K907306K882779K755105K779365K990067L241479L209353K969086
$$ 372055620 374962926 377845705 380600810 383380175 386370242 389611721 392821074 395790160
3526.4C95790160K987504L167033L292888L491491L568292L355771L388018L738254
$$ 395790160 398777664 401944697 405237585 408729076 412297368 415653139 419041157 422779411
3542.7D22779411L914177L721983L475934L586888L856242L881007L882647M077256
$$ 422779411 426693588 430415571 433891505 437478393 441334635 445215642 449098289 453175545
3559D53175545M171163M026323M204363M948973N009056M381179M286260M633307M905850
$$ 453175545 457346708 461373031 465577394 470526367 475535423 479916602 484202862 488836169 493742019
3577.4D93742019N101919N198270N134583N327940N786836N641639N179167N434990
$$ 493742019 498843938 504042208 509176791 514504731 520291567 525933206 531112373 536547363
3593.7E36547363N864203N855799N852520N878031N632818N589306O177605O481885
$$ 536547363 542411566 548267365 554119885 559997916 565630734 571220040 577397645 583879530
3610E83879530O202162N924880N671442O097793O675780N973757N058228N167544O673217
$$ 583879530 590081692 596006572 601678014 607775807 614451587 620425344 625483572 630651116 637324333
3628.4F37324333P158220N631268N208194N401552N263686N172730M970014M612803
$$ 637324333 644482553 650113821 655322015 660723567 665987253 671159983 676129997 680742800
3644.7F80742800M815281N849898N711555M005373L575503M345775M179955L547310
$$ 680742800 685558081 691407979 697119534 701124907 704700410 709046185 713226140 716773450
3661G16773450L359914L231466L125191L412068L389060K713859K856791K916873K285897
$$ 716773450 720133364 723364830 726490021 729902089 733291149 736005008 738861799 741778672 744064569
3679.4G44064569K225101K318740K253652K515912K571285J880228J468957J489103
$$ 744064569 746289670 748608410 750862062 753377974 755949259 757829487 759298444 760787547
3695.7G60787547J489937J506269J632869J554370J280427J188755J330495J424313
$$ 760787547 762277484 763783753 765416622 766970992 768251419 769440174 770770669 772194982
3712G72194982J160085Q56042Q13067Q83698Q67367P83026P13587P10964Q19802R63927
$$ 772194982 773355067 774211109 775024176 775907874 776775241 777558267 778271854 778982818 779802620 780766547
3732.4G80766547J011371R27747N99920J86921J92344O55770O98865M57942N66006
$$ 780766547 781777918 782705665 783305585 783492506 783684850 784340620 785039485 785497427 786063433
3750.7G86063433N56886L95596L71396M38512M54187M13537M18186L94583M22120M09186
$$ 786063433 786620319 787015915 787387311 787825823 788280010 788693547 789111733 789506316 789928436 790337622
3771.1G90337622K43843K24709L99709M61757L05474J91450K12670K58326L15249L08692
$$ 790337622 790581465 790806174 791205883 791667640 791973114 792164564 792377234 792635560 792950809 793259501
3791.5G93259501K25962K43902K34306J70529K78294K79128J72675J93357J61052J04725
$$ 793259501 793485463 793729365 793963671 794134200 794412494 794691622 794864297 795057654 795218706 795323431
3811.9G95323431J93656L62456K70188R2506J01686L7193M17N4062J13904J93179K65598
$$ 795323431 795517087 795879543 796149731 796242237 796343923 796381116 796381533 796435595 796549499 796742678 797008276
3834.4G97008276L23474K06709M530O855N8889j5855p9691m3988J09315K93314J50800
$$ 797008276 797331750 797538459 797542989 797549844 797608733 797592878 797513187 797469199 797578514 797871828 798022628
3856.8G98022628n2810l1710J32204J35660r5785o7592J49668J00672N3882L7194K1398
$$ 798022628 797969818 797938108 798070312 798205972 798110187 798042595 798192263 798292935 798346817 798384011 798405409
3879.2G98405409N1439L8087J24931J05262k5928j5437p9692j39177K7895J42098O5267
$$ 798405409 798456848 798494935 798619866 798725128 798699200 798683763 798604071 798464894 798492789 798634887 798700154
3901.7G98700154L1352n484q0764p3075l8684n9068m7684M3393P1287m411m649J5378
$$ 798700154 798731506 798726022 798645258 798572183 798533499 798474431 798426747 798470140 798541427 798537016 798532367 798547745
3926.1G98547745m6492l2544L2961N4360K5749k3127L0697J57058J78576P5042r954
$$ 798547745 798501253 798468709 798501670 798556030 798581779 798558652 798589349 798746407 798924983 799000025 798990071
3948.6G98990071o7473j09672l517J46330J19328K6166K3306N3346P3910J24872J07288
$$ 798990071 798922598 798812926 798809409 798955739 799075067 799101233 799124539 799177885 799251795 799376667 799483955
3971G99483955m530m888R2864J25885J10984J13726N9903m7863j8835J00851J35541
$$ 799483955 799479425 799474537 799567401 799693286 799804270 799917996 799977899 799930036 799911201 800012052 800147593
3993.4H00147593J13904J08362
$$ 800147593 800261497 800369859
3997.5H00369859
$$ 800369859
##END=$$ End of the data block
