##TITLE=$$ Begin of the data block
##JCAMP-DX=5.00 $$ ACD/SpecManager v 10.08
##SPECTROMETER/DATA SYSTEM=Alpha
##DATE=10 Apr 2014 11:00:52
##DATA TYPE=INFRARED SPECTRUM
##DATA CLASS=XYDATA
##ORIGIN=
##OWNER=
##NPOINTS=1765
##FIRSTX=399.75695801
##LASTX=3997.56933594
##MAXX=3997.56933594
##MINX=399.75695801
##MAXY=0.84981054
##MINY=0.27226520
##XFACTOR=1.0000000000
##YFACTOR=1.000000000000000e-9
##FIRSTY=0.62607610
##DELTAX=2.03957629
##XUNITS=1/CM
##YUNITS=ARBITRARY UNITS
##XYDATA=(X++(Y..Y))
399.8F26076102k723932j870453k078176q27432J25885j113593j601994j86265p8141
418.1F15722001j312316o10947n45145j354515p63416l01063j005233r50694n34236
436.5F08344436q09551l88443L73304k79606r97722k16305J3053q73386m73082K13027
456.9F04905725r10402j428306o00815n74767r63152n74350p18534j563311j059413
475.2E96512675m51386j001119r26376k39551m33743o49392k06948n11706j416981
493.6E90675473j279235p60197q66354r05096p69198j029611j061082o10590q44240
511.9E82549870j435399j157463r36269j505554j449824r11593j421094j967132j314640
530.3E70450902j042724j445293j134634o29246q71122q64983m36604p61628j227796
$$ plain form
399.8 626076102 623352170 621481717 619403541 618576109 618701994 617588401 615986407 615800142 615722001
418.1 615722001 614409685 613798738 613253593 611899078 611135662 610834599 609829366 608878672 608344436
436.5 608344436 607534885 607146442 607519746 607240140 606242418 606026113 606039166 605165780 604692698 604905725
456.9 604905725 603995323 602567017 601966202 601391435 600428283 599853933 599135399 597572088 596512675
475.2 596512675 596061289 595060170 594133794 593894243 593460500 592811108 592604160 592092454 590675473
493.6 590675473 589396238 588636041 587769687 586864591 586095393 585065782 584004700 583394110 582549870
511.9 582549870 581114471 579957008 579020739 577515185 576065361 575153768 573732674 571765542 570450902
530.3 570450902 569408178 567962885 566828251 566199005 565327883 564462900 564026296 563264668 562036872
548.6E62036872r13501p57217j194179j425386j468122j783192j912475j729190j984477
567E48869133k535880k476871k206444k451539k440095j948178k022326k203107j770854
585.4E28813839j595140j941621j966238j721740j754701j800418j831710k323508
601.7E13878763k703786k027214j108408q10444o55651l24726K22265J486838L207028
620E11164665M087389M084229M147947M183233L715694L472984L521919L060996K427876
638.4E43866932K031684J263261Q46505K083719L270745K324522L77595m23610R65655
656.7E56607008L938019O072343N779564M057586L385902M037678L177464K659500
673.1E89715064L181219L157198K448440K356052K585530K136052J758516J956820
$$ plain form
548.6 562036872 561123371 560366154 559171975 557746589 556278467 554495275 552582800 550853610 548869133
567 548869133 546333253 543856382 541649938 539198399 536758304 534810126 532787800 530584693 528813839
585.4 528813839 527218699 525277078 523310840 521589100 519834399 518033981 516202271 513878763
601.7 513878763 511174977 509147763 508039355 507228911 506573260 506248534 506470799 507957637 511164665
620 511164665 515252054 519336283 523484230 527667463 531383157 534856141 538378060 541439056 543866932
638.4 543866932 545898616 547161877 548008382 550092101 553362846 555687368 556064963 555641353 556607008
656.7 556607008 560545027 566617370 572396934 576454520 579840422 583878100 587055564 589715064
673.1 589715064 592896283 596053481 598501921 600857973 603443503 605579555 607338071 609294891
689.4F09294891J739562J132727J123249J116097O79612Q33631J482248J537502J457393
707.7F20396912J960218K177715J895011K083599K349377K060473K188683K731382
724F37843370K485812J920283K208590K469183J873552J599133J914263J759112J418710
742.4F55492008J737237J940429J606226J658142J920342J669526J609504J995802
758.7F69629216J836539J388430J522303J594186J138210J000285J017272L74675l31700
777.1F79169416m98831q59141j378715j053214l35336N2035R47833K563834L630757
795.4F82238638M260242N302608N884946N492091N105436M757881L794074K943873
811.7G19779789K679229J930893N97119k23517r82464k398312l440022l792286m405797
$$ plain form
689.4 609294891 611034453 612167180 613290429 614406526 615086138 615919769 617402017 618939519 620396912
707.7 620396912 622357130 624534845 626429856 628513455 630862832 632923305 635111988 637843370
724 637843370 640329182 642249465 644458055 646927238 648800790 650399923 652314186 654073298 655492008
742.4 655492008 657229245 659169674 660775900 662434042 664354384 666023910 667633414 669629216
758.7 669629216 671465755 672854185 674376488 675970674 677108884 678109169 679126441 679501116 679169416
777.1 679169416 678670585 677811444 676432729 675379515 675044179 675096214 676044047 678607881 682238638
795.4 682238638 686498880 691801488 697686434 703178525 708283961 713041842 716835916 719779789
811.7 719779789 722459018 724389911 724987030 724763513 723781049 721382737 717942715 714150429 709744632
830.1G09744632m894793m487395m034579m110634l990531l535390l209710k483130
846.4F78998470r03785Q28505K605140M929483P007420P945716Q518636R072185Q759022
864.8G27760792P895350P251144O161332M540622L613770L101230J928448P53344J02639
883.1G63108671q72195j933456k120256j974106k038657j478792k72989M91321R72748
901.5G53882289J648545J713038J023233N40137j967j365662k731442l375769l935694
919.8G47396708m252077l470480k229989j304268j94192Q46862R00507N67317O68943
938.2G38929331N54562L2186j08838k64108j149654k063453k748847l968418n389452
956.6G23823309o333172p476211r253442j0878325j2202620j3669551j4586746j4233828
$$ plain form
830.1 709744632 704849839 700362444 696327865 692217231 688226700 684691310 681481600 678998470
846.4 678998470 678094685 678923190 681528330 686457813 693465233 701410949 709929585 719001770 727760792
864.8 727760792 735656142 742907286 749068618 753609240 757223010 760324240 762252688 763006032 763108671
883.1 763108671 762236476 760303020 758182764 756208658 754170001 752691209 752418220 752909541 753882289
901.5 753882289 755530834 757243872 758267105 758807242 758805275 757439613 754708171 751332402 747396708
919.8 747396708 743144631 739674151 737444162 736139894 735945702 736792564 737693071 738260388 738929331
938.2 738929331 739483893 739516079 739407241 739143133 737993479 735930026 733181179 729212761 723823309
956.6 723823309 717490137 710013926 700760484 689882159 677679539 664009988 649423242 635189414
972.9F35189414j3184369j1862218j0129034q509458p557749o872535o115019n562425
989.2E65396607n056202m252375l544747l126503k571284k063036k159000k667904
1005.5E39955556l300786m253924n328714n897224o013573o049871n741894n077988
1021.8D98291582m672915m468381m018724l578186l337622k958834k483517k268672
1038.1D70504731k108693j800955j713275j935184k068073k013534j788050j012117
1054.5D56064850K82884J403630K007633K124518J449883m6968j686842k982914l922463
1072.8D54694211m321724m078626l727079l608167l580600l787845m326642m638672
1089.1D22624856m280478l327697j957983m47839P36624J288473J451373J419723J073510
$$ plain form
972.9 635189414 622005045 610142827 600013793 591504335 583946586 577074051 570959032 565396607
989.2 565396607 560340405 556088030 552543283 549416780 546845496 544782460 542623460 539955556
1005.5 539955556 536654770 532400846 527072132 521174908 515161335 509111464 503369570 498291582
1021.8 498291582 493618667 489150286 485131562 481553376 478215754 475256920 472773403 470504731
1038.1 470504731 468396038 466595083 464881808 462946624 460878551 458865017 457076967 456064850
1054.5 456064850 456347734 457751364 459758997 461883515 463333398 463286430 461599588 458616674 454694211
1072.8 454694211 450372487 446293861 442566782 438958615 435378015 431590170 427263528 422624856
1089.1 422624856 418344378 415016681 413058698 412610859 413347483 414635956 416087329 417507052 418580562
1107.5D18580562N30720q136p60883j989902l593772n252809n958527m346579j210600
1125.8C95990074R28223J473546J133412M60684N38975J740843L054858L524750L219485
1144.2D12064850K731353K303958J924724J837820K136170K555341L095478L958344
1160.5D32608038N045295O181508P390946Q471609R026974R089410Q944631Q530259
1176.8D95288670P864952P219374O462932N267441L781438K280533O94395p00713j317978
1195.2E26841044j218020o58870M70936J845598K734959L008485K907574K380729J565457
1213.5E39877892J071512R86040Q66115Q05020J028359J255632J412630J765072K164960
1231.9E51233232K339840K496362K743840K735615K490401K344906K062500J462221
$$ plain form
1107.5 418580562 419111282 419103146 418342263 416352361 412758589 407505780 401547253 397200674 395990074
1125.8 395990074 396918297 398391843 399525255 399985939 400524914 402265757 405320615 408845365 412064850
1144.2 412064850 414796203 417100161 419024885 420862705 422998875 425554216 428649694 432608038
1160.5 432608038 437653333 443834841 451225787 459697396 468724370 477813780 486758411 495288670
1176.8 495288670 503153622 510372996 516835928 522103369 525884807 528165340 528859735 528159022 526841044
1195.2 526841044 525623024 524964154 525435090 527280688 530015647 533024132 535931706 538312435 539877892
1213.5 539877892 540949404 541935444 542801559 543606579 544634938 545890570 547303200 549068272 551233232
1231.9 551233232 553573072 556069434 558813274 561548889 564039290 566384196 568446696 569908917
1248.2E69908917R90450P78795N14567L69429O66082J133502J604676K329528L131449
1266.6E81427395L611267M034996M630923N021692N160033N390644N629182N640686
1282.9F20546818N720913O013930O038010N753219N597592N372524M819155M357814
1299.2F64219975M104972L629804L066421K809584K527177J964033J605868J555443
1315.5F85483277J371741J224816J419127J526535J390993J364946J282573Q62897
1331.8F95926905N01513M43340K25067j47105L0876M51922N11587N22434O38426M61995
1352.2F99566960J16408R537o8009n28276j215041j484215j410007j428426j238703
1370.6F92320228j321733j970828j957655j668930k285361k707780j634299m01557
$$ plain form
1248.2 569908917 570899367 571678162 572192729 572562158 573228240 574361742 575966418 578295946 581427395
1266.6 581427395 585038662 589073658 593704581 598726273 603886306 609276950 614906132 620546818
1282.9 620546818 626267731 632281661 638319671 644072890 649670482 655043006 659862161 664219975
1299.2 664219975 668324947 671954751 675021172 677830756 680357933 682321966 683927834 685483277
1315.5 685483277 686855018 688079834 689498961 691025496 692416489 693781435 695064008 695926905
1331.8 695926905 696428418 696871758 697096825 696949720 696980596 697432518 697944105 698466539 699104965 699566960
1352.2 699566960 699683368 699692905 699624896 699096620 697881579 696397364 694987357 693558931 692320228
1370.6 692320228 690998495 689027667 687070012 685401082 683115721 680407941 678773642 678372085
1386.9F78372085l10182l47198m59015j155317j743316k211333k522468k696932l136396
1405.3F63789928l112197k809703k595365k056599j421452j456678j919627j425504
1421.6F46992803r65536q08597m49419o03199n93364J07110J94847n8472N63204J155615
1442F45534992J290024J522719J964987K335310K735138L577768N148173O123900N290926
1460.3F75523937N410671O487370O983757P048964Q003414R455442Q682549O618381
1476.6G34214485N186140M182160L551960K806485J867413O64294n00083q14557j054168
1495G50104129k046346k905667k653659j758277k262413o063045o140649l920019l495037
1513.4G18859017l440499l108979k475321l044903l095746k306462k490401j971781
$$ plain form
1386.9 678372085 678061903 677714705 677255690 676100373 674357057 672145724 669623256 666926324 663789928
1405.3 663789928 660677731 657868028 655272663 653216064 651794612 650337934 648418307 646992803
1421.6 646992803 646027267 645218670 644769251 644166052 643572688 643679798 643874645 643816173 644379377 645534992
1442 645534992 646825016 648347735 650312722 652648032 655383170 658960938 664109111 670233011 675523937
1460.3 675523937 680934608 687421978 694405735 701454699 709458113 718913555 727596104 734214485
1476.6 734214485 739400625 743582785 747134745 749941230 751808643 752472937 751972854 751158297 750104129
1495 750104129 748057783 745152116 742498457 740740180 738477767 732414722 726274073 722354054 718859017
1513.4 718859017 715418518 712309539 709834218 706789315 703693569 701387107 698896706 696924925
1529.7F96924925j414895j918078j346707k26676j033903k281844j435995m43697J97768
1548F87020898L91662Q12590J481295J750827M45544j573205p66694o75321j135528
1566.4F87752068k188027l918230l526986l739715o835878p164120n884409o546676
1582.7F47948027p379353p669807p834673q158922q267403q232951q122325p931471
1599E84351122p821798p721186p523238p464588p627785p307112o452144o989777q600175
1617.4E16843319o516397m935086n892277n737245m962653m217505k537310j705706
1633.7D80339140k302140j284421N39929J560300K379835L177613L847033L927737
1650D92185026M581482N906164N293906N291879O121099O949127P381678P092595P635414
$$ plain form
1529.7 696924925 695510030 693591952 692245245 692018569 690984666 688702822 687266827 686823130 687020898
1548 687020898 687412560 688225150 689706445 691457272 691902816 690329611 689562917 688887596 687752068
1566.4 687752068 685564041 681645811 678118825 674379110 667543232 660379112 654494703 647948027
1582.7 647948027 640568674 632898867 625064194 616905272 608637869 600404918 592282593 584351122
1599 584351122 576529324 568808138 561284900 553820312 546192527 538885415 532433271 525443494 516843319
1617.4 516843319 510326922 505391836 499499559 493762314 488799661 484582156 482044846 480339140
1633.7 480339140 478037000 476752579 477292508 478852808 481232643 484410256 488257289 492185026
1650 492185026 496766508 502672672 507966578 513258457 519379556 526328683 533710361 540802956 548438370
1668.4E48438370Q603335Q038997Q133531Q733988Q399665Q334577R055317J0738313
1684.7F18476093R551227Q119106Q445263Q231998Q975327R779572R645462J0584712
1701F91808760Q678138P286430P408202O460964N635143N489826N493641M930734L866077
1719.3G47057915L517985L385604L154337L167570L414988L207982K950310K880454
1735.7G72737145K708137K864898L266453L498137L464044L589749L645956L089548
1752G98864067K626419K779364K672553K118945J947463J932144J751304J702785J812339
1770.3H18207383J375199Q86917J165449J398325J134813J009524J181245J093447
1786.7H27452302J087069J289726J067221O43611Q37505J022279P05659M96149P29144
$$ plain form
1668.4 548438370 557041705 565080702 573214233 581948221 590347886 598682463 607737780 618476093
1684.7 618476093 628027320 636146426 644591689 652823687 661799014 671578586 681224048 691808760
1701 691808760 700486898 707773328 715181530 721642494 727277637 732767463 738261104 743191838 747057915
1719.3 747057915 750575900 753961504 757115841 760283411 763698399 766906381 769856691 772737145
1735.7 772737145 775445282 778310180 781576633 785074770 788538814 792128563 795774519 798864067
1752 798864067 801490486 804269850 806942403 809061348 811008811 812940955 814692259 816395044 818207383
1770.3 818207383 819582582 820469499 821634948 823033273 824168086 825177610 826358855 827452302
1786.7 827452302 828539371 829829097 830896318 831539929 832377434 833399713 834105372 834601521 835330665
1805H35330665Q10623O26564N57721N14388L99947M16398O03795O44148N55873N93602
1825.4H41053724O24955L19004J24574L88086M12643K46763M15265O31392L64662Q9228
1845.8H44670296J94490J87814J70410L13460L55065J90854J68741L31879M07755L84689
1866.2H47375453K45094m3750q8572J34885K54154J51098O9558J57178J80244J53542
1886.6H48588884K00808J65701M77p3195P5936J28627J5617J00493K23696N3525p5936
1909H49404633L4928M2797L4987J67370J25826r2447j11282P451q4281j44542O0201
1931.5H49445641L9578j92345o8903J42515n6922k42710q5414j19686k68817j06275
1951.9H48486662j6153k15888k08437m8280j74463k35021o2823j45913l19361j55866
$$ plain form
1805 835330665 836141288 836767852 837325573 837839961 838239908 838656306 839260101 839904249 840460122 841053724
1825.4 841053724 841678679 841997683 842122257 842510343 842922986 843169749 843585014 844216406 844581068 844670296
1845.8 844670296 844864786 845052600 845223010 845536470 845891535 846082389 846251130 846583009 846990764 847375453
1866.2 847375453 847620547 847576797 847488225 847623110 847877264 848028362 848097920 848255098 848435342 848588884
1886.6 848588884 848789692 848955393 848955870 848882675 848958611 849087238 849102855 849203348 849427044 849480569 849404633
1909 849404633 849439561 849482358 849517345 849684715 849810541 849718094 849606812 849614263 849529982 849385440 849445641
1931.5 849445641 849485219 849292874 849223971 849366486 849309564 849066854 848981440 848861754 848592937 848486662
1951.9 848486662 848470509 848254621 848046184 847997904 847823441 847588420 847525597 847379684 847060323 846904457
1972.3H46904457j3292j86086k29776m5895j03653k62439j12116J7106j49906k44379
1992.6H45574021j54137j92941k58624j35958j28269k76506k40922j38820k27153k44677
2013H43576014r3341j66535l52383k67863j57356k48969k37405r7156j37567k43903
2033.4H41573536j97470j75416k37823j79112j11580j87933k20001j29998j06394j62661
2053.8H39865148j53243j10984j38820j44898o8188r9838j88410j04368j7643j06275
2074.2H38732481j30355l3677m3690j09017n7638j1503r6977j23084l9160l7313q2373
2096.7H37967694k444O4850l0100q0944j9252j0729k7895K4796M9114J2696L3975O6459
2121.1H38048220J3411J0133R6261R5010K2650K7179P3254O4433O2943J00553R4473
$$ plain form
1972.3 846904457 846891165 846705079 846475303 846429408 846325755 846063316 845951200 845968306 845818400 845574021
1992.6 845574021 845419884 845226943 844968319 844832361 844704092 844427586 844186664 844047844 843820691 843576014
2013 843576014 843482673 843316138 842963755 842695892 842538536 842289567 842052162 841955006 841817439 841573536
2033.4 841573536 841376066 841200650 840962827 840783715 840672135 840484202 840264201 840134203 840027809 839865148
2053.8 839865148 839711905 839600921 839462101 839317203 839249015 839149177 838960767 838856399 838838756 838732481
2074.2 838732481 838602126 838568449 838524759 838415742 838358104 838346601 838249624 838126540 838087380 838050067 837967694
2096.7 837967694 837965250 838030100 838000000 837919056 837899804 837889075 837861180 837885976 837935090 837947786 837981761 838048220
2121.1 838048220 838061631 838071764 838168025 838263035 838285685 838312864 838386118 838450551 838513494 838614047 838708520
2143.6H38708520N8830J00612J43230R1315P6174J17958J06752Q5056J19209J23143
2164H39730799Q4520J27017J98186J46806O5207R6917J24455P5996P5877J22547R7453
2186.4H40945780O9201J10328Q6189J2159M9889J06335M6611K0861J07885R3281k7299
2208.8H41621220n96R1791L7551M470P2659M1365k3961J7882K0325m1187q94O5148
2233.3H41905773O377l1709L2961N007j04368q4281n960l8922n5552N424m2736j16408
2257.8H41475606l9339J8060m8995k9385Q2374N1975k1398M1544N8830k5153K6882
2280.2H41591001J42872J15335O8068Q4579J2041o3718K5749N7280k4020L6835J43350
2302.7H42189372P0750k6226K1279N4836J5557Q5235J64628M6909o3360k1517J4245
$$ plain form
2143.6 838708520 838767350 838867962 839011192 839102507 839178681 839296639 839403391 839488447 839607656 839730799
2164 839730799 839815319 839942336 840140522 840287328 840352535 840449452 840573907 840649903 840725780 840848327 840945780
2186.4 840945780 841014981 841125309 841211498 841223657 841273546 841379881 841426492 841447353 841555238 841648519 841621220
2208.8 841621220 841620624 841712415 841749966 841754436 841827095 841868460 841844499 841862381 841882706 841841519 841840625 841905773
2233.3 841905773 841912150 841880441 841913402 841918409 841814041 841729760 841723800 841684878 841629326 841634750 841592014 841475606
2257.8 841475606 841436267 841454327 841405332 841375947 841458321 841510296 841488898 841530442 841589272 841564119 841591001
2280.2 841591001 841733873 841849208 841917276 842001855 842013896 841950178 841975927 842033207 842009187 842046022 842189372
2302.7 842189372 842260122 842233896 842255175 842310011 842325568 842410803 842575431 842622340 842558980 842537463 842551708
2325.1H42551708K1458N1260L2782n1677o2823K8372M3213j5616J5080J13547L80277
2347.5H43107581N50389L30687o4492k68579k73585j64688k0563J11460J89722J91331
2367.9H43689263K45035L33666L17812K78414L43203M28438M05729L10779K38955J76430
2388.3H46767724J11758P4029M7088N9247R2685N5790l993J9967O5029L0339k1816
2410.8H47297847l1292l1233j7941J5914k980o0558p1228m1604k0921k0564j3530j0371
2435.2H46991539k1756n0127p8023q0287r7752j07765o8307m3273p3433j05262j02520
2457.7H46163034r6559r1136o4551o9201j25826j32441o0797n5015j40608j47879r6857
2480.1H45082164j09852j13010p5042j00613j56045j10328p3433j46687j64032j24574
$$ plain form
2325.1 842551708 842573166 842624426 842657208 842605531 842542708 842571080 842614293 842598677 842613757 842727304 843107581
2347.5 843107581 843657970 843988657 843924165 843655586 843382001 843217313 843196750 843308210 843497932 843689263
2367.9 843689263 843934298 844267964 844585776 844864190 845207393 845635831 846041560 846352339 846591294 846767724
2388.3 846767724 846879482 846953511 847000599 847059846 847152531 847208321 847204328 847224295 847289324 847319663 847297847
2410.8 847297847 847266555 847235322 847217381 847233295 847230315 847169757 847098529 847056925 847036004 847015440 847001910 846991539
2435.2 846991539 846969783 846919656 846841633 846761346 846663594 846555829 846487522 846444249 846370816 846265554 846163034
2457.7 846163034 846066475 845975339 845910788 845841587 845715761 845583320 845522523 845467508 845326900 845179021 845082164
2480.1 845082164 844972312 844859302 844784260 844683647 844527602 844417274 844343841 844197154 844033122 843908548
2500.5H43908548j42336j21891n7936j03354j84119j26719n7996j21772j65224j33216
2520.9H42693985j48178j41382o1810p6711j57058j03355l7849j23799j86800j30773
2541.3H41526270j25170j76608j38700r8527j45435j63615j40011j65463j68741j08420
2561.7H40095580j38283k26081j80482j22965k13861k56062j85132k12550k90275k61306
2582.1H38008583k43426k92837k87474k57015l08573l65198l33965l32772l83854l44575
2602.5H34858894l03566m01199m57585l65734l29673l88742l81946l63589m45902m66108
2622.9H30954850l80397m10795m83156m00304l54767m54843m53294l43918l48926l99053
2643.3H26925397l78609m03762m65572m33623l77417m05431m09424l29435l24964m09007
$$ plain form
2500.5 843908548 843766212 843644321 843586385 843483031 843298912 843172193 843114197 842992425 842827201 842693985
2520.9 842693985 842545807 842404425 842342615 842265904 842108846 842005491 841967642 841843843 841657043 841526270
2541.3 841526270 841401100 841224492 841085792 840987265 840841830 840678215 840538204 840372741 840204000 840095580
2561.7 840095580 839957297 839731216 839550734 839427769 839213908 838957846 838772714 838560164 838269889 838008583
2582.1 838008583 837765157 837472320 837184846 836927831 836619258 836254060 835920095 835587323 835203469 834858894
2602.5 834858894 834555328 834154129 833696544 833330810 833001137 832612395 832230449 831866860 831420958 830954850
2622.9 830954850 830574453 830163658 829680502 829280198 828925431 828470588 828017294 827673376 827324450 826925397
2643.3 826925397 826546788 826143026 825677454 825243831 824866414 824460983 824051559 823722124 823397160 822988153
2663.7H22988153m22836l85940l87192l46780k88903l39806l86656l30567l60310m92811
2684.1H19246352m64022l54410m16755m89116m06981l64244m26411m43816m42446n04017
2704.5H14934134n12063m52936n05924n55158m67419m74870n82576n17249m01199m84288
2724.8H09980452n91099n61953n40435n41389m25518l54409m67718m97579m03285m11868
2745.2H05185199m46022m23014n07474o37531n95093n11050n78046o12497n24402n44906
2765.6G99805164o38723o00338n51999o47723p55191p65860p69317p51973o93082p44343
2786G92886615q39055q31783q50617r47476r50277q85367r77218j120627j094342j050889
2806.4G83338964j116574j165986j184881j266300j342714j344204j419067j584113
$$ plain form
2663.7 822988153 822565317 822179377 821792185 821445405 821156502 820816696 820430040 820099473 819739163 819246352
2684.1 819246352 818782330 818427920 818011165 817522049 817115068 816750824 816324413 815880597 815438151 814934134
2704.5 814934134 814422071 813969135 813463211 812908053 812440634 811965764 811383188 810865939 810464740 809980452
2724.8 809980452 809389353 808827400 808286965 807745576 807320058 806965649 806497931 806000352 805597067 805185199
2745.2 805185199 804739177 804316163 803808689 803171158 802576065 802065015 801486969 800874472 800350070 799805164
2765.6 799805164 799166441 798566103 798014104 797366381 796611190 795845330 795076013 794324040 793630958 792886615
2786 792886615 792047560 791215777 790365160 789417684 788467407 787582040 786604822 785484195 784389853 783338964
2806.4 783338964 782222390 781056404 779871523 778605223 777262509 775918305 774499238 772915125
2822.7G72915125j653016j716017j951576k204895k402544k795994l409386m144191
2839.1G52637506n121470o384075p698476q368552p576763n322457k522826j61171
2855.4G09481716J351118J933575J588523O02722n04016j350820j732409j549006j093328
2873.7G08728075q06332p55131q81851j210153j673102k130687k454460k653897k796411
2892.1F93366051k856851k914727l067791l204703l320396l587962m036426m652023
2908.4F65725172n573094o811381p830679p853270o736338m972160k948582r20534
2924.7F22079134Q78692K344727L343463L941357M419148M755080M759610M523098
2941F51044309M075408L195167J976609R31203L64185J23620K18093P69079J485705
$$ plain form
2822.7 772915125 771262109 769546092 767594516 765389621 762987077 760191083 756781697 752637506
2839.1 752637506 747516036 741131961 733433485 725064933 717488170 712165713 709642887 709481716
2855.4 709481716 710832834 712766409 714354932 714957654 714453638 713102818 711370409 709821403 708728075
2873.7 708728075 707921743 707166612 706284761 705074608 703401506 701270819 698816359 696162462 693366051
2892.1 693366051 690509200 687594473 684526682 681321979 678001583 674413621 670377195 665725172
2908.4 665725172 660152078 653340697 645510018 637656748 630920410 625948250 622999668 622079134
2924.7 622079134 622957826 625302553 628646016 632587373 637006521 641761601 646521211 651044309
2941 651044309 655119717 658314884 660291493 661222696 661586881 661710501 661928594 662697673 664183378
2959.4F64183378K087534K494991K701103K776444K739012K620638K418756K097488
2975.7F84119344J859903J743257J474559J162708J028538R57727Q84891P17819L44991
2994.1F94293737q821k89083n69522o90401p32660p73430o90758n86629o53803q83162
3014.5F88415468j103282j196206j246691j305937j338721j389444j429379j436650
3030.8F77969158j422406j506090j701653j709580j614988j711965j902937j994730
3047.1F64404809j950085j906931j956344j996040k011180k020836j941562j827418
3063.4F48794413j775623j847505k004028k057790j974047j794994j668214j794637
3079.7F33877575j991391k055406k071202k069473k061189k112150k155423k109468
$$ plain form
2959.4 664183378 666270912 668765903 671467006 674243450 676982462 679603100 682021856 684119344
2975.7 684119344 685979247 687722504 689197063 690359771 691388309 692346036 693230927 693948746 694293737
2994.1 694293737 694284916 693995833 693426311 692735910 692003250 691229820 690539062 689952433 689298630 688415468
3014.5 688415468 687312186 686115980 684869289 683563352 682224631 680835187 679405808 677969158
3030.8 677969158 676546752 675040662 673339009 671629429 670014441 668302476 666399539 664404809
3047.1 664404809 662454724 660547793 658591449 656595409 654584229 652563393 650621831 648794413
3063.4 648794413 647018790 645171285 643167257 641109467 639135420 637340426 635672212 633877575
3079.7 633877575 631886184 629830778 627759576 625690103 623628914 621516764 619361341 617251873
3096F17251873k024412k073884k274215k338767k199352k135694k285242k355516k237916
3114.4E97326875k271533k469898k683877k884150k874553k677322k564728k671242
3130.7E76229572k843797k789378k611756k652646k927243l093720l004729k916217
3147E53390086k889872k847731k942622l169954l275334l226936l150821l132224l174067
3165.4E25580525l198087l204882l193080l137947l123760l197908l241122l222525
3181.7E00061214l193706l164858l138572l148585l204614l202290l183007l225028
3198D74600554l191919l053933k988249k998114l002047k969295k902329k881587k881586
3216.4D47731495k895802k908528k833933k738207k711118k689987k599925k516180
$$ plain form
3096 617251873 615227461 613153577 610879362 608540595 606341243 604205549 601920307 599564791 597326875
3114.4 597326875 595055342 592585444 589901567 587017417 584142864 581465542 578900814 576229572
3130.7 576229572 573385775 570596397 567984641 565331995 562404752 559311032 556306303 553390086
3147 553390086 550500214 547652483 544709861 541539907 538264573 535037637 531886816 528754592 525580525
3165.4 525580525 522382438 519177556 515984476 512846529 509722769 506524861 503283739 500061214
3181.7 500061214 496867508 493702650 490564078 487415493 484210879 481008589 477825582 474600554
3198 474600554 471408635 468354702 465366453 462368339 459366292 456396997 453494668 450613081 447731495
3216.4 447731495 444835693 441927165 439093232 436355025 433643907 430953920 428353995 425837815
3232.7D25837815k566219k624839k548903k448380k359301k265603k246648k307981
3249D06469941k291590k187431k105564k085238k138943k163142k112001k053291j987010
3267.4C87345731j890480j889646k025783k141297k133370k022534j974434k010196
3283.7C71257991j970858j915216j928717j912654j904934k023965k141357k088517
3300C55371773j939058j838327j896828k110213k259612k237111k167672k138913k119094
3318.4C36664945k091557k045214j995444k058238k177268k180487k084583j973331
3334.7C20058823j877696j879096k015084k115547k109319k000213j808345j845897
3351C04407626k126187k185046j936108j741737j750410j746207j563669j425206j565636
$$ plain form
3232.7 425837815 423271596 420646757 418097854 415649474 413290173 411024570 408777922 406469941
3249 406469941 404178351 401990920 399885356 397800118 395661175 393498033 391386032 389332741 387345731
3267.4 387345731 385455251 383565605 381539822 379398525 377265155 375242621 373268187 371257991
3283.7 371257991 369287133 367371917 365443200 363530546 361625612 359601647 357460290 355371773
3300 355371773 353432715 351594388 349697560 347587347 345327735 343090624 340922952 338784039 336664945
3318.4 336664945 334573388 332528174 330532730 328474492 326297224 324116737 322032154 320058823
3334.7 320058823 318181127 316302031 314286947 312171400 310062081 308061868 306253523 304407626
3351 304407626 302281439 300096393 298160285 296418548 294668138 292921931 291358262 289933056 288367420
3369.3B88367420j840204j856565j556248j347839j296521j260131j178861r65834
3385.7B77065217o20484l27408m17710p60853p75277l34502j6302k72452o53416n07117
3406.1B72379696j14500L7104K7567l368P75J21683K66314L63826N48601Q03680R82731
3428.5B75414109R70513R76086J117676J041383P58737P84397J160860J445174J507312
3446.8B85176247J518667J645118J777589J838088J978219K154648K070636K035856
3463.2C00195068K448946K751470K406716J841486J826644K235681K648532K725840
3479.5C19080383K376884K319902K674848K682537K514839K709061K948165L035515
3495.8C40342134K969831K878905K876609K781034K693921K833188L122628L429949
$$ plain form
3369.3 288367420 286527216 284670651 283114403 281766564 280470043 279209912 278031051 277065217
3385.7 277065217 276444733 276117325 275699615 274938762 274163485 273828983 273812681 273540229 272886813 272379696
3406.1 272379696 272265196 272302300 272329867 272326499 272327274 272448957 272715271 273079097 273627698 274431378 275414109
3428.5 275414109 276384622 277360708 278478384 279519767 280278504 281062901 282223761 283668935 285176247
3446.8 285176247 286694914 288340032 290117621 291955709 293933928 296088576 298159212 300195068
3463.2 300195068 302644014 305395484 307802200 309643686 311470330 313706011 316354543 319080383
3479.5 319080383 321457267 323777169 326452017 329134554 331649393 334358454 337306619 340342134
3495.8 340342134 343311965 346190870 349067479 351848513 354542434 357375622 360498250 363928199
3512.1C63928199L441095L165096L157318L465146L784150L713846L356904L324419
3528.4C91336173L630847L897339M052549M022450L896325M157931M499525M368067
3544.7D23861206L984570L981263M217207M372358M487902M631669M846632M984558
3561.1D59367365M872918M560888M756212N355567N381316N169212N298794N595892
3577.4E00358164N867303O138503O169260N823433N556524N968452O170988O051898
3593.7E48104525O247997O533980O415367O310821O472230O351709O274641O452322
3610E99163592O492436O583273O483495O144643O323695O490946O307602N890608N523920
3628.4F55404210N975962N996883N648911N503535N381465N298793N310595N260408
$$ plain form
3512.1 363928199 367369294 370534390 373691708 377156854 380941004 384654850 388011754 391336173
3528.4 391336173 394967020 398864359 402916908 406939358 410835683 414993614 419493139 423861206
3544.7 423861206 427845776 431827039 436044246 440416604 444904506 449536175 454382807 459367365
3561.1 459367365 464240283 468801171 473557383 478912950 484294266 489463478 494762272 500358164
3577.4 500358164 506225467 512363970 518533230 524356663 529913187 535881639 542052627 548104525
3593.7 548104525 554352522 560886502 567301869 573612690 580084920 586436629 592711270 599163592
3610 599163592 605656028 612239301 618722796 624867439 631191134 637682080 643989682 649880290 655404210
3628.4 655404210 661380172 667377055 673025966 678529501 683910966 689209759 694520354 699780762
3644.7F99780762M929066M506707M406452M299403L898084L891289M045606L640234
3661G33397603L267467L370225L281296K710938K789557K853036J829446J609444K195716
3679.4G57304728K306223K476275K686500K440930J534879J131058J527965J690507
3695.7G73099065J637220J474023J110554J126408J511276J584411J063883L43382
3712G82950222O61374J156032J082539Q82626O90579M58718M11749Q34345J144588
3730.3G90272772R79483M95077K34365P19011J133323N37336k73049N72919Q48651
3748.7G95519888k48432j37269Q40544Q63851K70903J88768N43475N10633L34561J06394
3769.1G98793316k7955K93792O44207O42776K49863P9751J63615J03473J71423L26514
$$ plain form
3644.7 699780762 704709828 709216535 713622987 717922390 721820474 725711763 729757369 733397603
3661 733397603 736665070 740035295 743316591 746027529 748817086 751670122 753499568 755109012 757304728
3679.4 757304728 759610951 762087226 764773726 767214656 768749535 769880593 771408558 773099065
3695.7 773099065 774736285 776210308 777320862 778447270 779958546 781542957 782606840 782950222
3712 782950222 783611596 784767628 785850167 786732793 787423372 787882090 788293839 789128184 790272772
3730.3 790272772 791252255 791747332 791981697 792700708 793834031 794371367 794098318 794671237 795519888
3748.7 795519888 795271456 795134187 795974731 796838582 797109485 797298253 797841728 798352361 798686922 798793316
3769.1 798793316 798765361 799059153 799703360 800346136 800595999 800675750 800839365 800942838 801114261 801440775
3789.5H01440775M39108M53830L27289M69684L20196l61442j1683J37687k33889L19183
3809.9H03300738Q48949N26905l4451K47300j8180o33478K4736L82066L03983K45154
3830.3H05193722K63453N06639K34902m46379l49224l1650J07825M50790P77602M86672
3850.7H07194352j052201j448273L17871Q54612N91695J08540j55210Q6307j56701
3869H06340992l71754n1141J53184M54784K51293m5121J00792k20955j30534J75297
3889.4H06656837k38239j36376M47333L57628r6142l49880m88936k85626J54615K32696
3909.8H06253910J77622K29537Q7738r9062K5451R3043j69814k07067J28270J66356
3930.2H06685984n7280l1531R4354J23799M9234j25707n8829Q8513P74R54Q5056M5240
$$ plain form
3789.5 801440775 801879883 802333713 802661002 803130686 803450882 803089440 803077757 803215444 802981555 803300738
3809.9 803300738 804149687 804676592 804642141 804889441 804871261 804237783 804262519 804644585 804948568 805193722
3830.3 805193722 805457175 805963814 806198716 805752337 805403113 805371463 805479288 805930078 806707680 807194352
3850.7 807194352 806142151 804693878 805011749 805866361 806458056 806566596 806411386 806497693 806340992
3869 806340992 805969238 805918097 806071281 806526065 806777358 806732237 806833029 806612074 806481540 806656837
3889.4 806656837 806418598 806282222 806729555 807087183 806991041 806641161 806152225 805866599 806021214 806253910
3909.8 806253910 806431532 806661069 806748807 806649745 806675196 806768239 806598425 806391358 806519628 806685984
3930.2 806685984 806628704 806597173 806691527 806815326 806864560 806738853 806680024 806768537 806769311 806770265 806855321 806900561
3954.7H06900561J5676P7546M2676q4281k4676J21415J09136Q4877J32203P8917L3676
3977.1H07487726J03057J09315M7266M0829N0962J0252J0669R3580J22010N6386
3997.5H08132052
$$ plain form
3954.7 806900561 806916237 806993783 807036459 806952178 806927502 807048917 807158053 807242930 807375133 807454050 807487726
3977.1 807487726 807590783 807700098 807747364 807788193 807839155 807849407 807860076 807953656 808075666 808132052
3997.5 808132052
##END=$$ End of the data block
