##TITLE=$$ Begin of the data block
##JCAMP-DX=5.00 $$ ACD/SpecManager v 10.08
##SPECTROMETER/DATA SYSTEM=Alpha
##DATE=10 Apr 2014 11:00:52
##DATA TYPE=INFRARED SPECTRUM
##DATA CLASS=XYDATA
##ORIGIN=
##OWNER=
##NPOINTS=1765
##FIRSTX=399.75695801
##LASTX=3997.56933594
##MAXX=3997.56933594
##MINX=399.75695801
##MAXY=0.84972328
##MINY=0.27245468
##XFACTOR=1.0000000000
##YFACTOR=1.000000000000000e-9
##FIRSTY=0.61955971
##DELTAX=2.03957629
##XUNITS=1/CM
##YUNITS=ARBITRARY UNITS
##XYDATA=(X++(Y..Y))
$$ plain form
399.8 619559705 618231893 617156804 615619361 614680946 614080250 612957358 612503707 612929404 612055123
418.1 612055123 609893799 609202087 608914733 607985616 607601821 607528567 606623530 605852604 605578601 604655266
438.5 604655266 603975415 604485750 604621947 603822649 603482544 603471756 602895021 602507651 602259398 601022482
458.9 601022482 600047767 599936545 599165201 597790360 597062528 596337616 594918430 594068110 593769491
477.3 593769491 592896760 592050672 591790378 591263294 590518773 590166032 589469314 588028789 586973131
495.6 586973131 586438656 585517824 584446847 583721697 582777560 581780612 581365705 580735505 579478800
514 579478800 578438580 577463031 575808048 574190855 573145568 571792901 570074916 568812311 567614973
532.3 567614973 566069245 564891160 564215422 563284039 562282741 561802924 561221659 560106158 559158146
$$ packed form
399.8F19559705j327812j075089j537443r38415o00696j122892m53651M25697q74281
418.1F12055123k161324o91712k87354r29117l83795p3254r05037p70926k74003r23335
438.5F04655266o79851N10335J36197p99298l40105j0788n76735l87370k48253j236916
458.9F01022482r74715j11222p71344j374841p27832p24912j419186q50320k98619
477.3E93769491q72731q46088k60294n27084p44521l52741o96718j440525j055658
495.6E86973131n34475r20832j070977p25150r44137r96948m14907o30200j256705
514E79478800j040220r75549j654983j617193j045287j352667j717985j262605j197338
532.3E67614973j545728j178085o75738r31383j001298m79817n81265j115501r48012
$$ plain form
550.7 559158146 558313131 556978643 555558443 554311574 552708447 550888062 549252510 547195673 544505060
569 544505060 541961253 539627433 537058830 534678400 532803118 530838847 528801858 527089894 525410533
587.4 525410533 523492992 521656275 519997299 518171906 516358078 514647007 512353718 509515405
603.7 509515405 507345319 506272912 505668759 505176425 504859388 504991889 506464660 509764850 513883293
622.1 513883293 517983377 522204280 526419699 530098915 533521950 537073016 540187657 542620957
638.4 542620957 544702053 546029747 546834946 548800051 552033722 554408848 554758489 554284334 555353761
656.7 555353761 559493423 565669358 571392655 575255156 578293145 582204998 585670710 588503063
673.1 588503063 591653407 594833553 597468495 599996626 602623522 604694426 606416583 608425081
$$ packed form
550.7E59158146q45015j334488j420200j246869j603127j820385j635552k056837k690613
569E44505060k543807k333820k568603k380430j875282j964271k036989j711964j679361
587.4E25410533j917541j836717j658976j825393j813828j711071k293289k838313
603.7E09515405k170086j072407o04153m92334l17037J32501J472771L300190M118443
622.1E13883293M100084M220903M215419L679216L423035L551066L114641K433300
638.4E42620957K081096J327694Q05199J965105L233671K375126L49641m74155J069427
656.7E55353761M139662O175935N723297L862501L037989L911853L465712K832353
673.1E88503063L150344L180146K634942K528131K626896K070904J722157K008498
$$ plain form
689.4 608425081 610170603 611268580 612414777 613613248 614385128 615221441 616597652 618061900 619627297
707.7 619627297 621763110 623977065 625807106 627809584 630075395 632105350 634329975 637103558
724 637103558 639648139 641670287 643925428 646334469 648170233 649827123 651755095 653407097 654780209
742.4 654780209 656591594 658496857 659993768 661720753 663805425 665486574 666955531 668862641
758.7 668862641 670766652 672267497 673797309 675349414 676527679 677626908 678665817 678890347 678370953
777.1 678370953 677804291 676982522 675677776 674697578 674473941 674648523 675596237 678004861 681494176
795.4 681494176 685744703 691066623 696942806 702451408 707606673 712401450 716218233 719176114
811.7 719176114 721791029 723624945 724198103 724015474 723118544 720798731 717387974 713604808 709185004
$$ packed form
689.4F08425081J745522J097977J146197J198471P71880Q36313J376211J464248J565397
707.7F19627297K135813K213955J830041K002478K265811K029955K224625K773583
724F37103558K544581K022148K255141K409041J835764J656890J927972J652002J373112
742.4F54780209J811385J905263J496911J726985K084672J681149J468957J907110
758.7F68862641J904011J500845J529812J552105J178265J099229J038909K24530n19394
777.1F78370953n66662q21769j304746r80198k23637J74582R47714K408624L489315
795.4F81494176M250527N321920N876183N508602N155265M794777L816783K957881
811.7G19176114K614915J833916N73158j82629q96930k319813l410757l783166m419804
$$ plain form
830.1 709185004 704232633 699692190 695633590 691511631 687588334 684194565 681050599 678498328
846.4 678498328 677541077 678445220 681140482 686082125 693011165 700837374 709340215 718484342 727279246
864.8 727279246 735159874 742346168 748423219 752962947 756622195 759723783 761694074 762508869 762583613
883.1 762583613 761678338 759750366 757643700 755710304 753713191 752231717 751916587 752349913 753275216
901.5 753275216 754921079 756650448 757693648 758262575 758245528 756846845 754141212 750819147 746922553
919.8 746922553 742691398 739180028 736878097 735558510 735375762 736215472 737134099 737758696 738461375
938.2 738461375 739002466 739004016 738868058 738606572 737492919 735441983 732665598 728695571 723344445
956.6 723344445 717025399 709529459 700271308 689410985 677248359 663636386 649068058 634801507
$$ packed form
830.1G09185004m952371m540443m058600m121959l923297l393769l143966k552271
846.4F78498328r57251R04143K695262M941643O929040P826209Q502841R144127Q794904
864.8G27279246P880628P186294O077051M539728L659248L101588J970291Q14795P4744
883.1G62583613r05275j927972k106666j933396j997113j481474l15130M33326R25303
901.5G53275216J645863J729369J043200N68927j7047j398683k705633l322065l896594
919.8G46922553m231155l511370k301931j319587j82748Q39710R18627O24597P02679
938.2G38461375N41091J550j35958k61486j113653k050936k776385l970027n351126
956.6G23344445o319046p495940r258151j0860323j2162626j3611973j4568328j4266551
$$ plain form
972.9 634801507 621594608 609767616 599688053 591158450 583542526 576655924 570558667 564986527
989.2 564986527 559909761 555687189 552171171 548999906 546359837 544283330 542169333 539525151
1005.5 539525151 536181748 531864882 526497722 520604730 514636099 508626699 502876401 497786492
1021.8 497786492 493163705 488767058 484756321 481134593 477770507 474793911 472291023 470036894
1038.1 470036894 467971325 466203749 464496553 462554634 460494548 458513826 456751078 455706418
1054.5 455706418 455911428 457279265 459298491 461417496 462867737 462849140 461178631 458201349 454310000
1072.8 454310000 450030118 445963174 442229778 438632369 435049713 431230962 426886111 422230959
1089.1 422230959 417948216 414651275 412719131 412296146 413059652 414353490 415780544 417181611 418269664
$$ packed form
972.9F34801507j3206899j1826992j0079563q529603p615924o886602o097257n572140
989.2E64986527n076766m222572l516018l171265k640069k076507k113997k644182
1005.5E39525151l343403m316866n367160n892992n968631o009400n750298n089909
1021.8D97786492m622787m396647m010737l621728l364086k976596k502888k254129
1038.1D70036894k065569j767576j707196j941919k060086j980722j762748j044660
1054.5D55706418K05010J367837K019226K119005J450241j8597j670509k977282l891349
1072.8D54310000m279882m066944l733396l597409l582656l818751m344851m655152
1089.1D22230959m282743l296941j932144m22985P63506J293838J427054J401067J088053
$$ plain form
1107.5 418269664 418820560 418827504 418075979 416099340 412521690 407251775 401257753 396889150 395630270
1125.8 395630270 396489918 397983313 399225354 399747729 400248408 401933432 404979259 408516288 411751360
1144.2 411751360 414508373 416851848 418816805 420663744 422765553 425255656 428300112 432251960
1160.5 432251960 437301308 443483621 450902641 459394008 468382597 477415949 486330420 494849712
1176.8 494849712 502716243 509966969 516473413 521753848 525512993 527751505 528407097 527689219 526381075
1195.2 526381075 525202632 524599612 525103390 526945591 529670775 532698691 535651922 538056552 539636791
1213.5 539636791 540725112 541677475 542477667 543247104 544280946 545548737 546967387 548739016 550889254
1231.9 550889254 553204834 555709422 558487713 561261833 563789785 566146672 568204761 569671512
$$ packed form
1107.5D18269664N50896O944p51525j976639l577650n269915n994022m368603j258880
1125.8C95630270Q59648J493395J242041N22375N00679J685024L045827L537029L235072
1144.2D11751360K757013K343475J964957J846939K101809K490103L044456L951848
1160.5D32251960N049348O182313P419020Q491367Q988589R033352Q914471Q519292
1176.8D94849712P866531P250726O506444N280435L759145K238512O55592p17878j308144
1195.2E26381075j178443o03020N03778J842201K725184L027916K953231K404630J580239
1213.5E39636791J088321R52363Q00192P69437J033842J267791J418650J771629K150238
1231.9E50889254K315580K504588K778291K774120K527952K356887K058089J466751
$$ plain form
1248.2 569671512 570656478 571425617 571929514 572295368 572992325 574149847 575732946 578012526 581102669
1266.6 581102669 584718823 588777781 593403101 598392308 603507042 608849406 614447236 620092630
1282.9 620092630 625826597 631831825 637867868 643636346 649253786 654647410 659488738 663861752
1299.2 663861752 667961895 671593130 674678206 677490115 680029392 682051659 683702230 685253441
1315.5 685253441 686619282 687841296 689239204 690754056 692165852 693571866 694884300 695745468
1331.8 695745468 696230948 696664870 696885467 696732163 696743488 697154582 697649240 698206007 698883057 699363232
1352.2 699363232 699492633 699514747 699448943 698899329 697661579 696180701 694777369 693373322 692182720
1370.6 692182720 690858841 688834727 686865211 685223699 682952642 680245936 678600073 678181469
$$ packed form
1248.2E69671512R84966P69139N03897L65854O96957J157522J583099K279580L090143
1266.6E81102669L616154M058958M625320M989207N114734N342364N597830N645394
1282.9F20092630N733967O005228O036043N768478N617440N393624M841328M373014
1299.2F63861752M100143L631235L085076K811909K539277K022267J650571J551211
1315.5F85253441J365841J222014J397908J514852J411796J406014J312434Q61168
1331.8F95745468M85480M33922K20597j53304J1325M11094M94658N56767O77050M80175
1352.2F99363232J29401K2114o5804n49614j237750j480878j403332j404047j190602
1370.6F92182720j323879k024114j969516j641512k271057k706706j645863m18604
$$ plain form
1386.9 678181469 677874684 677532613 677056730 675868213 674122810 671949208 669444799 666734159 663590789
1405.3 663590789 660480738 657643199 655006170 652950406 651545048 650049388 648093700 646722138
1421.6 646722138 645817101 645022690 644560277 643951654 643382788 643495560 643637180 643551886 644154131 645345628
1442 645345628 646656394 648172200 650082827 652373672 655101776 658630431 663657010 669761360 675151527
1460.3 675151527 680604577 687059700 694024265 701078951 709050298 718455672 727159202 733853638
1476.6 733853638 739104211 743317008 746875644 749673307 751515925 752162457 751676798 750868022 749789774
1495 749789774 747745395 744889617 742255151 740441203 738042355 731908500 725859940 722001851 718543530
1513.4 718543530 715152681 712067604 709557593 706496060 703436077 701139688 698669910 696732700
$$ packed form
1386.9F78181469l06785l42071m75883j188517j745403k173602k504409k710640l143370
1405.3F63590789l110051k837539k637029k055764j405358j495660j955688j371562
1421.6F46722138r05037p94411m62413o08623n68866J12772J41620q5294O02245J191497
1442F45345628J310766J515806J910627K290845K728104L528655N026579O104350N390167
1460.3F75151527N453050O455123O964565P054686P971347R405374Q703530O694436
1476.6G33853638N250573M212797L558636K797663J842618O46532m85659q08776j078248
1495G49789774k044379k855778k634466j813948k398848o133855o048560l858089l458321
1513.4G18543530l390849l085077k510011l061533l059983k296389k469778j937210
$$ plain form
1529.7 696732700 695293069 693318963 691923738 691617370 690539837 688359082 687040150 686682284 686940849
1548 686940849 687374771 688182652 689558864 691114962 691429734 690032363 689440191 688808918 687635243
1566.4 687635243 685382545 681467474 677967846 674211860 667405963 660314858 654446065 647894382
1582.7 647894382 640519023 632846653 625015676 616870522 608589590 600330889 592211962 584271610
1599 584271610 576426446 568693340 561145186 553658366 546046078 538770735 532315135 525276423 516659260
1617.4 516659260 510173321 505216479 499264896 493501663 488525033 484307647 481790066 480079472
1633.7 480079472 477750421 476479501 477044344 478622794 481025189 484212756 488063753 491984397
1650 491984397 496527493 502488494 507883787 513193011 519288480 526230693 533641994 540744483 548362613
$$ packed form
1529.7F96732700j439631j974106j395225l06368j077533k180755j318932l57866K58565
1548F86940849M33922Q07881J376212J556098L14772j397371n92172o31273j173675
1566.4F87635243k252698l915071l499628l755986o805897p091105n868793o551683
1582.7F47894382p375359p672370p830977q145154q280932q258701q118927p940352
1599E84271610p845164p733106p548154p486820p612288p275343o455600p038712q617163
1617.4E16659260o485939m956842n951583n763233m976630m217386k517581j710594
1633.7D80079472k329051j270920N64843J578450K402395L187567L850997L920644
1650D91984397M543096N961001N395293N309224O095469O942213P411301P102489P618130
$$ plain form
1668.4 548362613 556972384 565027237 573166251 581921875 590334535 598642051 607646048 618373513
1684.7 618373513 627986073 636164427 644609988 652783453 661700130 671436310 681024790 691605210
1701 691605210 700331926 707648635 715065241 721521795 727146208 732622027 738096058 743031442 746944189
1719.3 746944189 750482142 753855944 756993771 760140181 763532937 766710341 769647539 772588253
1735.7 772588253 775331855 778183699 781452179 784962475 788421810 792004228 795668006 798782766
1752 798782766 801409483 804177344 806843996 808973074 810935855 812852204 814559460 816231787 818047762
1770.3 818047762 819464564 820421576 821614563 822974861 824078500 825098395 826275527 827351451
1786.7 827351451 828442633 829734504 830796778 831461132 832302213 833284974 833971560 834496260 835255563
$$ packed form
1668.4E48362613Q609771Q054853Q139014Q755624Q412660Q307516R003997J0727465
1684.7F18373513R612560Q178354Q445561Q173465Q916677R736180R588480J0580420
1701F91605210Q726716P316709P416606O456554N624413N475819N474031M935384L912747
1719.3G46944189L537953L373802L137827L146410L392756L177404K937198K940714
1735.7G72588253K743602K851844L268480L510296L459335L582418L663778L114760
1752G98782766K626717K767861K666652K129078J962781J916349J707256J672327J815975
1770.3H18047762J416802R57012J192987J360298J103639J019895J177132J075924
1786.7H27351451J091182J291871J062274O64354Q41081R82761O86586N24700P59303
$$ plain form
1805 835255563 836060405 836650491 837201118 837751329 838180721 838620961 839245319 839883566 840397477 840936482
1825.4 840936482 841533959 841843367 841962039 842341840 842761457 843070090 843545020 844160497 844465017 844538987
1845.8 844538987 844771445 844978631 845127940 845417202 845758438 845944583 846133113 846500158 846930563 847311556
1866.2 847311556 847521842 847439468 847333491 847462237 847735703 847915649 847986877 848148584 848352313 848512530
1886.6 848512530 848693550 848848403 848879993 848844945 848912239 849016428 849032104 849125981 849321246 849358082 849283159
1909 849283159 849321246 849382401 849445045 849616110 849723279 849603951 849474013 849499941 849448144 849310040 849366844
1931.5 849366844 849405587 849204898 849135637 849291921 849244773 848994255 848879457 848743141 848503828 848423421
1951.9 848423421 848383009 848129749 847915411 847892344 847735465 847481549 847397327 847281098 847015381 846874177
$$ packed form
1805H35255563Q04842N90086N50627N50211M29392M40240O24358O38247N13911N39005
1825.4H40936482N97477L09408J18672L79801M19617L08633M74930O15477L04520P3970
1845.8H44538987K32458K07186J49309K89262L41236J86145J88530L67045M30405L80993
1866.2H47311556K10286q2374j05977J28746K73466J79946P1228J61707K03729J60217
1886.6H48512530J81020J54853L1590l5048O7294J04189J5676R3877J95265L6836p4923
1909H49283159L8087O1155O2644J71065J07169j19328j29938K5928n1797j38104N6804
1931.5H49366844L8743k00689o9261J56284m7148k50518j14798j36316k39313q0407
1951.9H48423421m0412k53260k14338k3067j56879k53916q4222j16229k65717j41204
$$ plain form
1972.3 846874177 846833944 846627176 846402347 846356988 846244037 845978141 845860660 845867753 845702350 845448375
1992.6 845448375 845304608 845124841 844887137 844775856 844636619 844331443 844093502 843965530 843730688 843491733
2013 843491733 843406677 843229294 842867792 842606187 842470169 842251182 842029333 841892660 841688275 841425896
2033.4 841425896 841259539 841127932 840917587 840720892 840587914 840416551 840199709 840037525 839900315 839737236
2053.8 839737236 839623332 839559197 839430690 839261293 839169979 839058638 838858604 838750005 838757455 838698626
2074.2 838698626 838609338 838591814 838532865 838403761 838333786 838303089 838191688 838062823 838025987 838006258 837942719
2096.7 837942719 837939262 837997258 837983131 837914169 837867856 837807953 837747574 837778032 837841511 837851942 837891579 837985039
2121.1 837985039 838013351 838001907 838079214 838184416 838220894 838273525 838380575 838434577 838462472 838553548 838644683
$$ packed form
1972.3H46874177m0233k06768k24829m5359j12951k65896j17481P093j65403k53975
1992.6H45448375j43767j79767k37704j11281j39237l05176k37941j27972k34842k38955
2013H43491733q5056j77383l61502k61605j36018k18987k21849j36673k04385k62379
2033.4H41425896j66357j31607k10345j96695j32978j71363k16842j62184j37210j63079
2053.8H39737236j13904o4135j28507j69397r1314j11341k00034j08599P450n8829
2074.2H38698626q9288j7524n8949j29104o9975l0697j11401j28865l6836j9729o3539
2096.7H37942719l457N7996j4127o8962m6313n9903o0379L0458O3479J0431L9637R3460
2121.1H37985039K8312j1444P7307J05202L6478N2631J07050N4002K7895R1076R1135
$$ plain form
2143.6 838644683 838699460 838809907 838958085 839029849 839084804 839209616 839323521 839406610 839546561 839695513
2164 839695513 839773893 839867115 840051174 840228856 840335190 840447307 840560198 840612769 840677619 840835810 840986311
2186.4 840986311 841047943 841117799 841211379 841259539 841320634 841416478 841443300 841446817 841545701 841631770 841625631 841662228
2210.9 841662228 841748357 841761112 841761291 841809034 841815650 841800630 841838837 841863930 841830492 841838717 841899991 841883600
2235.4 841883600 841831267 841877520 841914713 841823339 841736436 841729164 841688931 841636717 841668189 841653824 841522038
2257.8 841522038 841440141 841421962 841341317 841298282 841392636 841466010 841464102 841512978 841574430 841567636 841616690 841757894
2282.3 841757894 841841638 841875255 841965616 842030227 842005193 842027724 842090189 842069328 842070878 842193723 842262805
2304.7 842262805 842202485 842199802 842270017 842294931 842373669 842524529 842557728 842495918 842486084 842523158 842563510 842601836
$$ packed form
2143.6H38644683N4777J10447J48178P1764N4955J24812J13905Q3089J39951J48952
2164H39695513P8380R3222J84059J77682J06334J12117J12891N2571O4850J58191J50501
2186.4H40986311O1632O9856R3580M8160O1095R5844K6822L517R8884Q6069o139L6597
2210.9H41662228Q6129J2755J79M7743O616j5020L8207K5093l3438Q225O1274j6391
2235.4H41883600n2333M6253L7193r1374q6903p272m0233n2214L1472j4365j31786
2257.8H41522038q1897j8179q0645m3035R4354P3374j908M8876O1452o794M9054J41204
2282.3H41757894Q3744L3617R0361O4611k5034K2531O2465k0861J550J22845O9082
2304.7H42262805o0320k683P0215K4914P8738J50860L3199o1810r834L7074M0352L8326
$$ plain form
2329.2 842601836 842601061 842527092 842475891 842531443 842600584 842618048 842620075 842708826 843127787 843723893 844078779
2351.6 844078779 844018161 843750954 843501806 843320608 843248785 843347490 843539953 843694746 843913376 844290435
2372 844290435 844654500 844916403 845233381 845648408 846032858 846344709 846586466 846740961 846838653 846925676
2392.4 846925676 847015977 847112477 847207546 847263098 847270072 847295642 847346783 847329259 847260833 847240448 847261190 847279668
2416.9 847279668 847294033 847269416 847190320 847110391 847071707 847068787 847066522 847046375 847015202 846979856 846924663 846839011
2441.3 846839011 846741676 846643329 846563041 846521676 846473634 846372783 846286178 846248031 846178830 846061349 845963240
2463.8 845963240 845885932 845758677 845611870 845543981 845492959 845348418 845195472 845090926 844953656 844819784
2484.2 844819784 844753623 844663858 844503164 844364047 844259799 844146490 844053805 843961537 843816459 843684256
$$ packed form
2329.2H42601836p75p3969n1201N5552O9141J7464K027Q8751M18961N96106L54886
2351.6H44078779o0618k67207k49148j81198p1823R8705J92463J54793K18630L77059
2372H44290435L64065K61903L16978M15027L84450L11851K41757J54495R7692Q7023
2392.4H46925676R0301R6500R5069N5552O974K5570N1141j7524o8426k0385K0742J8478
2416.9H47279668J4365k4617p9096p9929l8684k920k265k0147l1173l5346n5193q5652
2441.3H46839011r7335r8347q0288m1365m8042j00851q6605l8147o9201j17481r8109
2463.8H45963240p7308j27255j46807o7889n1022j44541j52946j04546j37270j33872
2484.2H44819784o6161q9765j60694j39117j04248j13309r2685r2268j45078j32203
$$ plain form
2504.6 843684256 843605399 843477249 843298554 843205452 843151152 842988253 842797101 842685759 842566788 842407823
2525 842407823 842304647 842230260 842105329 841998994 841920614 841760039 841571808 841479480 841395080 841243923 841128170
2547.4 841128170 841036737 840877175 840691566 840520322 840330541 840176821 840102196 839978814 839765489 839599669
2567.8 839599669 839462757 839217603 838955820 838799059 838604152 838289440 838006377 837776184 837491691 837201715
2588.2 837201715 836970925 836691797 836310148 835943401 835619926 835289240 834976554 834644139 834201276 833730757
2608.6 833730757 833368957 833040833 832648993 832263827 831887305 831453145 831055760 830715716 830271304 829751015
2629 829751015 829335213 828973711 828530192 828115702 827814877 827459395 827012360 826606512 826192260 825712323
2649.4 825712323 825287461 824949145 824572921 824157059 823805273 823455453 823031008 822628677 822274387 821893930
$$ packed form
2504.6H43684256p8857j28150j78695r3102n4300j62899j91152j11342j18971j58965
2525H42407823j03176p4387j24931j06335p8380j60575j88231r2328q4400j51157j15753
2547.4H41128170r1433j59562j85609j71244j89781j53720p4625j23382k13325j65820
2567.8H39599669j36912k45154k61783j56761j94907l14712k83063k30193k84493k89976
2588.2H37201715k30790k79128l81649l66747l23475l30686l12686l32415m42863m70519
2608.6H33730757l61800l28124l91840l85166l76522m34160l97385l40044m44412n20289
2629H29751015m15802l61502m43519m14490l00825l55482m47035m05848m14252m79937
2649.4H25712323m24862l38316l76224m15862l51786l49820m24445m02331l54290l80457
$$ plain form
2669.8 821893930 821544468 821270406 820939064 820508122 820104659 819710672 819252133 818868279 818581045 818171382
2690.2 818171382 817645371 817197919 816803515 816362381 815950215 815562725 815066695 814527094 814052463 813534081
2710.6 813534081 812957883 812477350 812024534 811454475 810896337 810447216 809975445 809449434 808951974 808425426
2731 808425426 807844698 807381809 807026565 806583047 806101561 805696309 805289447 804859102 804440618 803929508
2751.4 803929508 803293765 802706361 802210629 801649749 801027179 800461471 799888730 799243033 798645198 798103809
2771.8 798103809 797460496 796713948 795964122 795198917 794416666 793686211 792943895 792118013 791289985 790447295
2792.2 790447295 789507389 788564444 787669778 786667287 785551608 784478068 783420861 782289863 781120718
2810.5 781120718 779938042 778676748 777336240 775999129 774613976 773064792 771418571 769708395
$$ packed form
2669.8H21893930l49462k74062l31342m30942m03463l93987m58539l83854k87234m09663
2690.2H18171382n26011m47452l94404m41134m12166l87490m96030n39601m74631n18382
2710.6H13534081n76198m80533m52816n70059n58138m49121m71771n26011m97460n26548
2731H08425426n80728m62889l55244m43518m81486m05252m06862m30345m18484n11110
2751.4H03929508o35743n87404m95732n60880o22570n65708n72741o45697n97835n41389
2771.8G98103809o43313p46548p49826p65205p82251p30455p42316q25882q28028q42690
2792.2G90447295r39906r42945q94666j002491j115679j073540j057207j130998j169145
2810.5G81120718j182676j261294j340508j337111j385153j549184j646221j710176
$$ plain form
2826.8 769708395 767771184 765561402 763114333 760273337 756847203 752702296 747603774 741223335
2843.1 741223335 733490288 725116372 717572272 712274075 709737837 709546149 710908473 712892830
2859.5 712892830 714501143 715085149 714562058 713203907 711490393 709951580 708813608 707947969 707172275
2877.8 707172275 706325769 705175638 703527272 701389194 698929310 696276963 693472683 690582216
2894.1 690582216 687636971 684573293 681382000 678082407 674549520 670547664 665874124 660279393
2910.4 660279393 653462112 645622611 637759507 631020188 626058459 623131931 622230530 623109460 625430524
2928.8 625430524 628744245 632696688 637166023 641956866 646732390 651259422 655302048 658443928
2945.1 658443928 660395443 661331892 661715567 661854923 662057638 662789404 664250851 666325450 668814480
$$ packed form
2826.8G69708395j937211k209782k447069k840996l426134m144907n098522o380439
2843.1G41223335p733047q373916p544100n298197k536238j91688J362324J984357
2859.5G12892830J608313N84006n23091j358151j713514j538813j137972q65639p75694
2877.8G07172275q46506j150131j648366k138078k459884k652347k804280k890467
2894.1F90582216k945245l063678l191293l299593l532887m001856m673540n594731
2910.4F60279393o817281p839501p863104o739319m961729k926528r01401Q78930K321064
2928.8F25430524L313721L952443M469335M790843M775524M527032M042626L141880
2945.1F58443928J951515R36449L83675J39356K02715P31766J461447K074599K489030
$$ plain form
2963.5 668814480 671538889 674341440 677095652 679765701 682220280 684305370 686169446 687911212
2979.8 687911212 689343750 690487027 691559076 692561150 693427980 694089472 694382608 694368243 694106281
2998.1 694106281 693548739 692867100 692154348 691410303 690740466 690152049 689488053 688592434 687489986
3016.5 687489986 686313570 685078681 683771133 682398140 680944860 679505765 678127348 676758289
3032.8 676758289 675269723 673572242 671874642 670276999 668576896 666662395 664631486 662655354
3049.1 662655354 660758615 658814549 656805515 654782951 652766287 650814950 648949265 647142053
3065.5 647142053 645297289 643277049 641165793 639221251 637523234 635877252 634063065 632092655
3081.8 632092655 630056441 627948701 625839412 623790979 621704459 619532466 617380381 615354002
$$ packed form
2963.5F68814480K724409K802551K754212K670049K454579K085090J864076J741766
2979.8F87911212J432538J143277J072049J002074Q66830O61492K93136j4365k61962
2998.1F94106281n57542o81639p12752p44045o69837n88417o63996q95619j102448
3016.5F87489986j176416j234889j307548j372993j453280j439095j378417j369059
3032.8F76758289j488566j697481j697600j597643j700103j914501k030909j976132
3049.1F62655354j896739j944066k009034k022564k016664j951337j865685j807212
3065.5F47142053j844764k020240k111256j944542j698017j645982j814187j970410
3081.8F32092655k036214k107740k109289k048433k086520k171993k152085k026379
$$ plain form
3098.1 615354002 613316655 611057043 608715236 606517434 604361594 602057099 599716961 597490668
3114.4 597490668 595235288 592819393 590171814 587282240 584393859 581678629 579070926 576422215
3130.7 576422215 573641181 570870876 568229318 565555334 562641203 559551597 556516886 553571880
3147 553571880 550685287 547853529 544883788 541659713 538351715 535115421 531996667 528929472 525794625
3165.4 525794625 522607625 519418776 516232252 513077617 509918153 506661057 503392398 500206947
3181.7 500206947 497028887 493827909 490674227 487556130 484386802 481187731 477987796 474760652
3198 474760652 471570373 468494207 465493917 462506384 459502220 456512451 453564048 450646579 447798699
3216.4 447798699 444975913 442108154 439259738 436490029 433764547 431082159 428499758 425991148
$$ packed form
3098.1F15354002k037347k259612k341807k197802k155840k304495k340138k226293
3114.4E97490668k255380k415895k647579k889574k888381k715230k607703k648711
3130.7E76422215k781034k770305k641558k673984k914131l089606l034711k945006
3147E53571880k886593k831758k969741l224075l307998l236294l118754l067195l134847
3165.4E25794625l187000l188849l186524l154635l159464l257096l268659l185451
3181.7E00206947l178060l200978l153682l118097l169328l199071l199935l227144
3198D74760652l190279l076166l000290k987533l004164k989769k948403k917469k847880
3216.4D47798699k822786k867759k848416k769709k725482k682388k582401k508610
$$ plain form
3232.7 425991148 423425436 420794010 418234646 415783465 413419902 411144376 408921570 406681299
3249 406681299 404418021 402207613 400086224 397995740 395868927 393727809 391606122 389524728 387531817
3267.4 387531817 385631114 383701414 381638765 379497617 377389610 375369191 373393148 371398091
3283.7 371398091 369407415 367486000 365621567 363753796 361834019 359800428 357671410 355572671
3300 355572671 353596747 351748884 349891126 347834498 345582604 343264937 341010362 338885307 336811572
3318.4 336811572 334725797 332687855 330690473 328612387 326456010 324336797 322265923 320278555
3334.7 320278555 318443775 316584140 314518422 312374026 310269028 308260739 306423277 304571867
3351 304571867 302510142 300386339 298446774 296675265 294889867 293115139 291533858 290100157 288522035
$$ packed form
3232.7D25991148k565712k631426k559364k451181k363563k275526k222806k240271
3249D06681299k263278k210408k121389k090484k126813k141118k121687k081394j992911
3267.4C87531817j900703j929700k062649k141148k108007k020419j976043j995057
3283.7C71398091j990676j921415j864433j867771j919777k033591k129018k098739
3300C55572671j975924j847863j857758k056628k251894k317667k254575k125055k073735
3318.4C36811572k085775k037942j997382k078086k156377k119213k070874j987368
3334.7C20278555j834780j859635k065718k144396k104998k008289j837462j851410
3351C04571867k061725k123803j939565j771509j785398j774728j581281j433701j578122
$$ plain form
3369.3 288522035 286671281 284805626 283186078 281785369 280531555 279357463 278265327 277344286
3385.7 277344286 276701599 276359409 275955409 275179863 274399996 274115682 274110258 273752719 273014665 272514433
3406.1 272514433 272454679 272531927 272598654 272599459 272547603 272631973 272866666 273189873 273755848 274621218 275656313
3428.5 275656313 276628405 277575463 278712869 279795945 280558079 281309605 282432348 283863693 285373777
3446.8 285373777 286909670 288556904 290301859 292145610 294190347 296407551 298510849 300552875
3463.2 300552875 302973509 305664450 308016688 309844524 311679929 313916832 316552907 319266200
3479.5 319266200 321656495 323993564 326655537 329352826 331902474 334568501 337450147 340499848
3495.8 340499848 343555182 346529037 349432290 352172196 354837894 357675463 360817343 364277780
$$ packed form
3369.3B88522035j850754j865655j619548j400709j253814j174092j092136r21041
3385.7B77344286o42687l42190m04000p75546p79867k84314n424l57539p38054n00232
3406.1B72514433n9754P7248O6727Q05n1856Q4370K34693L23207N65975Q65370J035095
3428.5B75656313R72092R47058J137406J083076P62134P51526J122743J431345J510084
3446.8B85373777J535893J647234J744955J843751K044737K217204K103298K042026
3463.2C00552875K420634K690941K352238J827836J835405K236903K636075K713293
3479.5C19266200K390295K337069K661973K697289K549648K666027K881646L049701
3495.8C40499848L055334K973855K903253K739906K665698K837569L141880L460437
$$ plain form
3512.1 364277780 367742509 370880306 373980880 377433062 381220698 384904772 388235748 391555101
3528.4 391555101 395178109 399067253 403141916 407232136 411188096 415345728 419810385 424154639
3544.7 424154639 428107172 432042420 436270714 440695792 445212215 449840397 454674095 459660381
3561.1 459660381 464530736 469086051 473860472 479240090 484652758 489883304 495216221 500763237
3577.4 500763237 506561041 512679458 518891037 524761379 530289233 536210954 542400122 548489749
3593.7 548489749 554733753 561239064 567676902 574037671 580459177 586699188 592938066 599434316
3610 599434316 605992556 612639427 619163692 625328064 631639183 638084233 644362748 650244772 655783117
3628.4 655783117 661805689 667830288 673501134 679017186 684370458 689634025 694945455 700227141
$$ packed form
3512.1C64277780L464729L137797L100574L452182L787636L684074L330976L319353
3528.4C91555101L623008L889144M074663M090220L955960M157632M464657M344254
3544.7D24154639L952533L935248M228294M425078M516423M628182M833698M986286
3561.1D59660381M870355M555315M774421N379618N412668N230546N332917N547016
3577.4E00763237N797804O118417O211579N870342N527854N921721O189168O089627
3593.7E48489749O244004O505311O437838O360769O421506O240011O238878O496250
3610E99434316O558240O646871O524265O164372O311119O445050O278515N882024N538345
3628.4F55783117O022572O024599N670846N516052N353272N263567N311430N281686
$$ plain form
3644.7 700227141 705172777 709687233 714078188 718365252 722263038 726136804 730162978 733788013
3661 733788013 737031877 740414619 743710041 746359229 749084830 751915812 753754139 755402505 757606864
3679.4 757606864 759925604 762423396 765096545 767511010 769070208 770258307 771812201 773514926
3695.7 773514926 775118172 776480317 777539790 778726816 780251265 781738758 782691598 783057332 783837557
3714 783837557 785073102 786161065 786991477 787643373 788131237 788625836 789550126 790699422 791553497
3732.4 791553497 791920483 792148232 792916417 794089437 794572711 794171929 794780612 795736730 795479119
3750.7 795479119 795285702 796114683 796991408 797280610 797469795 798022985 798609734 799022019 799109340 799048126
3771.1 799048126 799373627 800027609 800612807 800766766 800768077 800949156 801124871 801345527 801705360 802145720
$$ packed form
3644.7G00227141M945636M514456M390955M287064L897786L873766M026174L625035
3661G33788013L243864L382742L295422K649188K725601K830982J838327J648366K204359
3679.4G57606864K318740K497792K673149K414465J559198J188099J553894J702725
3695.7G73514926J603246J362145J059473J187026J524449J487493R52840L65734P80225
3714G83837557J235545J087963Q30412O51896M87864M94599R24290J149296Q54075
3732.4G91553497L66986K27749P68185J173020M83274m00782O08683R56118k57611
3750.7G95479119j93417Q28981Q76725K89202J89185N53190N86749M12285Q7321o1214
3771.1G99048126L25501O53982N85198J53959J311J81079J75715K20656L59833M40360
$$ plain form
3791.5 802145720 802564323 802855134 803265870 803538740 803234041 803328931 803545415 803337038 803602874 804364622
3811.9 804364622 804860115 804870486 805138171 805098176 804497361 804606497 804985404 805188537 805355310 805621207
3832.3 805621207 806200922 806499779 806021035 805597246 805560470 805723131 806199431 806938767 807372332 806316555
3852.7 806316555 804935455 805316269 806148291 806665301 806755126 806623816 806713045 806517839 806067407 806034207
3873.1 806034207 806298077 806778550 806975067 806937516 807089686 806832075 806597650 806740522 806560993 806435585
3893.5 806435585 806830287 807221293 807264626 807006776 806488574 806125224 806237876 806501091 806742132 806995749
3913.9 806995749 807068229 806909442 806855977 806937635 806834579 806741774 806953132 807105482 806997478 806924641
3934.3 806924641 806969106 807077885 807156324 807054043 807022512 807134092 807090461 807002962 807066023 807173669 807236850
$$ packed form
3791.5H02145720M18603K90811M10736K72870l04699R4890K16484k08377K65836P61748
3811.9H04364622M95493J0371K67685l9995o00815J09136L78907K03133J66773K65897
3832.3H05621207N79715K98857m78744m23789l6776J62661M76300P39336M33565j055777
3852.7H06316555j381100L80814Q32022N17010Q9825j31310Q9229j95206m50432l3200
3873.1H06034207K63870M80473J96517l7551J52170k57611k34425J42872j79529j25408
3893.5H06435585L94702L91006M3333k57850n18202l63350J12652K63215K41041K53617
3913.9H06995749P2480j58787n3465Q1658j03056r2805K11358J52350j08004p2837
3934.3H06924641M4465J08779P8439j02281l1531J11580m3631q7499O3061J07646O3181
$$ plain form
3956.7 807236850 807285547 807297945 807282805 807351708 807478011 807552993 807621121 807744384 807834327 807868421 807946324
3979.2 807946324 808068573 808149457 808181942 808209956 808241308 808312178 808443427 808519304 808503687
3997.5 808503687
$$ packed form
3956.7H07236850M8697J2398j5140O8903J26303P4982O8128J23263Q9943L4094P7903
3979.2H07946324J22249Q0884L2485K8014L1352P0870J31249P5877j5617
3997.5H08503687
##END=$$ End of the data block
