##TITLE=$$ Begin of the data block
##JCAMP-DX=5.00 $$ ACD/SpecManager v 10.08
##SPECTROMETER/DATA SYSTEM=Alpha
##DATE=10 Apr 2014 11:00:52
##DATA TYPE=INFRARED SPECTRUM
##DATA CLASS=XYDATA
##ORIGIN=
##OWNER=
##NPOINTS=1765
##FIRSTX=399.75695801
##LASTX=3997.56933594
##MAXX=3997.56933594
##MINX=399.75695801
##MAXY=0.84980232
##MINY=0.27258658
##XFACTOR=1.0000000000
##YFACTOR=1.000000000000000e-9
##FIRSTY=0.61901474
##DELTAX=2.03957629
##XUNITS=1/CM
##YUNITS=ARBITRARY UNITS
##XYDATA=(X++(Y..Y))
399.8F19014740r21309o95109j669884r89676j62482j352847j344680K54512n6029
418.1F12077236j362443n62012o85215j416802l78251K31325p47204j036465p20620
436.5F05399549p68304j28627O04868l55184j255214l83139K7836o97971l88145K02834
456.9F02258503o70433j089096o38961r08554j110017m81904o47902j459539q87394
475.2E94364703m59433j099586q25644j7226l89337q51989m54187o46711j310766r28521
495.6E87381303n52237j065969j127958o61791p96556r09031n93900q95739j409829
514E79368293j086473r72271j584590j456558q89480j266659j765549j403212j224816
532.3E67718685j466453j137257o25491q91924r76861m74810o37353j178682j105725
$$ y = [619014740, 618093431, 617398322, 615728438, 614738762, 614576280, 613223433, 611878753, 612133265, 612077236, 610714793, 610152781, 609467566, 608050764, 607672513, 607903838, 607156634, 606120169, 605399549, 604631245, 604502618, 605107486, 604752302, 603497088, 603113949, 603141785, 602443814, 602055669, 602258503, 601588070, 600498974, 599860013, 598951459, 597841442, 597359538, 596711636, 595252097, 594364703, 593905270, 592805684, 591980040, 591962814, 591573477, 590721488, 590267301, 589620590, 588309824, 587381303, 586829066, 585763097, 584635139, 583973348, 583176792, 582267761, 581673861, 580778122, 579368293, 578281820, 577309549, 575724959, 574268401, 573378921, 572112262, 570346713, 568943501, 567718685, 566252232, 565114975, 564489484, 563597560, 562620699, 562145889, 561508536, 560329854, 559224129]
550.7E59224129r78470j265586j284599j118243j494288j888812j846671k203583k713681
569E44430196k335667j986325k414823k482176k005577k050399k121032j667440j579046
587.4E25787711j959085j989961j700640j674652j762569j823008k308249k669037
603.7E09900510j936912r69410p10964p03872m26232K06768J537204L248870M104376
622.1E14250338M125714M221797M274011L755748L434420L511608L076076K430797
638.4E43080509K125859J427054Q65221J925528L116429K249480L83257l60071J077115
656.7E55890381M123450O146967N658627L859043L122926M002451L429771K816141
673.1E89049757L200709L140927K526104K489865K679586K164364J690626J862646
$$ y = [559224129, 558245659, 556980073, 555695474, 554577231, 553082943, 551194131, 549347460, 547143877, 544430196, 542094529, 540108204, 537693381, 535211205, 533205628, 531155229, 529034197, 527366757, 525787711, 523828626, 521838665, 520138025, 518463373, 516700804, 514877796, 512569547, 509900510, 507963598, 506994188, 506283224, 505579352, 505153120, 505359888, 506897092, 510145962, 514250338, 518376052, 522597849, 526871860, 530627608, 534062028, 537573636, 540649712, 543080509, 545206368, 546633422, 547498643, 549424171, 552540600, 554790080, 555173337, 554813266, 555890381, 560013831, 566160798, 571819425, 575678468, 578801394, 582803845, 586233616, 589049757, 592250466, 595391393, 597917497, 600407362, 603086948, 605251312, 606941938, 608804584]
689.4F08804584J721561J161217J133979J118958O93082Q56638J551032J617551J527965
707.7F20186567K060294K248943J888216K019584K273798K041221K219796K727568
724F37665987K497256K002299K247214K425671J861095J671910J919985J649737J393617
742.4F55334771J804173J913070J514674J650452J993120J699865J533270J945972
758.7F69389367J887798J409829J504719J639307J200020J031101J001477K57611m77373
777.1F78843856n59867q32438j301110r38952k18391J04785Q63671K371490L535569
795.4F81868613M352033N388975N866170N465686N100012M772484L818930K909600
811.7G19542503K579093J857281O41286r4175q95560k400458l485381l845036m420281
$$ y = [608804584, 610526145, 611687362, 612821341, 613940299, 614633381, 615490019, 617041051, 618658602, 620186567, 622246861, 624495804, 626384020, 628403604, 630677402, 632718623, 634938419, 637665987, 640163243, 642165542, 644412756, 646838427, 648699522, 650371432, 652291417, 653941154, 655334771, 657138944, 659052014, 660566688, 662217140, 664210260, 665910125, 667443395, 669389367, 671277165, 672686994, 674191713, 675831020, 677031040, 678062141, 679063618, 679321229, 678843856, 678283989, 677451551, 676150441, 675211489, 674993098, 675097883, 675961554, 678333044, 681868613, 686220646, 691609621, 697475791, 702941477, 708041489, 712813973, 716632903, 719542503, 722121596, 723978877, 724620163, 724525988, 723630428, 721229970, 717744589, 713899553, 709479272]
830.1G09479272m860222m451871m092276m208386l916621l396213l217459k546668
846.4F78789556q93831R02414K679110M947900O942511P837057Q453250R065747Q768738
864.8G27492452P899224P211686O075561M502296L646851L128230J940310P61271J00136
883.1G62758017q35360j909315k187073k042771k054870j477122k60651N08427R95219
901.5G53494501J639426J670301J050949N93424k9266j391590k673745l281176l881335
919.8G47191489m262150l521025k258658j287162k16425P65562Q62837N97060O94692
938.2G38566220N48899J3888j33217k79605j118600k026022k760291l968358n375028
956.6G23467886o375670p527888r226918j0819614j2191892j3664424j4560223j4255881
$$ y = [709479272, 704619050, 700167179, 696074903, 691866517, 687949896, 684553683, 681336224, 678789556, 677895725, 678798139, 681477249, 686425149, 693367660, 701204717, 709657967, 718723714, 727492452, 735391676, 742603362, 748678923, 753181219, 756828070, 759956300, 761896610, 762657881, 762758017, 761922657, 760013342, 757826269, 755783498, 753728628, 752251506, 751990855, 752499282, 753494501, 755133927, 756804228, 757855177, 758448601, 758419335, 757027745, 754354000, 751072824, 747191489, 742929339, 739408314, 737149656, 735862494, 735646069, 736411631, 737274468, 737871528, 738566220, 739115119, 739129007, 738995790, 738716185, 737597585, 735571563, 732811272, 728842914, 723467886, 717092216, 709564328, 700337410, 689517796, 677325904, 663661480, 649101257, 634845376]
972.9F34845376j3234019j1838317j0047853q461952p561326o889761o148696n629122
989.2E65034330n089760m198253l499806l189862k675295k109587k146602k626717
1005.5E39498448l262877m276157n408942n956054o021261o020487n681633n024165
1021.8D97846872m634023m408568l983498l599346l361493k991140k532095k262860
1038.1D70073849k023667j725495j706898j932293k022595j980781j789779j034289
1054.5D55858052K38389J384437K003669K081216J394689p2569j685351k969474l881484
1072.8D54351574m268020m062444l736526l624529l618419l789693m259705m579127
1089.1D22413111m243702l287613j925767m37468P08699J235455J407624J404941J113236
$$ y = [634845376, 621611357, 609773040, 599725187, 591263235, 583701909, 576812148, 570663452, 565034330, 559944570, 555746317, 552246511, 549056649, 546381354, 544271767, 542125165, 539498448, 536235571, 531959414, 526550472, 520594418, 514573157, 508552670, 502871037, 497846872, 493212849, 488804281, 484820783, 481221437, 477859944, 474868804, 472336709, 470073849, 468050182, 466324687, 464617789, 462685496, 460662901, 458682120, 456892341, 455858052, 456096441, 457480878, 459484547, 461565763, 462960452, 462887883, 461202532, 458233058, 454351574, 450083554, 446021110, 442284584, 438660055, 435041636, 431251943, 426992238, 422413111, 418169409, 414881796, 412956029, 412518561, 413227260, 414462715, 415870339, 417275280, 418388516]
1107.5D18388516O12020N0724p36356j975030l604531n303055n998790m354209j249552
1125.8C95829737Q43108J426548J171201N23746N87702J795560L069639L460944L180742
1144.2D11888927K767086K343297J939923J833558K129465K519816L008396L886789
1160.5D32317257N023628O191999P426202Q510054R023368R047449Q916378Q515894
1176.8D94972229P834256P201731O473720N268991L762424K251863O87421o79016j307667
1195.2E26465952j207470o24121M91500J837969K723634K998889K894520K378583J616300
1213.5E39575756J131773R64701P99417P82669J044690J249731J398623J796782K208531
1231.9E50952673K342820K492488K758026K760589K524316K353370K064526J502276
$$ y = [418388516, 419000536, 419051260, 418314904, 416339874, 412735343, 407432288, 401433498, 397079289, 395829737, 396672845, 398099393, 399270594, 399794340, 400382042, 402177602, 405247241, 408708185, 411888927, 414656013, 416999310, 418939233, 420772791, 422902256, 425422072, 428430468, 432317257, 437340885, 443532884, 450959086, 459469140, 468492508, 477539957, 486456335, 494972229, 502806485, 510008216, 516481936, 521750927, 525513351, 527765214, 528452635, 527773619, 526465952, 525258482, 524634361, 525125861, 526963830, 529687464, 532686353, 535580873, 537959456, 539575756, 540707529, 541672230, 542471647, 543254316, 544299006, 545548737, 546947360, 548744142, 550952673, 553295493, 555787981, 558546007, 561306596, 563830912, 566184282, 568248808, 569751084]
1248.2E69751084J027405P84278N28336L92317O52850J099169J577676K283394L086865
1266.6E81183374L618240M041732M578352M942536N102277N370319N619824N626380
1282.9F20083034N717099O015002O041468N764305N602360N367219M833878M402697
1299.2F63827062M138708L639102L089726K846479K554119K000153J630068J527071
1315.5F85252488J347303J253426J457572J544654J399220J374423J295149Q66473
1331.8F95790708M89891M08828J82152j34826R1493M78506N03123N24223O42717M56691
1352.2F99433506J18911J3947p8082n47111j226127j483917j416207j422941j191557
1370.6F92200422j286506j992345j969874j661301k323806k765656j661241l96728
$$ y = [569751084, 570778489, 571562767, 572091103, 572483420, 573136270, 574235439, 575813115, 578096509, 581183374, 584801614, 588843346, 593421698, 598364234, 603466511, 608836830, 614456654, 620083034, 625800133, 631815135, 637856603, 643620908, 649223268, 654590487, 659424365, 663827062, 667965770, 671604872, 674694598, 677541077, 680095196, 682095349, 683725417, 685252488, 686599791, 687853217, 689310789, 690855443, 692254663, 693629086, 694924235, 695790708, 696280599, 696689427, 696871579, 696736753, 696828246, 697306752, 697809875, 698334098, 698976815, 699433506, 699552417, 699566364, 699488282, 698941171, 697715044, 696231127, 694814920, 693391979, 692200422, 690913916, 688921571, 686951697, 685290396, 682966590, 680200934, 678539693, 678142965]
1386.9F78142965k66671l00289m66227j212776j762926k169550k489090k707481l141821
1405.3F63626134l080606k801836k609908k041459j428008j543403j982093j374602
1421.6F46764219q87871p55727m43936o16073n69046J18852J25646j12116O10411J220227
1442F45454586J319348J495719J886726K278685K719283L504157M975856O097317N428016
1460.3F75159693N459666O455958O986856P048548P928908R387373Q742452O729484
1476.6G33898938N269110M231155L554880K758444J793682O04451m89831p64012j042426
1495G49814391k069592k896846k618432j776039k393306o173253o046354l813267l458321
1513.4G18568981l446877l120363k537131l097654l016889k223909k425134j899302
$$ y = [678142965, 677876294, 677576005, 677109778, 675897002, 674134076, 671964526, 669475436, 666767955, 663626134, 660545528, 657743692, 655133784, 653092325, 651664317, 650120914, 648138821, 646764219, 645876348, 645120621, 644676685, 644060612, 643491566, 643610418, 643736064, 643623948, 644234359, 645454586, 646773934, 648269653, 650156379, 652435064, 655154347, 658658504, 663634360, 669731677, 675159693, 680619359, 687075317, 694062173, 701110721, 709039629, 718427002, 727169454, 733898938, 739168048, 743399203, 746954083, 749712527, 751506209, 752110660, 751620829, 750856817, 749814391, 747744799, 744847953, 742229521, 740453482, 738060176, 731886923, 725840569, 722027302, 718568981, 715122104, 712001741, 709464610, 706366956, 703350067, 701126158, 698701024, 696801722]
1529.7F96801722j414180j967609j374900k82824j098216k213299j294613l17871K67565
1548F87105775M29511Q39949J423060J565040K84969j413822n81681o28353j174926
1566.4F87849522k258480l928840l494918l754557o835162p089317n852640o575405
1582.7F48060203p383228p634043p801652q140088q291184q296073q158564p921517
1599E84433854p793725p705688p570148p564664p678032p286966o440460p000506q576036
1617.4E16817629o485760m981816n977541n772918m964382m214793k554596j759350
1633.7D80106473k347976j248181N92858J589685K395183L163278L848046L938199
1650D92037565M530370N957097N452454N363881O129623O973147P424653P087111P585943
$$ y = [696801722, 695387542, 693419933, 692045033, 691762209, 690663993, 688450694, 687156081, 686838210, 687105775, 687535286, 688375235, 689798295, 691363335, 691648304, 690234482, 689652801, 689024448, 687849522, 685591042, 681662202, 678167284, 674412727, 667577565, 660488248, 654635608, 648060203, 640676975, 633042932, 625241280, 617101192, 608810008, 600513935, 592355371, 584433854, 576640129, 568934441, 561364293, 553799629, 546121597, 538834631, 532394171, 525393665, 516817629, 510331869, 505350053, 499372512, 493599594, 488635212, 484420419, 481865823, 480106473, 477758497, 476510316, 477103174, 478692859, 481088042, 484251320, 488099366, 492037565, 496567935, 502525032, 507977486, 513341367, 519470990, 526444137, 533868790, 540955901, 548541844]
1668.4E48541844Q563459Q027494Q152961Q790195Q420468Q280992Q952618J0714114
1684.7F18444145R646475Q182228Q444905Q167207Q852899R653330R558857J0606050
1701F91556096Q795798P369280P415771O422699N595088N464494N454600M908085L954768
1719.3G46936679L617406L414213L141582L125132L330946L119647K941907K986431
1735.7G72613943K773583K856075L254950L494561L457248L595531L656805L104746
1752G98807442K646268K788961K674162K108455J946330J946032J739025J668691J764238
1770.3H18089604J351655R40680J212478J371205J094997J036644J220524J091182
1786.7H27408969J069189J272261J067161O59943Q38876J013279P23898N48542P50005
$$ y = [548541844, 557105303, 565132797, 573285758, 582075953, 590496421, 598777413, 607730031, 618444145, 628090620, 636272848, 644717753, 652884960, 661737859, 671391189, 680950046, 691556096, 700351894, 707721174, 715136945, 721559644, 727154732, 732619226, 738073826, 742981911, 746936679, 750554085, 753968298, 757109880, 760235012, 763565958, 766685605, 769627512, 772613943, 775387526, 778243601, 781498551, 784993112, 788450360, 792045891, 795702696, 798807442, 801453710, 804242671, 806916833, 809025288, 810971618, 812917650, 814656675, 816325366, 818089604, 819441259, 820381939, 821594417, 822965622, 824060619, 825097263, 826317787, 827408969, 828478158, 829750419, 830817580, 831477523, 832316399, 833329678, 834053576, 834602118, 835352123]
1805H35352123P75218O04808N84960N42641M07338M29034O07312O16431N33342N87702
1825.4H41040909N97358K91467J46866M11450M18842K77400M38989N90741K75314O9737
1845.8H44559073K77102K61963J77741K76565L23773K06351J94550L20375L84509L56734
1866.2H47338736K15471l3379p0214J40071K90632J98901P5757J51337J76131J17779
1886.6H48601222J68622J72376K5153m0590Q4698J10566Q107R6142K06411L7849o4373
1909H49406183O8187N9844J9371J40131J08599j06692j23143J5318n0187j04249P3493
1931.5H49506855K6762k07364q6606J15633p1168k18987n6326j13905k49684q3983
1951.9H48561227k7835k38240k36392o7651j61827k25246o1392j23799k87950j43588
$$ y = [835352123, 836127341, 836732149, 837317109, 837859750, 838267088, 838696122, 839303434, 839919865, 840453207, 841040909, 841638267, 841929734, 842076600, 842488050, 842906892, 843184292, 843623281, 844214022, 844489336, 844559073, 844836175, 845098138, 845275879, 845552444, 845876217, 846082568, 846277118, 846597493, 846982002, 847338736, 847554207, 847520828, 847450614, 847590685, 847881317, 848080218, 848155975, 848307312, 848483443, 848601222, 848769844, 848942220, 848967373, 848926783, 849011481, 849122047, 849130154, 849226296, 849432707, 849470556, 849406183, 849474370, 849534214, 849553585, 849693716, 849802315, 849695623, 849572480, 849587798, 849537611, 849433362, 849506855, 849533617, 849326253, 849239647, 849355280, 849284112, 849065125, 849008799, 848894894, 848645210, 848561227, 848533392, 848295152, 848058760, 847991109, 847829282, 847604036, 847542644, 847418845, 847130895, 846987307]
1972.3H46987307k9683k05100k26676k8432q9287k61188j23203k443j81497k64704
1992.6H45575094j21534j44243k44796j47462j44899k88784k53261j46389k15888k26914
2013H43640924r4533j74344l40402k53976j58608k47299k31147j18792j67906k29836
2033.4H41624081j63615j64449k42650j96159j23322j91808k40624j40369j05977j68860
2053.8H39886248j35362p5042j42932j80900n8353o3718j85966j19507j7405q7440
2074.2H38819623j16706l4511n0426j06871m1544j9550j35899j45674n1379p0095r5546
2096.7H37951422K6345R0301o199m1008r54m0829p2598K0981O9618J0729J8716O0319
2121.1H38086843J6869K861P9214R7394L4690L6180Q3208N1022M7385J30177J43290
$$ y = [846987307, 846957624, 846752524, 846525848, 846497416, 846408129, 846146941, 846023738, 846021295, 845839798, 845575094, 845453560, 845309317, 845064521, 844917059, 844772160, 844483376, 844230115, 844083726, 843867838, 843640924, 843546391, 843372047, 843031645, 842777669, 842619061, 842371762, 842140615, 842021823, 841853917, 841624081, 841460466, 841296017, 841053367, 840857208, 840733886, 840542078, 840301454, 840161085, 840055108, 839886248, 839750886, 839675844, 839532912, 839352012, 839293659, 839229941, 839043975, 838924468, 838907063, 838819623, 838702917, 838668406, 838617980, 838511109, 838469565, 838450015, 838314116, 838168442, 838117063, 838046968, 837951422, 837977767, 838068068, 838061869, 838020861, 838019907, 837979078, 837906480, 837927461, 837997079, 838007808, 838026524, 838086843, 838103712, 838106573, 838185787, 838283181, 838317871, 838354051, 838437259, 838488281, 838535666, 838665843, 838809133]
2143.6H38809133Q1360Q2552J05322P5638Q9526J29342R5189O7413J18315J39415J03236
2166H39896441J20878J73270J38939P0333R3878J21235P8559P1645J25110J24216Q8990
2188.4H41103494J08004J00314M1664O4373J15752N0605N900P4566O0737k8372J4901
2210.9H41711938Q9825K2292r120O1155M5478q226K0206J6809m0889L040O9261m650
2235.4H41977119n5074K0802J8298p0452n7400j7106o0201l5107N4300j8716j41144
2257.8H41615319q3983k4616p1347N126J27554M3928m2021L9935N7221j3411N4359
2280.2H41708064J42574Q5175N1201J03473N4420l1114M7684Q4757k8133j4544J17481
2302.7H42321038Q8752k5571J8239P8380K7120O5446J27375J1206r4831k8908R5308
$$ y = [838809133, 838890493, 838973045, 839078367, 839154005, 839243531, 839372873, 839468062, 839535475, 839653790, 839793205, 839896441, 840017319, 840190589, 840329528, 840399861, 840493739, 840614974, 840693533, 840765178, 840890288, 841014504, 841103494, 841211498, 841311812, 841353476, 841417849, 841533601, 841584206, 841590106, 841664672, 841725409, 841697037, 841711938, 841801763, 841824055, 841814935, 841876090, 841921568, 841913342, 841933548, 841950357, 841909468, 841912508, 841981769, 841977119, 841922045, 841942847, 841961145, 841890693, 841833293, 841816187, 841755986, 841720879, 841775179, 841756463, 841615319, 841531336, 841506720, 841435373, 841440499, 841568053, 841611981, 841569960, 841609895, 841667116, 841653705, 841708064, 841850638, 841935813, 841987014, 842090487, 842144907, 842113793, 842161477, 842246234, 842218101, 842203557, 842321038, 842409790, 842384219, 842402458, 842480838, 842507958, 842573404, 842700779, 842711985, 842617154, 842588246, 842683554]
2325.1H42683554J14739J2219p9871j01387l5107J01268J18732M769j2875J14322M13537
2347.5H43333900N66483L20196r8169k96593k44379j91569j56939J26958L31044J90913
2367.9H43881845J56224K92897L08037K95580M00364M46856L69489L02196K50995J66476
2388.3H46870959R9063Q1956P4089Q7022J00613L8326j8776L4631O7353j3948m9471
2410.8H47371817J4066L4213N126J1743k1101r8347r7513k8432O795o378q225r775
2435.2H47173989l6299n6148o8426j04308j29283r7751m2975l7134r4950j07050o6221
2457.7H46333444q0287j11342p9334o2286j19687j36852o6578n3823j28687j36494
2478.1H45358074j01447j29700j38879j05917j37628j69217r6917o3777j27435j32382
$$ y = [842683554, 842798293, 842810512, 842730641, 842629254, 842594147, 842695415, 842814147, 842818916, 842806041, 842920363, 843333900, 843900383, 844220579, 844122410, 843825817, 843581438, 843389869, 843232930, 843359888, 843690932, 843881845, 844038069, 844330966, 844639003, 844934583, 845334947, 845781803, 846151292, 846453488, 846704483, 846870959, 846970022, 847051978, 847126067, 847213089, 847313702, 847352028, 847333252, 847367883, 847435236, 847421288, 847371817, 847385883, 847420096, 847425222, 847436965, 847415864, 847317517, 847220004, 847191572, 847198367, 847191989, 847183764, 847173989, 847137690, 847081542, 847013116, 846908808, 846779525, 846681774, 846638799, 846601665, 846506715, 846399665, 846333444, 846253157, 846141815, 846062481, 846000195, 845880508, 845743656, 845677078, 845623255, 845494568, 845358074, 845256627, 845126927, 844988048, 844882131, 844744503, 844575286, 844478369, 844414592, 844287157, 844154775]
2498.5H44154775j08242j51634j47522p8320r1374j35839r6500q0168j39058j36375
2518.9H42989743j06991j66714j83761p8320m6432j26899j27494p9930j15216j39653
2539.2H41818333j03116j29223j74523j31249j09732j48177j32263j12534j77264j99020
2559.6H40401232j38223j52111k11000j76490j31309j88112k23219j74582k27809l27290
2580H38451087k68816k38061l14951k82050k10166k93731m10736l76940l19480l41118
2600.4H35395038l26395l21925m20451m55141l70622l62455m20213l76105l35038m36545
2620.8H31570148m71174l72172l90172m54425l89100l78310m69566m47273l57926l80456
2641.2H27459574m18484l81947l94464m47094m16517l61383l81291l88324l41952l69191
$$ y = [844154775, 844046533, 843894899, 843747377, 843669057, 843577683, 843441844, 843345344, 843265176, 843126118, 842989743, 842882752, 842716038, 842532277, 842453957, 842407525, 842280626, 842153132, 842073202, 841957986, 841818333, 841715217, 841585994, 841411471, 841280222, 841170490, 841022313, 840890050, 840777516, 840600252, 840401232, 840263009, 840110898, 839899898, 839723408, 839592099, 839403987, 839180768, 839006186, 838778377, 838451087, 838182271, 837944210, 837629259, 837347209, 837137043, 836843312, 836432576, 836055636, 835736156, 835395038, 835068643, 834746718, 834326267, 833871126, 833500504, 833138049, 832717836, 832341731, 832006693, 831570148, 831098974, 830726802, 830336630, 829882205, 829493105, 829114795, 828645229, 828197956, 827840030, 827459574, 827041090, 826659143, 826264679, 825817585, 825401068, 825039685, 824658394, 824270070, 823928118, 823558927]
2661.6H23558927m47691m29451l54410l52680l42608k86400l39151m18245l80218l81649
2682H19826424m44174l81708l34680m59134n15283m21285l95894m29631l73840l63469
2702.4H15707326n04732n64695m96864n23508n51760m56094m60864n79238n45620m42446
2722.8H10581505m83572n40257n04911n20467n67019m61340l63589m52995m81069l88324
2743.2H05817962m10497m76599m53830m95255o04153n66721m76837n46157o36578n98550
2763.6H00552785n69880o20603o20604n86807o42062p07030p21455p76112q10802p59959
2784G93737471p62820q24869q25822q27432r03249r36746q91984r45031j075149j107633
2804.4G84636736j096308j140178j183450j199066j267612j340688j336693j412511
$$ y = [823558927, 823111236, 822681785, 822327375, 821974695, 821632087, 821345687, 821006536, 820588291, 820208073, 819826424, 819382250, 819000542, 818665862, 818206728, 817691445, 817270160, 816874266, 816444635, 816070795, 815707326, 815202594, 814637899, 814141035, 813617527, 813065767, 812609673, 812148809, 811569571, 811023951, 810581505, 810097933, 809557676, 809052765, 808532298, 807965279, 807503939, 807140350, 806687355, 806206286, 805817962, 805407465, 804930866, 804477036, 803981781, 803377628, 802810907, 802334070, 801787913, 801151335, 800552785, 799982905, 799362302, 798741698, 798154891, 797512829, 796805799, 796084344, 795308232, 794497430, 793737471, 792974651, 792149782, 791323960, 790496528, 789593279, 788656533, 787764549, 786819518, 785744369, 784636736, 783540428, 782400250, 781216800, 780017734, 778750122, 777409434, 776072741, 774660230]
2820.7G74660230j576662j635969j701772j932681k186596k435804k848863l417015
2837G56924868m112006n081772o367028p692874q357763p575333n330801k535403j87099
2855.4G09684789J330674J940787J592397N98193m95375j334130j724780j573861j140594
2873.7G08878100q37147p59006q70764j179814j638651k109349k434671k634764k780080
2892.1F93633854k874195k981425l111004l195405l300012l561317m016102m646778
2908.4F65947616n570233o838858p866919p848144o704151m922867k911866r31143
2924.7F22353435Q63909K340496L311097L912688M420757M775345M813016M574716
2941F51365459M086792L180922J937150Q84116L60072J50561K11418P35879J483500
$$ y = [774660230, 773083568, 771447599, 769745827, 767813146, 765626550, 763190746, 760341883, 756924868, 752812862, 747731090, 741364062, 733671188, 725313425, 717738092, 712407291, 709871888, 709684789, 711015463, 712956250, 714548647, 715146840, 714651465, 713317335, 711592555, 710018694, 708878100, 708040953, 707281947, 706411183, 705231369, 703592718, 701483369, 699048698, 696413934, 693633854, 690759659, 687778234, 684667230, 681471825, 678171813, 674610496, 670594394, 665947616, 660377383, 653538525, 645671606, 637823462, 631119311, 626196444, 623284578, 622353435, 623217344, 625557840, 628868937, 632781625, 637202382, 641977727, 646790743, 651365459, 655452251, 658633173, 660570323, 661454439, 661814511, 661965072, 662176490, 662912369, 664395869]
2959.4F64395869K092361K476096K716244K815246K751291K649725K461493K102553
2975.7F84460878J849592J741886J471401J162648J060843J001358Q71361O59942K74897
2994.1F94554806p1109k71797m88043o38127p18653p71046o97553n76079o19650q65280
3014.5F88837469j103640j189947j235068j306415j375913j447976j434624j385689
3030.8F78358197j396656j519441j710713j696170j595318j696706j877785j979947
3047.1F64885461j961112j909077j951992k019823k047479k018333j927495j859963
3063.4F49190187j808226j836896k010583k082289j915931j694560j648546j829743
3079.7F34363413k004445k040982k054989k049566k034247k111494k200127k150595
$$ y = [664395869, 666488230, 668964326, 671680570, 674495816, 677247107, 679896832, 682358325, 684460878, 686310470, 688052356, 689523757, 690686405, 691747248, 692748606, 693619967, 694279909, 694554806, 694483697, 694211900, 693723857, 693085730, 692367077, 691596031, 690898478, 690322399, 689702749, 688837469, 687733829, 686543882, 685308814, 684002399, 682626486, 681178510, 679743886, 678358197, 676961541, 675442100, 673731387, 672035217, 670439899, 668743193, 666865408, 664885461, 662924349, 661015272, 659063280, 657043457, 654995978, 652977645, 651050150, 649190187, 647381961, 645545065, 643534482, 641452193, 639536262, 637841702, 636193156, 634363413, 632358968, 630317986, 628262997, 626213431, 624179184, 622067690, 619867563, 617716968]
3096F17716968k029300k084255k297640k332806k165974k128958k309561k372801k230525
3114.4E97765148k241135k451420k694309k907216k899170k687037k555490k650380
3130.7E76678991k829730k816320k651155k626657k851427l081977l063023k923906
3147E53834796k840459k820552k954483l199577l289104l216922l122806l104389l179550
3165.4E26106954l220380l214538l198087l152311l147423l221214l229618l174782
3181.7E00548601l175348l184467l161192l170818l214390l207981l194869l207594
3198D75031942l163069l064603k995461k979130k994567k980351k935261k911270k883225
3216.4D48125005k872199k870619k817065k750993k736985k708882k567798k438188
$$ y = [617716968, 615687668, 613603413, 611305773, 608972967, 606806993, 604678035, 602368474, 599995673, 597765148, 595524013, 593072593, 590378284, 587471068, 584571898, 581884861, 579329371, 576678991, 573849261, 571032941, 568381786, 565755129, 562903702, 559821725, 556758702, 553834796, 550994337, 548173785, 545219302, 542019725, 538730621, 535513699, 532390893, 529286504, 526106954, 522886574, 519672036, 516473949, 513321638, 510174215, 506953001, 503723383, 500548601, 497373253, 494188786, 491027594, 487856776, 484642386, 481434405, 478239536, 475031942, 471868873, 468804270, 465808809, 462829679, 459835112, 456854761, 453919500, 451008230, 448125005, 445252806, 442382187, 439565122, 436814129, 434077144, 431368262, 428800464, 426362276]
3232.7D26362276k535283k669335k585679k440661k350510k300351k294511k300560
3249D06885386k250553k168953k131909k132863k148211k141923k107620k060324j971245
3267.4C87771785j879006j947761k110660k156645k095074k015322k004564k043545
3283.7C71519208k008557j915574j881689j905918j949966k049804k144814k102226
3300C55560660j953810j844376j887799k072662k236247k265990k197921k128035k092510
3318.4C36881310k060503k011985k000779k102762k188683k145051k079160j998037
3334.7C20294350j872956j860559k000124k106249k117664j990556j797349j867294
3351C04681599k114802k155096j957446j775682j756638j751811j571446j417011j564652
$$ y = [426362276, 423826993, 421157658, 418571979, 416131318, 413780808, 411480457, 409185946, 406885386, 404634833, 402465880, 400333971, 398201108, 396052897, 393910974, 391803354, 389743030, 387771785, 385892779, 383945018, 381834358, 379677713, 377582639, 375567317, 373562753, 371519208, 369510651, 367595077, 365713388, 363807470, 361857504, 359807700, 357662886, 355560660, 353606850, 351762474, 349874675, 347802013, 345565766, 343299776, 341101855, 338973820, 336881310, 334820807, 332808822, 330808043, 328705281, 326516598, 324371547, 322292387, 320294350, 318421394, 316560835, 314560711, 312454462, 310336798, 308346242, 306548893, 304681599, 302566797, 300411701, 298454255, 296678573, 294921935, 293170124, 291598678, 290181667, 288617015]
3369.3B88617015j835883j831800j560986j374065j292527j244098j167029r39995
3385.7B77370632n97537l33309m29302p60764p76709l39895l3587l01928o63518m77672
3406.1B72656411o6310R4026N4926o8218q4251J08391K70993L30537N26130Q35061
3426.5B74657696J038880R96410R86428J181066J117706P74890P49171J092493J371026
3444.8B83965766J473159J538575J675129J790374J872748K033443K194553K112299
3461.1B98656046K070785K431393K680629K318889J791805J845926K274305K644121
3477.4C16713899K696276K380282K331525K640068K671451K551734K707094K921671
3493.8C37614000L049373L028989K938450K884894K775640K699524K825826L140539
$$ y = [288617015, 286781132, 284949332, 283388346, 282014281, 280721754, 279477656, 278310627, 277370632, 276773095, 276439786, 276010484, 275249720, 274473011, 274133116, 274099529, 273797601, 273134083, 272656411, 272590101, 272684127, 272739053, 272670835, 272586584, 272694975, 272965968, 273296505, 273822635, 274657696, 275696576, 276692986, 277679414, 278860480, 279978186, 280753076, 281502247, 282594740, 283965766, 285438925, 286977500, 288652629, 290443003, 292315751, 294349194, 296543747, 298656046, 300726831, 303158224, 305838853, 308157742, 309949547, 311795473, 314069778, 316713899, 319410175, 321790457, 324121982, 326762050, 329433501, 331985235, 334692329, 337614000, 340663373, 343692362, 346630812, 349515706, 352291346, 354990870, 357816696, 360957235]
3510.1C60957235L444582L402174L137410L165453L473669L787727L712415L354937
3526.4C88435602L301293L594756L914982M120082M090100L933400M171193M491627
3542.7D20053035M313141L928155L982752M219950M328757M475087M664332M856139
3559D54821348M989684M877031M513234M740178N458534N473733N189448N277992N578458
3577.4E00919640N877316O149411O166160N782307N536913O060720O249905O022512
3593.7E48764884O156862O471455O478489O452203O507456O299496O275773O479323
3610E99885941O454229O518006O451071O170868O389618O498158O263018N843580N505144
3628.4F55979633O010294O000877N646705N526841N374610N302132N337536N212426
$$ y = [360957235, 364401817, 367803991, 370941401, 374106854, 377580523, 381368250, 385080665, 388435602, 391736895, 395331651, 399246633, 403366715, 407456815, 411390215, 415561408, 420053035, 424366176, 428294331, 432277083, 436497033, 440825790, 445300877, 449965209, 454821348, 459811032, 464688063, 469201297, 473941475, 479400009, 484873742, 490063190, 495341182, 500919640, 506796956, 512946367, 519112527, 524894834, 530431747, 536492467, 542742372, 548764884, 554921746, 561393201, 567871690, 574323893, 580831349, 587130845, 593406618, 599885941, 606340170, 612858176, 619309247, 625480115, 631869733, 638367891, 644630909, 650474489, 655979633, 661989927, 667990804, 673637509, 679164350, 684538960, 689841092, 695178628, 700391054]
3644.7G00391054M802287M429519M460871M382193L893614L830135M047871L681421
3661G33918965L293872L406226L282905K611935K681673K754688J770616J725494K314330
3679.4G57760704K342224K467572K622843K355457J533329J198292J573205J728415
3695.7G73582041J643300J415730J029014J078845J505255J547694R45568L06249P89821
3714G83843517J282275J136839Q55267O10114M18901M59254R24468J178026Q96454
3732.4G91605115M19378L00586P82311J059831L47852m22418N68748Q46743k66313
3750.7G95241833l1472R86815Q98957K43902K18094N49137M29333K98798J56045L8027
3771.1G99029469L64542O91772O29127J83463P5281K52723J68920J88112L46482M27783
$$ y = [700391054, 705193341, 709622860, 714083731, 718465924, 722359538, 726189673, 730237544, 733918965, 737212837, 740619063, 743901968, 746513903, 749195576, 751950264, 753720880, 755446374, 757760704, 760102928, 762570500, 765193343, 767548800, 769082129, 770280421, 771853626, 773582041, 775225341, 776641071, 777670085, 778748930, 780254185, 781801879, 782747447, 783053696, 783843517, 785125792, 786262631, 787117898, 787728012, 788146913, 788606167, 789530635, 790708661, 791605115, 792024493, 792325079, 793107390, 794167221, 794515073, 794092655, 794661403, 795508146, 795241833, 795210361, 796197176, 797096133, 797340035, 797558129, 798107266, 798536599, 798835397, 798991442, 799029469, 799394011, 800085783, 800714910, 800898373, 800973654, 801226377, 801395297, 801583409, 801929891, 802357674]
3791.5H02357674M14490L01659L93868J94967l98815M7743J70589k13444L68833Q65221
3811.9H04502785M73201j15454J98245k3722n43118J43469L91960K53200K49148K86340
3832.3H05816054M93050K05338n24581m23789k8550J49071M70102P73191M79877j084625
3852.7H06325138j406014M07397Q41618M88460J6093j08301K03192j22130l83437l2544
3873.1H06229472J86861M71532K51830m5002O0022l20971j99735K13146j49310r9957
3893.5H06597888M40240L69072n1021l48568n56410l06487K12610L06010K08855K14040
3913.9H07086229O0261j39535k4855O4552j66118j58429J92284J63674j09493q4162
3934.3H06884408k980O1989J28865r060N901J27673k384p0870J0788M0353M5955R2447
$$ y = [802357674, 802772164, 803073823, 803467691, 803662658, 803263843, 803311586, 803482175, 803268731, 803637564, 804502785, 804975986, 804860532, 805058777, 805035055, 804491937, 804635406, 805027366, 805280566, 805529714, 805816054, 806309104, 806514442, 805989861, 805566072, 805537522, 805686593, 806156695, 806929886, 807409763, 806325138, 804919124, 805326521, 806168139, 806656599, 806672692, 806564391, 806767583, 806645453, 806262016, 806229472, 806416333, 806887865, 807139695, 807094693, 807154715, 806833744, 806634009, 806847155, 806697845, 806597888, 807038128, 807407200, 807356179, 807007611, 806451201, 806144714, 806357324, 806663334, 806872189, 807086229, 807146490, 807006955, 806982100, 807046652, 806880534, 806722105, 806914389, 807078063, 806968570, 806884408, 806881428, 806943417, 807072282, 807063222, 807069123, 807196796, 807194412, 807123542, 807134330, 807174683, 807220638, 807313085]
3958.8H07313085P3731J6272P7068J04428K5689N5075J15693L3021n603Q9466J59860
3981.2H08057785R5844l755J3352N4776K2650K0146J00434J47224
3997.5H08508456
$$ y = [807313085, 807386816, 807403088, 807480156, 807584584, 807610273, 807665348, 807781041, 807814062, 807808459, 807897925, 808057785, 808153629, 808149874, 808163226, 808218002, 808240652, 808260798, 808361232, 808508456]
##END=$$ End of the data block
