##TITLE=$$ Begin of the data block
##JCAMP-DX=5.00 $$ ACD/SpecManager v 10.08
##SPECTROMETER/DATA SYSTEM=Alpha
##DATE=10 Apr 2014 11:00:52
##DATA TYPE=INFRARED SPECTRUM
##DATA CLASS=XYDATA
##ORIGIN=
##OWNER=
##NPOINTS=1765
##FIRSTX=399.75695801
##LASTX=3997.56933594
##MAXX=3997.56933594
##MINX=399.75695801
##MAXY=0.85008448
##MINY=0.27295646
##XFACTOR=1.0000000000
##YFACTOR=1.000000000000000e-9
##FIRSTY=0.62199056
##DELTAX=2.03957629
##XUNITS=1/CM
##YUNITS=ARBITRARY UNITS
##XYDATA=(X++(Y..Y))
$$ plain form
399.8 621990561 620331526 618754268 616616249 615587771 615248919 613750994 612680078 613425374 613907993
418.1 613907993 612707376 611628354 610576153 609302402 608893692 608830810 607953012 607009828 606430590
436.5 606430590 605563343 605146945 605602384 605563164 604958415 604879260 604701102 603816867 603381217 603363216
456.9 603363216 602452338 601397395 600749552 599546611 598155081 597651422 597264290 596095860 595162213
475.2 595162213 594510674 593294203 592405915 592345119 591960132 591231167 591075540 590708613 589262068 587964058
495.6 587964058 587262690 586278796 585219502 584505439 583594799 582632303 582106471 581289768 579916596
514 579916596 578852117 577916443 576317608 574790061 573859811 572456837 570499539 569128454 568063557
532.3 568063557 566680491 565575182 564884126 563840806 562774301 562308133 561663926 560476899 559554756
$$ packed form
399.8F21990561j659035j577258k138019j028478l38852j497925j070916P45296M82619
418.1F13907993j200617j079022j052201j273751m08710o2882q77798r43184n79238
436.5F06430590q67247m16398M55439l9220o04749p9155j78158q84235m35650j8001
456.9F03363216r10878j054943o47843j202941j391530n03659l87132j168430r33647
475.2E95162213o51539j216471q88288o0796l84987p28965j55627l66927j446545j298010
495.6E87964058p01368r83894j059294p14063r10640r62496n25832q16703j373172
514E79916596j064479r35674j598835j527547r30250j402974j957298j371085j064897
532.3E68063557j383066j105309o91056j043320j066505m66168o44207j187027r22143
$$ plain form
550.7 559554756 558831930 557648718 556231856 554808855 553174853 551542938 549940586 547807097 545133054
569 545133054 542673528 540480375 537971735 535510361 533521533 531462431 529400170 527833879 526341856
587.4 526341856 524402499 522392750 520669401 518948019 517139733 515238464 512849092 510176897
603.7 510176897 508237302 507172644 506400764 505805194 505452335 505578339 507127166 510537386 514738619
622.1 514738619 518867791 523091674 527366519 531139612 534593880 538060367 541082680 543510497
638.4 543510497 545624852 547001302 547808945 549748421 553007066 555337429 555552125 555007875 556114078
656.7 556114078 560345173 566653311 572568297 576580405 579611897 583390296 586803854 589659452
673.1 589659452 592761636 595838964 598422587 600883365 603512108 605780303 607617915 609476030
$$ packed form
550.7E59554756p22826j183212j416862j423001j634002j631915j602352k133489k674043
569E45133054k459526k193153k508640k461374j988828k059102k062261j566291j492023
587.4E26341856j939357k009749j723349j721382j808286j901269k389372k672195
603.7E10176897j939595j064658p71880n95570l52859J26004J548827L410220M201233
622.1E14738619M129172M223883M274845L773093L454268L466487L022313K427817
638.4E43510497K114355J376450Q07643J939476L258645K330363K14696n44250J106203
656.7E56114078M231095O308138N914986M012108L031492L778399L413558K855598
673.1E89659452L102184L077328K583623K460778K628743K268195J837612J858115
$$ plain form
689.4 609476030 611093044 612250805 613502860 614764571 615544260 616346002 617702484 619144022 620606482
707.7 620606482 622624516 624836564 626763403 628861785 631192088 633242249 635418534 638157308
724 638157308 640697360 642664909 644890249 647351146 649241507 650909781 652807415 654414237 655717075
742.4 655717075 657444417 659366727 660964251 662739515 664836764 666539907 667977929 669782996
758.7 669782996 671569049 673005044 674607277 676295519 677495003 678509772 679497480 679770947 679319799
777.1 679319799 678765357 677922189 676620066 675663114 675362825 675432146 676407754 678912759 682460785
795.4 682460785 686733067 692072928 697960556 703468084 708596945 713329852 717037439 719887376
811.7 719887376 722501993 724370658 724922717 724725604 723851919 721588194 718206286 714394391 710025907
$$ packed form
689.4F09476030J617014J157761J252055J261711P79689Q01742J356482J441538J462460
707.7F20606482K018034K212048J926839K098382K330303K050161K176285K738774
724F38157308K540052J967549K225340K460897J890361J668274J897634J606822J302838
742.4F55717075J727342J922310J597524J775264K097249J703143J438022J805067
758.7F69782996J786053J435995J602233J688242J199484J014769R87708K73467m51148
777.1F79319799n54442q43168j302123r56952l00289O9321R75608K505005L548026
795.4F82460785M272282N339861N887628N507528N128861M732907L707587K849937
811.7G19887376K614617J868665N52059j97113q73685k263725l381908l811895m368484
$$ plain form
830.1 710025907 705212533 700711846 696565151 692357779 688371122 684867084 681649327 679194391
846.4 679194391 678376436 679273546 681893408 686801851 693744421 701590121 710041702 719076693 727808893
864.8 727808893 735717475 742969453 749095201 753613889 757212400 760288358 762217045 762973249 763025463
883.1 763025463 762122989 760212958 758095860 756097734 754069865 752637506 752367258 752798378 753717422
901.5 753717422 755360126 757073998 758126438 758726239 758700311 757263780 754536986 751220107 747335553
919.8 747335553 743102312 739613593 737357318 736023128 735788524 736583054 737414241 737949967 738643944
938.2 738643944 739223957 739255607 739110172 738808393 737690389 735656977 732865155 728872955 723495126
956.6 723495126 717145264 709638298 700381398 689541399 677399218 663782120 649216533 634958744
$$ packed form
830.1G10025907m813374m500687m146695m207372l986657l504038l217757k454936
846.4F79194391q17955Q97110K619862M908443O942570P845700Q451581R034991Q732200
864.8G27808893P908582P251978O125748M518688L598511L075958J928687P56204N2214
883.1G63025463r02474j910031k117098j998126k027869j432359k70248M31120R19044
901.5G53717422J642704J713872J052440N99801k5928j436531k726794l316879l884554
919.8G47335553m233241l488719k256275j334190k34604P94530Q31187N35726O93977
938.2G38643944N80013L1650j45435l01779j118004k033412k791822l992200n377829
956.6G23495126o349862p506966r256900j0839999j2142181j3617098j4565587j4257789
$$ plain form
972.9 634958744 621752322 609933317 599882543 591411471 583831072 576925635 570779026 565130234
989.2 565130234 559986949 555743456 552242517 549097598 546455979 544330359 542155087 539482713
1005.5 539482713 536132574 531805217 526465476 520641565 514682949 508660316 502987862 497979194
1021.8 497979194 493360370 488965780 485022306 481497347 478157848 475143403 472611785 470369190
1038.1 470369190 468363583 466643870 464964509 463065803 461023867 459008992 457218826 456198066
1054.5 456198066 456417292 457736343 459691167 461766511 463164538 463111222 461452872 458488137 454608470
1072.8 454608470 450355500 446309268 442589283 438994855 435428083 431660801 427371919 422773510
1089.1 422773510 418529272 415226102 413256496 412789881 413533658 414836735 416303128 417733759 418808013
$$ packed form
972.9F34958744j3206422j1819005j0050774q471072p580399o905437o146609n648792
989.2E65130234n143285m243493l500939l144919k641619k125620k175272k672374
1005.5E39482713l350139m327357n339741n823911n958616o022633n672454n008668
1021.8D97979194m618824m394590l943474l524959l339499l014445k531618k242595
1038.1D70369190k005607j719713j679361j898706k041936k014875j790166j020760
1054.5D56198066K19226J319051J954824K075344J398027n3316j658350k964735l879667
1072.8D54608470m252970m046232l719985l594428l566772l767282m288882m598409
1089.1D22773510m244238l303170j969606m66615P43777J303077J466393J430631J074254
$$ plain form
1107.5 418808013 419342488 419346362 418586463 416592956 412989199 407694846 401699126 397331983 396056473
1125.8 396056473 396892875 398360193 399563670 400074780 400655836 402436644 405467838 408930570 412140071
1144.2 412140071 414903134 417227864 419149935 420972466 423107862 425655693 428699434 432599992
1160.5 432599992 437634856 443816185 451185942 459635675 468617082 477635145 486530989 495051354
1176.8 495051354 502930939 510162830 516596198 521818221 525589287 527866483 528542399 527835310 526533008
1195.2 526533008 525341511 524719536 525224447 527082562 529824317 532856584 535786510 538149774 539692342
1213.5 539692342 540777862 541768789 542612672 543405116 544437230 545693576 547115743 548922777 551123381
1231.9 551123381 553464651 555972159 558756888 561548054 564086556 566451907 568529487 570010841
$$ packed form
1107.5D18808013N34475L874p59899j993507l603757n294353n995720m367143j275510
1125.8C96056473Q36402J467318J203477N11110N81056J780808L031194L462732L209501
1144.2D12140071K763063K324730J922071J822531K135396K547831L043741L900558
1160.5D32599992N034864O181329P369757Q449733Q981407R018063Q895844Q520365
1176.8D95051354P879585P231891O433368N222023L771066K277196O75916p07089j302302
1195.2E26533008j191497o21975N04911J858115K741755L032267K929926K363264J542568
1213.5E39692342J085520R90927Q43883P92444J032114J256346J422167J807034K200604
1231.9E51123381K341270K507508K784729K791166K538502K365351K077580J481354
$$ plain form
1248.2 570010841 571009278 571786702 572294295 572671890 573364496 574503899 576073050 578320146 581347883
1266.6 581347883 584897816 588918030 593534112 598514855 603619397 608964384 614549339 620148361
1282.9 620148361 625847638 631848812 637890756 643688560 649333000 654703140 659503281 663880408
1299.2 663880408 668031216 671699762 674810410 677672029 680243790 682272136 683950543 685525477
1315.5 685525477 686885953 688117683 689527214 691034019 692456007 693877995 695175052 696001470 696456850
1333.9 696456850 696859658 697044730 696905613 697006941 697505713 698017955 698551834 699206412 699656546 699762046
1354.3 699762046 699780524 699727595 699203253 697970927 696463823 695034504 693609834 692405105 691082478
1372.6 691082478 689078271 687141001 685511231 683225393 680482805 678774059 678320527 678058863 677778840
$$ packed form
1248.2E70010841R98437P77424N07593L77595O92606J139403J569151K247096L027737
1266.6E81347883L549933M020214M616082M980743N104542N344987N584955N599022
1282.9F20148361N699277O001174O041944N797804N644440N370140M800141M377127
1299.2F63880408M150808L668546L110648K861619K571761K028346J678407J574934
1315.5F85525477J360476J231730J409531J506805J421988TJ297057Q26418M55380
1333.9F96456850M02808J85072j39117J01328M98772N12242N33879O54578M50134J05500
1354.3F99762046J8478n2929n24342j232326j507104j429319j424670j204729j322627
1372.6F91082478k004207j937270j629770k285838k742588j708746m53532k61664k80023
$$ plain form
1391 677778840 677322805 676127017 674363613 672161579 669656754 666969478 663841248 660741031 657918751
1409.3 657918751 655310035 653273284 651843250 650301754 648338854 646976113 646064878 645279348 644824147
1427.7 644824147 644199312 643623471 643750489 643904865 643817723 644414961 645603240 646890759 648358166
1446 648358166 650239468 652524829 655237436 658735394 663708210 669819117 675276935 680749774 687205851
1464.4 687205851 694214463 701300323 709246814 718641818 727405250 734126866 739350736 743555248
1480.7 743555248 747125030 749901533 751697659 752310872 751838028 751076639 750036538 747975647 745071471
1499.1 745071471 742429376 740614951 738165677 731978953 725996673 722239673 718808353 715367675
1515.4 715367675 712274075 709825516 706799924 703737557 701435208 698958635 697036803 695642889
$$ packed form
1391F77778840m56035j195788j763404k202034k504825k687276l128230l100217k822280
1409.3F57918751k608716k036751j430034j541496j962900j362741r11235p85530m55201
1427.7F44824147o24835n75841J27018J54376q7142N97238J188279J287519J467407
1446F48358166J881302K285361K712607L497958M972816O110907N457818N472839O456077
1464.4F87205851P008612P085860P946491R395004Q763432O721616N223870M204512
1480.7G43555248L569782K776503J796126O13213m72844p61389j040101k060891k904176
1499.1G45071471k642095j814425k449274o186724n982280l757000l431320l440678
1515.4G15367675l093600k448559l025592l062367k302349k476573j921832j393914
$$ plain form
1531.7 695642889 693718493 692368925 692101419 690997720 688770294 687496066 687197447 687484562 687934458
1550.1 687934458 688772619 690211952 691828609 692127824 690678358 690096557 689489424 688336015 686087251
1568.4 686087251 682142317 678622246 674870908 668058932 660972714 655123830 648563325 641175866
1584.7 641175866 633505881 625668466 617524207 609255672 600983441 592821181 584866643 577025414
1601.1 577025414 569246054 561626792 554103017 546476185 539188385 532747447 525748491 517121434
1617.4 517121434 510581374 505598187 499623060 493820518 488834083 484629542 482092470 480323344
1633.7 480323344 477946728 476692945 477294892 478888243 481282026 484440267 488284588 492244899
1650 492244899 496818870 502801239 508243680 513592064 519710124 526688218 534157157 541304588 548928082
$$ packed form
1531.7F95642889j924396j349568k67506j103699k227426j274228k98619K87115M49896
1550.1F87934458Q38161J439333J616657K99215j449466n81801o07133j153409k248764
1568.4F86087251l944934l520071l751338o811976p086218n848884o560505p387459
1584.7F41175866p669985p837415q144259q268535q272231q162260p954538p841229
1601.1E77025414p779360p619262p523775p626832p287800o440938o998956q627057
1617.4E17121434o540060m983187n975127n802542m986435m204541k537072j769126
1633.7D80323344k376616j253783O01947J593351K393783L158241L844321L960311
1650D92244899M573971N982369N442441N348384O118060O978094P468939P147431P623494
$$ plain form
1668.4 548928082 557508171 565552235 573709190 582480073 590877593 599130273 608045340 618760467
1684.7 618760467 628437221 636606455 645011663 653168917 662055969 671761155 681361377 691956699
1701 691956699 700685620 708010733 715423763 721847117 727443814 732907534 738346457 743250966 747213602
1719.3 747213602 750812232 754201591 757362485 760556221 763948441 767063797 769948840 772890389
1735.7 772890389 775655389 778553307 781855404 785330296 788741350 792306483 795958698 799093843
1752 799093843 801768422 804542124 807175159 809284091 811266661 813216150 814914286 816539943 818302751
1770.3 818302751 819677591 820636153 821867287 823258817 824372828 825406671 826601982 827702940
1786.7 827702940 828813076 830096722 831146359 831806660 832648039 833634973 834332287 834870636 835620701
$$ packed form
1668.4E48928082Q580089Q044064Q156955Q770883Q397520Q252680Q915067J0715127
1684.7F18760467R676754Q169234Q405208Q157254Q887052R705186R600222J0595322
1701F91956699Q728921P325113P413030O423354N596697N463720N438923M904509L962636
1719.3G47213602L598630L389359L160894L193736L392220L115356K885043K941549
1735.7G72890389K765000K897918L302097L474892L411054L565133L652215L135145
1752G99093843K674579K773702K633035K108932J982570J949489J698136J625657J762808
1770.3H18302751J374840R58562J231134J391530J114011J033843J195311J100958
1786.7H27702940J110136J283646J049637O60301Q41379R86934O97314N38349P50065
$$ plain form
1805 835620701 836414933 837024331 837587178 838113129 838518858 838958025 839593828 840232790 840754867 841332316
1825.4 841332316 841940284 842227697 842349768 842746139 843161166 843442440 843900204 844505906 844787955 844866514
1845.8 844866514 845136523 845380127 845555305 845848680 846176565 846361578 846546054 846876919 847280025 847659051
1866.2 847659051 847876906 847839177 847789943 847944379 848194778 848324001 848379850 848576486 848804057 848936737
1886.6 848936737 849088073 849234223 849247336 849218786 849325180 849441886 849450886 849548101 849746346 849799573 849767625
1909 849767625 849827468 849856734 849862039 849989235 850084484 849977672 849865198 849902332 849874318 849776447 849832833
1931.5 849832833 849833488 849617302 849539876 849667847 849595010 849350154 849273264 849169254 848931551 848841131 848799825
1953.9 848799825 848551869 848331511 848295748 848144770 847921252 847859323 847712576 847399652 847263575 847250938
$$ packed form
1805H35620701P94232O09398N62847N25951M05729M39167O35803O38962N22077N77449
1825.4H41332316O07968K87413J22071L96371M15027K81274M57764O05702K82049P8559
1845.8H44866514K70009K43604J75178K93375L27885J85013J84476L30865M03106L79026
1866.2H47659051K17855l7729m9234J54436K50399J29223N5849J96636K27571J32680
1886.6H48936737J51336J46150J3113k8550J06394J16706R000R7215J98245N3227l1948
1909H49767625N9843K9266N305J27196R5249j06812j12474L7134k8014r7871N6386
1931.5H49832833O55k16186p7426J27971p2837k44856p6890j04010k37703r0420m1306
1953.9H48799825k47956k20358l5763j50978k23518o1929j46747l12924j36077j2637
$$ plain form
1974.3 847250938 847044230 846816838 846776843 846664608 846419692 846342742 846360326 846161425 845867813 845714092
1994.7 845714092 845548928 845316887 845194161 845045447 844737351 844493866 844365537 844143748 843914986 843826532
2015.1 843826532 843649328 843307078 843050897 842891276 842657864 842444301 842329800 842152238 841905475 841738343
2035.5 841738343 841591835 841355205 841156781 841045201 840851784 840602398 840460598 840342760 840171337 840056241
2055.9 840056241 839976251 839818597 839653492 839569151 839441717 839258611 839181900 839164615 839048207 838920236
2076.3 838920236 838899195 838858426 838738859 838674366 838656902 838568509 838462591 838433325 838408411 838334858 838312030
2098.7 838312030 838328421 838288367 838248074 838249743 838223815 838194251 838251948 838316381 838296771 838279963 838317096 838339567
2123.2 838339567 838364899 838460922 838560700 838615060 838692367 838785887 838829577 838881671 838996947 839092135 839125633
$$ packed form
1974.3H47250938k06708k27392l9995j12235k44916p6950J7584j98901k93612j53721
1994.7H45714092j65164k32041j22726j48714l08096k43485j28329k21789k28762q8454
2015.1H43826532j77204l42250k56181j59621k33412k13563j14501j77562k46763j67132
2035.5H41738343j46508k36630j98424j11580j93417k49386j41800j17838j71423j15096
2055.9H40056241p9990j57654j65105q4341j27434j83106p6711j7285j16408j27971
2076.3H38920236k1041m0769j19567o4493j7464q8393j05918k9266k4914p3553k2828
2098.7H38312030J6391m0054m0293J669k5928k9564N7697O4433j9610j6808L7133K2471
2123.2H38339567K5332R6023R9778N4360P7307R3520M3690N2094J15276R5188L3498
$$ plain form
2145.6 839125633 839211702 839356184 839441478 839517891 839648247 839757740 839830458 839938283 840063155 840142131
2166 840142131 840242028 840425730 840608418 840725482 840824306 840921283 840992749 841083050 841231525 841365695 841452718
2188.4 841452718 841552675 841627717 841638148 841678619 841773093 841828525 841861784 841956377 842029691 842010498 842030942
2210.9 842030942 842123508 842157841 842171252 842228174 842239201 842210829 842221200 842218816 842186689 842237234 842345774
2233.3 842345774 842357755 842317224 842329443 842287481 842156053 842096925 842124760 842095673 842036545 842046320 842011213
2255.8 842011213 841892242 841850638 841871440 841826141 841808736 841902435 841940582 841904700 841960728 842038453 842017293
2278.2 842017293 842044592 842173994 842250168 842296779 842404723 842462242 842430949 842445195 842488050 842518270 842629731
2300.6 842629731 842777431 842790484 842711508 842731118 842809021 842841566 842954636 843147218 843188405 843099177 843104064
$$ packed form
2145.6H39125633Q6069J44482Q5294P6413J30356J09493P2718J07825J24872P8976
2166H40142131R9897J83702J82688J17064R8824R6977P1466R0301J48475J34170Q7023
2188.4H41452718R9957P5042J0431M0471R4474N5432L3259R4593P3314j9193K0444
2210.9H42030942R2566L4333J3411N6922J1027k8372J0371k384l2127N0545J08540
2233.3H42345774J1981m0531J2219m1962j31428n9128K7835k9087n9128R775l5107
2255.8H42011213j18971m1604K0802m5299j7405R3699L8147l5882N6028P7725k1160
2278.2H42017293K7299J29402P6174M6611J07944N7519l1293J4246M2855L0220J11461
2300.6H42629731J47700J3053p8976J9610P7903L2545J13070J92582M1187q9228M887
$$ plain form
2323.1 843104064 843180299 843217432 843271613 843301773 843225539 843215287 843377233 843478143 843369603 843257666 843321741
2345.5 843321741 843705833 844276786 844660819 844684005 844488978 844249308 844038248 843915701 844006836 844249904
2365.9 844249904 844487250 844735384 845026851 845291913 845513105 845795631 846148491 846476376 846761465 846997797
2386.3 846997797 847155631 847271562 847367287 847414494 847469389 847579777 847650290 847632051 847638190 847711682 847743630
2408.7 847743630 847721457 847715497 847709894 847689450 847689688 847688317 847651005 847593307 847531378 847491384 847481728 847472489 847452581
2435.2 847452581 847424567 847368717 847277224 847173929 847071826 846959889 846866786 846837759 846806228 846708775 846605182
2457.7 846605182 846527755 846446395 846374929 846312225 846203387 846071541 845991254 845917761 845776796 845624506 845501065
2480.1 845501065 845373750 845268190 845202684 845099390 844937742 844808519 844702005 844559848 844434321 844335556
$$ packed form
2323.1H43104064P6235L7133N4181L0160p6234j0252J61946J00910j08540j11937O4075
2345.5H43321741L84092N70953L84033K3186j95027k39670k11060j22547R1135K43068
2365.9H44249904K37346K48134K91467K65062K21192K82526L52860L27885K85089K36332
2386.3H46997797J57834J15931R5725M7207N4895J10388P0513j8239O139P3492L1948
2408.7H47743630k2173n960n603k0444K38j371l7312n7698o1929l9994r656r239j9908
2435.2H47452581k8014n5850r1493j03295j02103j11937r3103k9027l1531r7453j03593
2457.7H46605182p7427q1360p1466o2704j08838j31846q0287p3493j40965j52290j23441
2480.1H45501065j27315j05560o5506j03294j61648j29223j06514j42157j25527r8765
$$ plain form
2500.5 844335556 844203174 844086230 844020665 843904972 843742549 843657136 843597293 843444526 843287349 843192875
2520.9 843192875 843048215 842854261 842746198 842670023 842517495 842405081 842367828 842247427 842064142 841952682
2541.3 841952682 841841280 841667473 841536522 841442168 841311157 841167271 841003001 840793550 840634048 840563655
2561.7 840563655 840423346 840172589 839987993 839870691 839668095 839426756 839239538 839006126 838680327 838410079
2582.1 838410079 838196039 837909698 837603390 837341309 837029338 836655378 836315691 835970521 835594952 835291326
2602.5 835291326 835008323 834607542 834158003 833782673 833425641 833017051 832632124 832289934 831877053 831429422
2622.9 831429422 831031799 830593348 830114543 829728842 829365194 828879952 828409970 828080416 827740669 827327788
2643.3 827327788 826940417 826532602 826058507 825634420 825275958 824885309 824493647 824159026 823799729 823369443
$$ packed form
2500.5H44335556j32382j16944o5565j15693j62423q5413n9843j52767j57177r4474
2520.9H43192875j44660j93954j08063p6175j52528j12414l7253j20401j83285j11460
2541.3H41952682j11402j73807j30951r4354j31011j43886j64270k09451j59502p0393
2561.7H40563655j40309k50757j84596j17302k02596k41339j87218k33412l25799k70248
2582.1H38410079k14040k86341l06308k62081l11971l73960l39687l45170l75569l03626
2602.5H35291326k83003m00781m49539l75330l57032m08590l84927l42190m12881m47631
2622.9H31429422l97623m38451m78805l85701l63648m85242m69982l29554l39747m12881
2643.3H27327788l87371m07815m74095m24087l58462l90649l91662l34621l59297m30286
$$ plain form
2663.7 823369443 822946668 822567701 822204649 821888864 821621358 821274400 820833385 820442080 820055246 819591522
2684.1 819591522 819208443 818894207 818446994 817952335 817581832 817216575 816750288 816304088 815889359 815400779
2704.5 815400779 814895749 814434230 813899398 813297033 812790155 812310636 811747372 811236799 810815334 810335875
2724.8 810335875 809803426 809317827 808814704 808264613 807818174 807435334 806953609 806466281 806057930 805609643
2745.2 805609643 805135787 804728091 804254293 803645134 803081512 802599192 802032828 801402569 800828755 800237596
2765.6 800237596 799593091 799025357 798516333 797903121 797161877 796368182 795541406 794738293 794020772 793296516
2786 793296516 792497575 791689634 790857017 789918125 788958788 788064420 787074983 785943031 784845769 783795595
2806.4 783795595 782684863 781508923 780283928 778985858 777653098 776351988 774986088 773435056
$$ packed form
2663.7H23369443m22775l78967l63052l15785k67506l46958m41015l91305l86834m63724
2684.1H19591522l83079l14236m47213m94659l70503l65257m66287m46200m14729m88580
2704.5H15400779n05030m61519n34832o02365n06878m79519n63264n10573m21465m79459
2724.8H10335875n32449m85599n03123n50091m46439l82840m81725m87328m08351m48287
2745.2H05609643m73856m07696m73798o09159n63622m82320n66364o30259n73814n91159
2765.6H00237596o44505n67734n09024o13212p41244p93695q26776q03113p17521p24256
2786G93296516p98941q07941q32617r38892r59337q94368r89437j131952j097262j050174
2806.4G83795595j110732j175940j224995j298070j332760j301110j365900j551032
$$ plain form
2822.7 773435056 771778762 770045161 768106222 765932441 763514221 760668337 757223785 753064454
2839.1 753064454 747930944 741522551 733824193 725502849 717973113 712671340 710149467 709967852
2855.4 709967852 711294413 713236868 714848578 715458393 714958429 713600576 711852729 710303187 709212482
2873.7 709212482 708389997 707602441 706689119 705470264 703825176 701748133 699332178 696672440 693858087
2892.1 693858087 690989375 688060403 684973538 681746483 678444922 674903750 670886099 666244924
2908.4 666244924 660687983 653862596 645985544 638109148 631385446 626441061 623528540 622631788
2924.7 622631788 623528838 625896513 629233062 633122087 637498438 642286360 647128046 651686668
2941 651686668 655727327 658876002 660827637 661744177 662118375 662299037 662564099 663311839 664749920
$$ packed form
2822.7G73435056j656294j733601j938939k173781k418220k845884l444552m159331
2839.1G53064454n133510o408393p698358q321344p529736n301773k521873j81615
2855.4G09967852J326561J942455J611710O09815m99964j357853j747847j549542j090705
2873.7G09212482q22485p87556r13322j218855j645088k077043k415955k659738k814353
2892.1F93858087k868712k928972l086865l227055l301561l541172m017651m641175
2908.4F66244924n556941o825387p877052p876396o723702m944385k912521q96752
2924.7F22631788Q97050K367675L336549L889025M376351M787922M841686M558622
2941F51686668M040659L148675J951635R16540L74198J80662K65062P47740J438081
$$ plain form
2959.4 664749920 666807353 669292331 672020316 674838960 677591264 680215180 682646334 684741855
2975.7 684741855 686573446 688293934 689788640 690997005 692085326 693115592 694023311 694681048 694933116
2994.1 694933116 694882154 694635570 694132030 693469167 692719519 691921532 691242158 690698385 690078139 689195991
3014.5 689195991 688071787 686856389 685616851 684331417 682982087 681559801 680133879 678746104
3030.8 678746104 677358687 675875843 674237251 672589183 670988560 669271350 667343736 665312350
3047.1 665312350 663370848 661507547 659543753 657489061 655452669 653466880 651550889 649693906
3063.4 649693906 647903323 646105826 644142270 642071307 640108883 638366520 636714339 634896278
3079.7 634896278 632893801 630837739 628737509 626648426 624641120 622598052 620424807 618239939
$$ packed form
2959.4F64749920K057433K484978K727985K818644K752304K623916K431154K095521
2975.7F84741855J831591J720488J494706J208365J088321J030266R07719O57737K52068
2994.1F94933116n0962k46584n03540o62863p49648p97987o79374n43773o20246q82148
3014.5F89195991j124204j215398j239538j285434j349330j422286j425922j387775
3030.8F78746104j387417j482844j638592j648068j600623j717210j927614k031386
3047.1F65312350j941502j863301j963794k054692k036392j985789j915991j856983
3063.4F49693906j790583j797497j963556k070963j962424j742363j652181j818061
3079.7F34896278k002477k056062k100230k089083k007306k043068k173245k184868
$$ plain form
3096 618239939 616184175 614117026 611847341 609525442 607336998 605181813 602871478 600489199 598216057
3114.4 598216057 595940828 593518078 590874434 588001192 585145950 582486689 579925001 577250838
3130.7 577250838 574408233 571617484 568969548 566286504 563390613 560323477 557282388 554340959
3147 554340959 551484704 548669338 545714736 542510986 539216638 535998106 532861292 529743791 526595771
3165.4 526595771 523405969 520214915 517062128 513914943 510728419 507476628 504245758 501094103
3181.7 501094103 497936249 494747013 491575032 488424808 485260069 482085049 478908539 475719094
3198 475719094 472550511 469437003 466367394 463342100 460344553 457360089 454402775 451486349 448638827
3216.4 448638827 445808560 442938060 440086067 437315702 434602916 431934118 429367661 426863134
$$ packed form
3096F18239939k055764k067149k269685k321899k188444k155185k310335k382279k273142
3114.4E98216057k275229k422750k643644k873242k855242k659261k561688k674163
3130.7E77250838k842605k790749k647936k683044k895891l067136l041089k941429
3147E54340959k856255k815366k954602l203750l294348l218532l136814l117501l148020
3165.4E26595771l189802l191054l152787l147185l186524l251791l230870l151655
3181.7E01094103l157854l189236l171981l150224l164739l175020l176510l189445
3198D75719094l168583l113508l069609l025294k997547k984464k957314k916426k847522
3216.4D48638827k830267k870500k851993k770365k712786k668798k566457k504527
$$ plain form
3232.7 426863134 424270719 421619475 419047892 416561127 414162785 411878556 409636021 407345146
3249 407345146 405052781 402839631 400705159 398599535 396459788 394313663 392227739 390173018 388132960
3267.4 388132960 386196852 384313643 382299453 380146831 378000379 375932366 373891443 371855527
3283.7 371855527 369884193 367992818 366140962 364280671 362330675 360226333 358032078 355920315
3300 355920315 353972524 352132648 350260228 348205060 345981479 343714178 341500014 339372814 337299377
3318.4 337299377 335249931 333231539 331225365 329126269 326922148 324785322 322769076 320817173
3334.7 320817173 318925142 316970617 314871103 312774599 310730785 308752149 306934774 305087388
3351 305087388 303002268 300849617 298871100 297071218 295312703 293595344 292034417 290569156 288963765
$$ packed form
3232.7D26863134k592415k651244k571583k486765k398342k284229k242535k290875
3249D07345146k292365k213150k134472k105624k139747k146125k085924k054721k040058
3267.4C88132960j936108j883209k014190k152622k146452k068013k040923k035916
3283.7C71855527j971334j891375j851856j860291j949996k104342k194255k111763
3300C55920315j947791j839876j872420k055168k223581k267301k214164k127200k073437
3318.4C37299377k049446k018392k006174k099096k204121k136826k016246j951903
3334.7C20817173j892031j954525k099514k096504k043814j978636j817375j847386
3351C05087388k085120k152651j978517j799882j758515j717359j560927j465261j605391
$$ plain form
3369.3 288963765 287121028 285287023 283724725 282379448 281140685 279932469 278772056 277812809
3385.7 277812809 277196705 276885301 276481330 275708228 274912626 274595380 274627298 274346888 273619860 273062438
3406.1 273062438 272956461 273047984 273125798 273094952 273035824 273162365 273451090 273797929 274356544 275213867
3426.5 275213867 276216626 277155399 278147489 279349118 280435085 281179875 281926781 283059061 284502625
3444.8 284502625 285999686 287512064 289159447 290919453 292772382 294802785 296959281 299010843
3461.1 299010843 301075339 303547293 306254655 308593422 310410172 312236071 314471543 317115813
3477.4 317115813 319831759 322211713 324505270 327113479 329803139 332395464 335107237 338000238
3493.8 338000238 341019571 343997449 346903205 349824816 352631211 355325431 358160436 361326963
$$ packed form
3369.3B88963765j842737j834005j562298j345277j238763j208216j160413r59247
3385.7B77812809o16104l11404m03971p73102p95602l17246L1918k80410p27028n57422
3406.1B73062438j05977R1523P7814l0846n9128J26541K88725L46839N58615Q57323
3426.5B75213867J002759R38773R92090J201629J085967P44790P46906J132280J443564
3444.8B84502625J497061J512378J647383J760006J852929K030403K156496K051562
3461.1B99010843K064496K471954K707362K338767J816750J825899K235472K644270
3477.4C17115813K715946K379954K293557K608209K689660K592325K711773K893001
3493.8C38000238L019333K977878K905756K921611K806395K694220K835005L166527
$$ plain form
3510.1 361326963 364797741 368208975 371339351 374517053 378010094 381773978 385420948 388717681
3526.4 388717681 392028302 395660639 399571270 403672516 407748550 411714286 415957600 420480639
3542.7 420480639 424806505 428773612 432775199 436966687 441259772 445717275 450391650 455283821
3559 455283821 460277855 465091109 469557464 474353462 479865879 485310048 490475327 495750904 501277804
3577.4 501277804 507111430 513278902 519501090 525368214 530943990 536956906 543159008 549192905
3593.7 549192905 555396795 561892867 568355203 574784756 581302404 587601066 593838334 600305617
3610 600305617 606788039 613334417 619791746 625927746 632300854 638850868 645146072 650946915 656381309
3628.4 656381309 662408113 668513000 674238861 679757774 685088336 690348387 695621490 700761139
$$ packed form
3510.1C61326963L470778L411234L130376L177702L493041L763884L646970L296733
3526.4C88717681L310621L632337L910631M101246M076034L965736M243314M523039
3542.7D20480639M325866L967107M001587M191488M293085M457503M674375M892171
3559D55283821M994034M813254M466355M795998N512417N444169N165279N275577N526900
3577.4E01277804N833626O167472O222188N867124N575776O012916O202102O033897
3593.7E49192905O203890O496072O462336O429553O517648O298662O237268O467283
3610F00305617O482422O546378O457329O136000O373108O550014O295204N800843N434394
3628.4F56381309O026804O104887N725861N518913N330562N260051N273103N139649
$$ plain form
3644.7 700761139 705510795 709931016 714408934 718794763 722717822 726603568 730660737 734310806
3661 734310806 737572610 740927637 744135678 746683478 749328136 752084792 753878951 755616724 757948577
3679.4 757948577 760295868 762756348 765406370 767829835 769407511 770584702 772149265 773911476
3695.7 773911476 775580585 776987016 778028131 779192984 780736864 782186687 783004880 783272207 784089625
3714 784089625 785377264 786455274 787279606 787999570 788542032 788994968 789840221 790933728 791791022
3732.4 791791022 792160630 792355716 793139994 794287503 794658065 794172823 794749320 795681536 795499206
3750.7 795499206 795489073 796444416 797349632 797651052 797890246 798425078 798870623 799173653 799299061 799319148
3771.1 799319148 799663782 800326169 800952017 801160812 801230252 801458240 801625311 801808059 802149892 802587748
$$ packed form
3644.7G00761139M749656M420221M477918M385829L923059L885746M057169L650069
3661G34310806L261804L355027L208041K547800K644658K756656J794159J737773K331853
3679.4G57948577K347291K460480K650022K423465J577676J177191J564563J762211
3695.7G73911476J669109J406431J041115J164853J543880J449823Q18193K67327Q17418
3714G84089625J287639J078010Q24332P19964N42462M52936Q45253J093507Q57294
3732.4G91791022L69608J95086P84278J147509L70562m85242N76497R32216j82330
3750.7G95499206j0133R55343R05216L01420K39194N34832M45545L03030J25408K0087
3771.1G99319148L44634O62387O25848K08795O9440K27988J67071J82748L41833M37856
$$ plain form
3791.5 802587748 802987456 803244233 803606272 803788364 803397536 803469419 803664505 803496599 803884983 804726362
3811.9 804726362 805191636 805093229 805295706 805271327 804757595 804940462 805326045 805527925 805706382 805949569
3832.3 805949569 806450546 806693256 806257308 805910051 805915475 806069970 806493759 807211637 807660282 806569219
3852.7 806569219 805171311 805606067 806472838 806969047 807003558 806881845 807017744 806833327 806439579 806450665
3873.1 806450665 806661248 807069361 807195902 807104588 807268441 807100713 806997776 807195783 807000339 806904197
3893.5 806904197 807334721 807649493 807519913 807151079 806698680 806484520 806629658 806816161 807024539 807311356
3913.9 807311356 807420850 807288051 807175338 807142854 807029784 806962073 807135761 807250977 807134807 807125688
3934.3 807125688 807240427 807324111 807353914 807272136 807296574 807407737 807353318 807339489 807474554 807576060 807627261
$$ packed form
3791.5H02587748L99708K56777L62039J82092l90828P1883J95086j67906L88384Q41379
3811.9H04726362M65274r8407K02477k4379n13732J82867L85583K01880J78457K43187
3832.3H05949569N00977K42710m35948l47257N424J54495M23789P17878M48645j091063
3852.7H06569219j397908M34756Q66771M96209L4511j21713J35899j84417l93748J1086
3873.1H06450665K10583M08113J26541r1314J63853j67728j02937J98007j95444r6142
3893.5H06904197M30524L14772j29580l68834m52399k14160J45138J86503K08378K86817
3913.9H07311356J09494j32799j12713l2484j13070o7711J73688J15216j16170r119
3934.3H07125688J14739Q3684K9803q1778K4438J11163n4419j3829J35065J01506N1201
$$ plain form
3956.7 807627261 807683110 807672083 807606459 807626605 807719111 807816803 807957411 808101594 808141589 808141649 808201432 808307171
3981.2 808307171 808400691 808442473 808472931 808502674 808523417 808577538 808664322 808756828
3997.5 808756828
$$ packed form
3956.7H07627261N5849j1027o5624K0146R2506R7692J40608J44183L9995O0N9783J05739
3981.2H08307171R3520M1782L0458K9743K0743N4121Q6784R2506
3997.5H08756828
##END=$$ End of the data block
