##TITLE=$$ Begin of the data block
##JCAMP-DX=5.00 $$ ACD/SpecManager v 10.08
##SPECTROMETER/DATA SYSTEM=Alpha
##DATE=10 Apr 2014 11:00:52
##DATA TYPE=INFRARED SPECTRUM
##DATA CLASS=XYDATA
##ORIGIN=
##OWNER=
##NPOINTS=1765
##FIRSTX=399.75695801
##LASTX=3997.56933594
##MAXX=3997.56933594
##MINX=399.75695801
##MAXY=0.85030729
##MINY=0.27400273
##XFACTOR=1.0000000000
##YFACTOR=1.000000000000000e-9
##FIRSTY=0.62059408
##DELTAX=2.03957629
##XUNITS=1/CM
##YUNITS=ARBITRARY UNITS
##XYDATA=(X++(Y..Y))
399.8F20594084j577854j050949j468539q60214m76718j352847j203060J14143p3493
$$ 620594084 619016230 617965281 616496742 615636528 615159810 613806963 612603903 612718046 612644553
418.1F12644553j484513j050353n43416n19275L2484j64091j265169j260519p58290
$$ 612644553 611160040 610109687 609566271 609046996 609079480 608915389 607650220 606389701 605631411
436.5F05631411r81331n05805M37558M5597o40451k18273j25646o98865k51412K02060
$$ 605631411 604650080 604144275 604581833 604627430 603986979 603768706 603643060 602944195 602692783 602894843
456.9F02894843p91192j124502o27875r61423j185894n18322n96762j347780q49902
$$ 602894843 602103651 600979149 600351274 599389851 598203957 597685635 597088873 595741093 594891191
475.2E94891191m59671j153946r56953q5473m54664j010895n12898n13792j203299
$$ 594891191 594431520 593277574 592320621 592235148 591780484 590769589 590256691 589742899 588539600
493.6E88539600r79602o40035j043200j026333n78165p35402r77754q23736j029194
$$ 588539600 587559998 586919963 585876763 584850430 584272265 583536863 582559109 581735373 580706179
511.9E80706179j307011r10818q75890j527429j372516r01520j583398k090752j239538
$$ 580706179 579399168 578488350 577612460 576085031 574712515 573810995 572227597 570136845 568897307
530.3E68897307q59261j387238j236200o93441q51691q58366m37558p32541j266658
$$ 568897307 568038046 566650808 565414608 564721167 563869476 563011110 562573552 561841011 560574353
548.6E60574353j030445q92401j218319j181543j204193j657486j782417j700222k200187
$$ 560574353 559543908 558651507 557433188 556251645 555047452 553389966 551607549 549907327 547707140
567E47707140k765417k493262k127528k342582k345264j965999k044201k140999j722455
$$ 547707140 544941723 542448461 540320933 537978351 535633087 533667088 531622887 529481888 527759433
585.4E27759433j596749j865029j803816j626789j752138j805246j798749k283633
$$ 527759433 526162684 524297655 522493839 520867050 519114912 517309666 515510917 513227284
601.7E13227284k687156k026141j099288q07584o38365k21372L28481J586855L323376
$$ 513227284 510540128 508513987 507414699 506607115 505968750 505747378 506075859 507662714 510986090
620E10986090M084468M017829M149139M269064L826797L505826L552914L163576K491712
$$ 510986090 515070558 519088387 523237526 527506590 531333387 534839213 538392127 541555703 544047415
638.4E44047415K033711J264512Q15451J990080L198147K271772L30328l31580J202762
$$ 544047415 546081126 547345638 548161089 550151169 553349316 555621088 555951416 555619836 556822598
656.7E56822598M182756O192267N730688L877461L166914M127145L449977K719462
$$ 556822598 561005354 567197621 572928309 576805770 579972684 584099829 587549806 590269268
673.1E90269268L086984L122091K571821K482176K604544K112568J757800J974941
$$ 590269268 593356252 596478343 599050164 601532340 604136884 606249452 608007252 609982193
689.4F09982193J735448J147807J222014J260281P62463Q34822J454592J477778J396537
$$ 609982193 611717641 612865448 614087462 615347743 616110206 616945028 618399620 619877398 621273935
707.7F21273935J938879K186060J915038K103448K403140K155244K214611K658665
$$ 621273935 623212814 625398874 627313912 629417360 631820500 633975744 636190355 638849020
724F38849020K466798J973271K158880K345443J917184J766562J928985J660884J440286
$$ 638849020 641315818 643289089 645447969 647793412 649710596 651477158 653406143 655067027 656507313
742.4F56507313J801670J826823J425862J653790K029896J682222J517713J919329
$$ 656507313 658308983 660135806 661561668 663215458 665245354 666927576 668445289 670364618
758.7F70364618J816452J413524J572967J626133J119674R61900R64403K88784m01437
$$ 670364618 672181070 673594594 675167561 676793694 677913368 678875268 679839671 680128455 679727018
777.1F79727018n39959q93950j377344j010657k93731J08003J020909K557993L571093
$$ 679727018 679187059 678293109 676915765 675905108 675611377 675719380 676740289 679298282 682869375
795.4F82869375M260838N310058N827129N410433N054176M755139L802777K910971
$$ 682869375 687130213 692440271 698267400 703677833 708732009 713487148 717289925 720200896
811.7G20200896K586007J844943O15358j49905r28164k339840l409207l819883m428744
$$ 720200896 722786903 724631846 725247204 725097299 724169135 721829295 718420088 714600205 710171461
830.1G10171461m877746m473329m120230m215896l892720l315270l105104k464175
$$ 710171461 705293715 700820386 696700156 692484260 688591540 685276270 682171166 679706991
846.4F79706991q27968R07778K589763M861712O879747P784724Q451343R078800Q756698
$$ 679706991 678879023 679786801 682376564 687238276 694118023 701902747 710354090 719432890 728189588
864.8G28189588P880687P211924O074786M483521L631294L110766J910568P38084R3222
$$ 728189588 736070275 743282199 749356985 753840506 757471800 760582566 762493134 763231218 763324440
883.1G63324440q68798j918018k132535k037525k080262j460671k39134N21839R71913
$$ 763324440 762455642 760537624 758405089 756367564 754287302 752826631 752587497 753109336 754081249
901.5G54081249J578748J622439J000702N56648l5644j415073k695620l296197l912270
$$ 754081249 755659997 757282436 758283138 758839786 758804142 757389069 754693449 751397252 747484982
919.8G47484982m250467l469288k276182j371682k50101P90059Q45552N28097O38902
$$ 747484982 743234515 739765227 737489045 736117363 735867262 736657321 737502873 738030970 738669872
938.2G38669872N26846N305j51515l00885j132250k021908k745688l980398n399466
$$ 738669872 739196718 739202023 739050508 738749623 737617373 735595465 732849777 728869379 723469913
956.6G23469913o385982p535040r243071j0833383j2177646j3626397j4497995j4149428
$$ 723469913 717083931 709548891 700305820 689472437 677294791 663668394 649170399 635020971
972.9F35020971j3137519j1828840j0108590q517742p548690o838262o139934n654872
$$ 635020971 621883452 610054612 599946022 591428280 583879590 577041328 570901394 565246522
989.2E65246522n119979m250765l543854l190815k658963k115250k220094k760530
$$ 565246522 560126543 555875778 552331924 549141109 546482146 544366896 542146802 539386272
1005.5E39386272l376901m292011n306900n810499n933225n975187n628287m976243
$$ 539386272 536009371 531717360 526410460 520599961 514666736 508691549 503063262 498087019
1021.8D98087019m596055m394799l965497l546536l328502k965749k476215k230555
$$ 498087019 493490964 489096165 485130668 481584132 478255630 475289881 472813666 470583111
1038.1D70583111k045989j730621j653373j910657k067297j987756j742869j012594
$$ 470583111 468537122 466806501 465153128 463242471 461175174 459187418 457444549 456431955
1054.5D56431955K14130J335084J951933K029389J353354p4983j656681k951056l870607
$$ 456431955 456646085 457981169 459933102 461962491 463315845 463240862 461584181 458633125 454762518
1072.8D54762518m210710l987044l715128l611207l574371l791750m310012m586100
$$ 454762518 450551808 446564764 442849636 439238429 435664058 431872308 427562296 422976196
1089.1D22976196m199237l257811j935243m43995P36355J296073J477033J439512J092822
$$ 422976196 418776959 415519148 413583905 413139910 413876265 415172338 416649371 418088883 419181705
1107.5D19181705N50508j9491p99715k005160l575295n261869o006360m405707j325696
$$ 419181705 419732213 419712722 418913007 416907847 413332552 408070683 402064323 397658616 396332920
1125.8C96332920P73370J432657J225740N46366N96285J796364L051937L455103L160208
$$ 396332920 397106290 398538947 399764687 400311053 400907338 402703702 405755639 409210742 412370950
1144.2D12370950K723455K325148J955807J859009K111167K480388L028005L935576
$$ 412370950 415094405 417419553 419375360 421234369 423345536 425825924 428853929 432789505
1160.5D32789505N034416O162376P381409Q447021Q962572R031266Q915543Q495629
$$ 432789505 437823921 443986297 451367706 459814727 468777299 477808565 486724108 495219737
1176.8D95219737P815272P180929O429553N223930L735960K231359O56605o92964j266837
$$ 495219737 503035009 510215938 516645491 521869421 525605381 527836740 528493345 527800381 526533544
1195.2E26533544j161098o07849N23985J877904K719581K975523K907038K400875J606763
$$ 526533544 525372446 524764597 525288582 527166486 529886067 532861590 535768628 538169503 539776266
1213.5E39776266J123190R81450Q23736P84278J025557J252413J430214J809477K197206
$$ 539776266 540899456 541880906 542704642 543488920 544514477 545766890 547197104 549006581 551203787
1231.9E51203787K369941K558469K809227K776384K530337K378881K083957J501858
$$ 551203787 553573728 556132197 558941424 561717808 564248145 566627026 568710983 570212841
1248.2E70212841J036882P94054M98294L62635O74367J118541J563012K263308L036797
$$ 570212841 571249723 572043777 572542071 572904706 573579073 574697614 576260626 578523934 581560731
1266.6E81560731L518403L959476M549146M928470N080283N338609N576551N588054
$$ 581560731 585079134 589038610 593587756 598516226 603596509 608935118 614511669 620099723
1282.9F20099723N710066O025552O044150N765974N614818N392730M861235M426599
$$ 620099723 625809789 631835341 637879491 643645465 649260283 654653013 659514248 663940847
1299.2F63940847M165590L675759L141582K879798K544940K009928J691043J576245
$$ 663940847 668106437 671782196 674923778 677803576 680348516 682358444 684049487 685625732
1315.5F85625732J347184J223564J425147J527489J399934J405656J349092Q98897
$$ 685625732 686972916 688196480 689621627 691149116 692549050 693954706 695303798 696202695
1331.8F96202695N03242M28558J90437j54496N9665M52995M95136N27382O47783M73797
$$ 696202695 696705937 697134495 697324932 697170436 697230101 697683096 698178232 698705614 699353397 699827194
1352.2F99827194J51932L9638p2003n39541j211465j504123j474023j446366j180172
$$ 699827194 699979126 700018764 699946761 699407220 698195755 696691632 695217609 693771243 692591071
1370.6F92591071j311838k023042j954138j635551k290488k731979j675725m37498
$$ 692591071 691279233 689256191 687302053 685666502 683376014 680644035 678968310 678530812
1386.9F78530812k68101k69592m43220j201213j747668k167344k496123k702057l146410
$$ 678530812 678262711 677993119 677549899 676348686 674601018 672433674 669937551 667235494 664089084
1405.3F64089084l096402k793670k596080k059698j449704j520753j932621j367390
$$ 664089084 660992682 658199012 655602932 653543234 652093530 650572777 648640156 647272766
1421.6F47272766r08196p62940m40776o18160n90145P7009J07050q2374O07967J153112
$$ 647272766 646364570 645601630 645160854 644542694 643952549 644029558 644136608 644054234 644662201 645815313
1442F45815313J237094J459480J909852K300262K711952L509581M997253O088376N414069
$$ 645815313 647052407 648511887 650421739 652722001 655433953 658943534 663940787 670029163 675443232
1460.3F75443232N472422O482124P018149P076025P931292R378612Q750498O713927
$$ 675443232 680915654 687397778 694415927 701491952 709423244 718801856 727552354 734266281
1476.6G34266281N226314M219949L585101K770960J776099O00457m76300p51198j031875
$$ 734266281 739492595 743712544 747297645 750068605 751844704 752445161 751968861 751217663 750185788
1495G50185788k080500k919555k630472j801074k440274o166279n974472l777146l437996
$$ 750185788 748105288 745185733 742555261 740754187 738313913 732147634 726173162 722396016 718958020
1513.4G18958020l426432l100753k472580l038227l046692k256572k415359j868486
$$ 718958020 715531588 712430835 709958255 706920028 703873336 701616764 699201405 697332919
1529.7F97332919j371801j912654j327514k67685j115501k201915j243591k79307K80857
$$ 697332919 695961118 694048464 692720950 692453265 691337764 689135849 687892258 687612951 687893808
1548F87893808M22120Q28922J429438J597107L11613j463413o10471n87404j116991
$$ 687893808 688315928 689144850 690574288 692171395 692483008 691019595 690409124 689821720 688704729
1566.4F88704729k238989l925025l491640l757894o808281p041097n825222o587624
$$ 688704729 686465740 682540715 679049075 675291181 668482900 661441803 655616581 649028957
1582.7F49028957p439733p691800p830203q144319q265495q265257q190095p998765
$$ 649028957 641589224 633897424 626067221 617922902 609657407 601392150 593202055 585203290
1599E85203290p847071p748425p582962p510722p644474p306397o445527p013381q663535
$$ 585203290 577356219 569607794 562024832 554514110 546869636 539563239 533117712 526104331 517440796
1617.4E17440796o573022m999518n956948n772531n002051m262984k582073j776994
$$ 517440796 510867774 505868256 499911308 494138777 489136726 484873742 482291669 480514675
1633.7D80514675k368271j259476O08921J623452K404719L158689L856808L955543
$$ 480514675 478146404 476886928 477495849 479119301 481524020 484682709 488539517 492495060
1650D92495060M551977N948156N461931N403400O149947O979347P476329P142365P597387
$$ 492495060 497047037 502995193 508457124 513860524 520010471 526989818 534466147 541608512 549205899
1668.4E49205899Q603156Q107424Q170426Q738338Q384645Q262098Q933902J0692775
$$ 549205899 557809055 565916479 574086905 582825243 591209888 599471986 608405888 619098663
1684.7F19098663R606779Q150637Q446455Q193970Q851826R616673R581923J0632217
$$ 619098663 628705442 636856079 645302534 653496504 662348330 671965003 681546926 692179143
1701F92179143Q718670P306039P426977O436527N596817N472600N469024M943431L976941
$$ 692179143 700897813 708203852 715630829 722067356 727664173 733136773 738605797 743549228 747526169
1719.3G47526169L601074L390789L156066L188193L382146L118754K900302K915680
$$ 747526169 751127243 754518032 757674098 760862291 764244437 767363191 770263493 773179173
1735.7G73179173K719105K859711L300667L503621L422797L571748L678322L143489
$$ 773179173 775898278 778757989 782058656 785562277 788985074 792556822 796235144 799378633
1752G99378633K647222K738893K612769K102256J980782J953423J710891J638055J760960
$$ 799378633 802025855 804764748 807377517 809479773 811460555 813413978 815124869 816762924 818523884
1770.3H18523884J376927R72390J234829J378179J102328J044691J202762J075387
$$ 818523884 819900811 820873201 822108030 823486209 824588537 825633228 826835990 827911377
1786.7H27911377J066923J240373J036703O97613Q77738R90391P01308N70774P69615
$$ 827911377 828978300 830218673 831255376 831952989 832830727 833821118 834522426 835093200 835862815
1805H35862815P75218N86331N67973N53906M32193M42386N91993N79715M99308N68867
$$ 835862815 836638033 837224364 837792337 838346243 838778436 839220822 839812815 840392530 840891838 841460705
1825.4H41460705N98371L21925J80780M02749L93629K83361M64618O01172K84612Q8156
$$ 841460705 842059076 842381001 842561781 842964530 843358159 843641520 844106138 844707310 844991922 845080078
1845.8H45080078K72095K44558J74224K91884L39925J97649J87934L31759L89040L64184
$$ 845080078 845352173 845596731 845770955 846062839 846402764 846600413 846788347 847120106 847509146 847873330
1866.2H47873330K29418j9371o3121J15037K28881J36018P2539J98483K19942J60277
$$ 847873330 848102748 848083377 848020256 848135293 848364174 848500192 848572731 848771214 848991156 849151433
1886.6H49151433J89840J38760j3590m2856R3699J18792K2948R2864J80006M0889l0458
$$ 849151433 849341273 849480033 849466443 849423587 849517286 849636078 849659026 849751890 849931896 849972785 849942327
1909H49942327P8141N3585K8193J36733O8307j27197r7394L3856n7399j08004O9082
$$ 849942327 850020468 850074053 850102246 850238979 850307286 850180089 850082695 850116551 850059152 849951148 850020230
1931.5H50020230R954k00749n0604J30415p9155k24650q4698j55509k50935o1572m3571
$$ 850020230 850030184 849829435 849778831 849909246 849830091 849605441 849520743 849365234 849114299 849052727 849009156
1953.9H49009156k60114j99497k7180j64390k29597o6399j32621k72750j21296l6299
$$ 849009156 848749042 848549545 848522365 848357975 848128378 848061979 847929358 847656608 847535312 847499013
1974.3H47499013k32160k29061k6583j07289k49803r3639K027j80960k58028j44721
$$ 847499013 847266853 847037792 847011209 846903920 846654117 846560478 846562505 846381545 846123517 845978796
1994.7H45978796j82986k45154j18911j35124k90215k36630j52171k44915k25067r1434
$$ 845978796 845795810 845550656 845431745 845296621 845006406 844769776 844617605 844372690 844147623 844056189
2015.1H44056189j95265l46064k40445j49131k28703j99855j02937j76906k52128j84298
$$ 844056189 843860924 843514860 843274415 843125284 842896581 842696726 842593789 842416883 842164755 841980457
2035.5H41980457j78218k47597j93358j15156j62601k06948j47938j32740j72794j27852
$$ 841980457 841802239 841554642 841361284 841246128 841083527 840876579 840728641 840595901 840423107 840295255
2055.9H40295255p4208j11162j25110q4937j38700j96219j00195j9371r4235j14620
$$ 840295255 840221047 840109885 839984775 839899838 839761138 839564919 839464724 839445353 839351118 839236498
2076.3H39236498l8326o5088j12891m9949k6822j19448j33216m5896m1365o3181J9550
$$ 839236498 839198172 839133084 839020193 838970244 838943422 838823974 838690758 838644862 838603497 838540316 838559866
2098.7H38559866M9293l5644m5240l278l6776l4690N4479N2273k7120m828N9486L5643
$$ 838559866 838609159 838573515 838528275 838524997 838488221 838453531 838508010 838560283 838533163 838528335 838587821 838623464
2123.2H38623464L7611J05202R4354M0650O7115R3281L2485K5988J04248J23859R2566
$$ 838623464 838661075 838766277 838860631 838901281 838968396 839061677 839094162 839120150 839224398 839348257 839440823
2145.6H39440823J23620J37448N3346M4942J30415J34170Q9288J06811J13607P4804
$$ 839440823 839564443 839701891 839755237 839800179 839930594 840064764 840154052 840260863 840374470 840449274
2166H40449274R9122J59741J40249J11878J39952J16348O5863J05441J50740R7513
$$ 840449274 840548396 840708137 840848386 840960264 841100216 841216564 841282427 841387868 841538608 841636121
2186.4H41636121O8665J06931Q1002L2127Q4102J18375J4603k2471Q3566Q7798n37
$$ 841636121 841704786 841811717 841892719 841924846 842008948 842127323 842141926 842119455 842203021 842290819 842290282
2208.8H42290282L0518P2121R060K0445P2956J7941j2100L8922K5809k3544L6299Q3089
$$ 842290282 842320800 842392921 842401981 842422426 842495382 842513323 842501223 842540145 842565954 842542410 842578709 842661798
2233.3H42661798l0756r0182Q822K2888o9320n8174q047n5373m1485K5988p0751j51098
$$ 842661798 842631042 842540860 842549682 842572570 842503250 842445076 842437029 842381656 842340171 842366159 842295408 842144310
2257.8H42144310l1292L2067n5194l2365P7069L9935k205Q4817P7307l6001R596J26720
$$ 842144310 842113018 842145085 842089891 842057526 842134595 842174530 842172325 842257142 842334449 842298448 842308044 842434764
2282.3H42434764Q9943N5909J13786L9041o1810M5836J14739L2603M7744J26540N5790
$$ 842434764 842524707 842580616 842694402 842733443 842671633 842717469 842832208 842864811 842912555 843039095 843094885
2304.7H43094885l6895L7134J13308Q1122J17600J76191P5877n2154o3062M173O4909
$$ 843094885 843057990 843095124 843208432 843289554 843407154 843583345 843659222 843607068 843544006 843548179 843613088
2327.1H43613088P2241n543m9114P6055J65641N2214r3937p1704Q7738M11868O08325
$$ 843613088 843685329 843679786 843630672 843706727 843872368 843924582 843830645 843758941 843846679 844258547 844866872
2349.6H44866872M00603L457j64986j64926j84178j13070P6592J81794J74522K35558
$$ 844866872 845267475 845270932 845105946 844941020 844756842 844643772 844720364 844902158 845076680 845312238
2370H45312238K72035J79947J54376K54810L18050L26633L24786K56598J38939P2300
$$ 845312238 845584273 845764220 845918596 846173406 846491456 846818089 847142875 847399473 847538412 847610712
2390.4H47610712P3195Q2433R1970J02103O2167p808L755M7028p093n5611k3007q345
$$ 847610712 847683907 847766340 847858310 847960413 848022580 848014772 848018527 848065555 848058462 848002851 847979844 847971499
2414.8H47971499M17L6657J0967n1140o1155m5836j4543K6047O139n3644n4002l6120
$$ 847971499 847971916 848008573 848019540 847968400 847907245 847861409 847846866 847872913 847879052 847825408 847771406 847735286
2439.3H47735286p6592j19090j21773j03294o8903m6134p9334r7633o1094p7010j24514
$$ 847735286 847658694 847539604 847417831 847314537 847245634 847199500 847120166 847022533 846961439 846884429 846759915
2461.7H46759915j00076p4029r9242r3042n5135r6619j66476j27613q7321j30057j38462
$$ 846759915 846659839 846585810 846486568 846393526 846338391 846241772 846075296 845947683 845860362 845730305 845591843
2484.2H45591843r4473q8156j09434j03116j11758j40787j22010j13070j62423j40846
$$ 845591843 845497370 845409214 845299780 845196664 845084906 844944119 844822109 844709039 844546616 844405770
2504.6H44405770p3611j34588j87516q1062n2095j48058j26302q4519j68145j90496
$$ 844405770 844332159 844197571 844010055 843928993 843876898 843728840 843602538 843518019 843349874 843159378
2525H43159378q6129n0962j19150j36971j20402j56760j53661q6724j04487j62125
$$ 843159378 843073249 843022287 842903137 842766166 842645764 842489004 842335343 842248619 842144132 841982007
2545.4H41982007j31130j17958j58787j33693j04189j62124j63675r6678j45138k18570
$$ 841982007 841850877 841732919 841574132 841440439 841336250 841174126 841010451 840913773 840768635 840550065
2565.8H40550065j51753j23144k43187k73346j88411k32994l12090k40684k05576k89142
$$ 840550065 840398312 840275168 840031981 839758635 839570224 839337230 839025140 838784456 838578880 838289738
2586.2H38289738l01242k53380l02732l67641l37124l35455l69310l24726l16739m25876
$$ 838289738 837988496 837735116 837432384 837064743 836727619 836392164 836022854 835698128 835381389 834955513
2606.6H34955513m38451l22879l21328m16518m11689l81887m53949m51326l69907m15206
$$ 834955513 834517062 834194183 833872855 833456337 833044648 832662761 832208812 831757486 831387579 830972373
2626.9H30972373m68373m10795m11928m86433m28200l20733l64124m03881l58761l92139
$$ 830972373 830504000 830093205 829681277 829194844 828766644 828445911 828081787 827677906 827319145 826927006
2647.3H26927006m45246l94881l69609m22835m01735l22461l51489m35174m19616l78967
$$ 826927006 826481760 826086879 825717270 825294435 824892700 824570239 824218750 823783576 823363960 822984993
2667.7H22984993l85522l38972k95639l49462l76999l41058l91245m81427m03464l13997
$$ 822984993 822599471 822260499 821964860 821615398 821238399 820897341 820506096 820024669 819621205 819307208
2688.1H19307208m33445n10693m00483l72589m52518m15743l73125m85778n43177m87387
$$ 819307208 818873763 818363070 817962587 817589998 817137480 816721737 816348612 815862834 815319657 814832270
2708.5H14832270n23567n56529m75824m84943n86510n37991m24683m72963n55873n26428
$$ 814832270 814308703 813752174 813276350 812791407 812204897 811666906 811242223 810769260 810213387 809686959
2728.9H09686959n16057n41628m35650l59774m80532n01633l91185m00841m22717m15623
$$ 809686959 809170902 808629274 808193624 807833850 807353318 806851685 806460500 806059659 805636942 805221319
2749.3H05221319n44786o61195n68509m67717n39899o00100n59389n80371o34789n92292
$$ 805221319 804676533 804015338 803446829 802979112 802439213 801839113 801279724 800699353 800064564 799472272
2769.7G99472272n61356o44744p25746p58469q11696q03590p11143p16209p95365p95483
$$ 799472272 798910916 798266172 797540426 796781957 795970261 795166671 794455528 793739319 792943954 792148471
2790.1G92148471q21412r52840r74655q96215r87530j122534j091898j053095j104116
$$ 792148471 791327059 790374219 789399564 788503349 787515819 786393285 785301387 784248292 783144176
2808.5G83144176j160264j207709j284421j330972j316309j404941j584649j627981
$$ 783144176 781983912 780776203 779491782 778160810 776844501 775439560 773854911 772226930
2824.8G72226930j660765j909911k225042k510190k895951l410280m112064n124093
$$ 772226930 770566165 768656254 766431212 763921022 761025071 757614791 753502727 748378634
2841.1G48378634o394505p649064q275509p544935n382359k601623j83285J377821
$$ 748378634 741984129 734335065 726059556 718514621 713132262 710530639 710347354 711725175
2857.4G11725175J956225J585185N97418m90964j335978j726389j554489j108885q29756
$$ 711725175 713681400 715266585 715864003 715373039 714037061 712310672 710756183 709647298 708817542
2875.8G08817542p66635q63135j190067j666367k115964k437532k641082k779186k871990
$$ 708817542 708050907 707187772 705997705 704331338 702215374 699777842 697136760 694357574 691485584
2894.1F91485584k978146l113330l197729l305793l578901m008651m628420n581737
$$ 691485584 688507438 685394108 682196379 678890586 675311685 671303034 666674614 661092877
2910.4F61092877o830275p818818p812619o706715m964351k948523r14693R19462K401709
$$ 661092877 654262602 646443784 638631165 631924450 626960099 624011576 623096883 624016345 626418054
2928.8F26418054L347159L897786M369914M731834M792333M563272M068374L172994
$$ 626418054 629765213 633662999 638032913 642764747 647557080 652120352 656188726 659361720
2945.1F59361720J988828R75967M17590J58787J94788P16030J475692K087474K474785
$$ 659361720 661350548 662326515 662744105 662902892 663097680 663813710 665289402 667376876 669851661
2963.5F69851661K717256K803088K745270K661228K468050K102613J844705J715958
$$ 669851661 672568917 675372005 678117275 680778503 683246553 685349166 687193871 688909829
2979.8F88909829J448631J184583J095712J025140R22561P14838L04461o6996l18050
$$ 688909829 690358460 691543043 692638755 693663895 694586456 695301294 695605755 695538759 695220709
2998.1F95220709n36084o44803p21872p58112o51419n58436o55472r02116j101256
$$ 695220709 694684625 694039822 693317950 692559838 691908419 691349983 690694511 689792395 688691139
3016.5F88691139j163304j242637j350284j361549j352429j362801j375913j399100
$$ 688691139 687527835 686285198 684934914 683573365 682220936 680858135 679482222 678083122
3032.8F78083122j531422j728058j682103j558244j691997j920164j989186j897871
$$ 678083122 676551700 674823642 673141539 671583295 669891298 667971134 665981948 664084077
3049.1F64084077j856387j961529k038717k029956j993537j899123j808524j794338
$$ 664084077 662227690 660266161 658227444 656197488 654203951 652304828 650496304 648701966
3065.5F48701966j873434k023339k074778j929939j714110j653016j827001j994193
$$ 648701966 646828532 644805193 642730415 640800476 639086366 637433350 635606349 633612156
3081.8F33612156k022564k067328k078176k007186k066374k198577k169966k041519
$$ 633612156 631589592 629522264 627444088 625436902 623370528 621171951 619001985 616960466
3098.1F16960466k077937k272487k306461k178371k158463k295017k351582k240539
$$ 616960466 614882529 612610042 610303581 608125210 605966747 603671730 601320148 599079609
3114.4E99079609k228260k404094k658605k888442k900242k714098k592623k679348
$$ 599079609 596851349 594447255 591788650 588900208 585999966 583285868 580693245 578013897
3130.7E78013897k810597k745092k611220k680958k951860l115773l027141k906800
$$ 578013897 575203300 572458208 569846988 567166030 564214170 561098397 558071256 555164456
3147E55164456k846121k837539k964020l173709l274143l241121l168226l137827l157556
$$ 555164456 552318335 549480796 546516776 543343067 540068924 536827803 533659577 530521750 527364194
3165.4E27364194l149569l172695l212691l175795l157913l226638l242433l166855
$$ 527364194 524214625 521041930 517829239 514653444 511495531 508268893 505026460 501859605
3181.7E01859605l146678l220051l253431l205150l180653l177643l175973l192336
$$ 501859605 498712927 495492876 492239445 489034295 485853642 482675999 479500026 476307690
3198D76307690l165871l098130l045827l001958k978653k966225k942771k911627k856344
$$ 476307690 473141819 470043689 466997862 463995904 461017251 458051026 455108255 452196628 449340284
3216.4D49340284k857834k902121k857983k780884k745360k646953k501458k480805
$$ 449340284 446482450 443580329 440722346 437941462 435196102 432549149 430047691 427566886
3232.7D27566886k590656k648741k577454k492428k389997k257854k225578k274275
$$ 427566886 424976230 422327489 419750035 417257607 414867610 412609756 410384178 408109903
3249D08109903k253949k179891k143055k149403k147228k117455k117425k098292j975745
$$ 408109903 405855954 403676063 401533008 399383605 397236377 395118922 393001497 390903205 388927460
3267.4C88927460j849175j903236k078980k140969k077132k026588k025694k028972
$$ 388927460 387078285 385175049 383096069 380955100 378877968 376851380 374825686 372796714
3283.7C72796714j986235j913279j893402j933157j979858k051144k133668k111494
$$ 372796714 370810479 368897200 367003798 365070641 363090783 361039639 358905971 356794477
3300C56794477j966477j827866j858234k089203k298653k305478k176821k059668k023906
$$ 356794477 354828000 353000134 351141900 349052697 346754044 344448566 342271745 340212077 338188171
3318.4C38188171k026319k006769j994819k089411k194792k144843k066344k009034
$$ 338188171 336161852 334155083 332160264 330070853 327876061 325731218 323664874 321655840
3334.7C21655840j901001j904696k040506k075374k040893j980722j839459j878142
$$ 321655840 319754839 317850143 315809637 313734263 311693370 309712648 307873189 305995047
3351C05995047k100646k138645j936912j756847j764447j775890j576424j413286j573860
$$ 305995047 303894401 301755756 299818844 298061997 296297550 294521660 292945236 291531950 289958090
3369.3B89958090j855582j841397j524895j308322j278669j276195j173377r47773
$$ 289958090 288102508 286261111 284736216 283427894 282149225 280873030 279699653 278751880
3385.7B78751880o38217l52174l86447o96659p64101l57777j0550k62291o60777n05477
$$ 278751880 278113663 277761489 277375042 276678383 275914282 275556505 275545955 275283664 274622887 274117410
3406.1B74117410j14679K1279L0219o705k8760J33664K89440L34472N48243Q71062
$$ 274117410 274002731 274024010 274054229 274047524 274018764 274152428 274441868 274776340 275324583 276195645
3426.5B76195645J051456R81510R37074J130819J115770P89880P56652J126885J420617
$$ 276195645 277247101 278228611 279165685 280296504 281412274 282202154 282958806 284085691 285506308
3444.8B85506308J489937J533598J652718J742184J848340K048582K194792K081483
$$ 285506308 286996245 288529843 290182561 291924745 293773085 295821667 298016459 300097942
3461.1C00097942K066374K467692K676308K263427J755863J830370K275049K663494
$$ 300097942 302164316 304632008 307308316 309571743 311327606 313157976 315433025 318096519
3477.4C18096519K690523K350271K297402K621561K705008K582401K661824K864241
$$ 318096519 320787042 323137313 325434715 328056276 330761284 333343685 336005509 338869750
3493.8C38869750L042818L050118K995134K971023K787977K625078K774865L128350
$$ 338869750 341912568 344962686 347957820 350928843 353716820 356341898 359116763 362245113
3510.1C62245113L452837L439546L181219L213286L486395L731370L650993L342003
$$ 362245113 365697950 369137496 372318715 375532001 379018396 382749766 386400759 389742762
3526.4C89742762L362119L687054L941119M104674M080265L912986M142910M482329
$$ 389742762 393104881 396791935 400733054 404837728 408917993 412830979 416973889 421456218
3542.7D21456218M365653M000753L988415M214912M362584M493296M666120M842966
$$ 421456218 425821871 429822624 433811039 438025951 442388535 446881831 451547951 456390917
3559D56390917M939169M848659M541069M741729N390465N434602N213350N296380N556971
$$ 456390917 461330086 466178745 470719814 475461543 480852008 486286610 491499960 496796340 502353311
3577.4E02353311N848586O136656O192028N836070N553961O053924O282688O085991
$$ 502353311 508201897 514338553 520530581 526366651 531920612 537974536 544257224 550343215
3593.7E50343215O207109O489217O468416O418704O484986O270587O206155O475568
$$ 550343215 556550324 563039541 569507957 575926661 582411647 588682234 594888389 601363957
3610F01363957O544411O589472O465435O131530O382048O567359O276846N746901N363405
$$ 601363957 607908368 614497840 620963275 627094805 633476853 640044212 646321058 652067959 657431364
3628.4F57431364N957425O069541N730390N579531N379677N215347N232453N176247
$$ 657431364 663388789 669458330 675188720 680768251 686147928 691363275 696595728 701771975
3644.7G01771975M805564M460216M449189M287302L841996L890098M107952L666699
$$ 701771975 706577539 711037755 715486944 719774246 723616242 727506340 731614292 735280991
3661G35280991L240347L340721L257155K622783K642870K729893J766503J651704K289176
$$ 735280991 738521338 741862059 745119214 747741997 750384867 753114760 754881263 756532967 758822143
3679.4G58822143K396464K505899K634346K390683J599014J220107J534641J680195
$$ 758822143 761218607 763724506 766358852 768749535 770348549 771568656 773103297 774783492
3695.7G74783492J600266J386761J065016J158536J526713J515210R05931K33113P36475
$$ 774783492 776383758 777770519 778835535 779994071 781520784 783035994 783941925 784175038 784911513
3714G84911513J290322J128196Q40426O73890M69506M29392R03606J161456Q85606
$$ 784911513 786201835 787330031 788170457 788844347 789313853 789743245 790646851 791808307 792693913
3732.4G92693913M23312K19643P16448J138866M77791m09842M93646Q44955k14517
$$ 792693913 793117225 793336868 794053316 795192182 795669973 795260131 795753777 796598732 796384215
3750.7G96384215m9770R13322Q58188K54154K19822N60880N26428L96788J49846j6510
$$ 796384215 796334445 797247767 798105955 798360109 798579931 799140811 799667239 800064027 800213873 800197363
3771.1H00197363L09110O20186N72324J98245R7334K17438J44124J78337L03924L88920
$$ 800197363 800506473 801126659 801698983 801897228 801994562 802212000 802356124 802534461 802838385 803227305
3791.5H03227305L95418L02851M11630K19047l11494J33514J70887k38061L30627Q22425
$$ 803227305 803622723 803925574 804337204 804556251 804244757 804378271 804549158 804311097 804641724 805464149
3811.9H05464149N00381l1770K31207n2274o04748P8320L46303K48790K87771L37482
$$ 805464149 805964530 805932760 806163967 806111693 805506945 805585265 805931568 806180358 806468129 806805611
3832.3H06805611N11527J64866n65469m01139L7908K15769M99845P44521M33147j107991
$$ 806805611 807317138 807482004 806916535 806515396 806553304 806769073 807268918 808013439 808446586 807338595
3852.7H07338595j486063L57867Q90433N44250L5465j49309J35779j04547k94029L9816
$$ 807338595 805852532 806210399 807100832 807645082 807680547 807531238 807667017 807562470 807268441 807308257
3873.1H07308257J86145L69072J06037p7188K12311j51396j72257J31726j96278n8293
$$ 807308257 807494402 807863474 807969511 807892323 808104634 807953238 807780981 807912707 807716429 807658136
3893.5H07658136M67181L22878j15215l27885m95315k88129J64986K36153K33889K88546
$$ 807658136 808125317 808448195 808332980 808005095 807509780 807221651 807386637 807622790 807856679 808145225
3913.9H08145225P1108j72793m9949R4473j16825j79112J39296J51336j03712m4882
$$ 808145225 808216333 808043540 807993591 808088064 807971239 807792127 807931423 808082759 807979047 807934165
3934.3H07934165J00315J34885R7871q6606o2465N7756m8935m5121Q3745R4950N2929
$$ 807934165 808034480 808169365 808267236 808180630 808118165 808175921 808126986 808081865 808165610 808260560 808313489
3956.7H08313489O0439O020n4777N3943J28626Q8096J24812J56284P5578L1174N3346
$$ 808313489 808373928 808379948 808325171 808379114 808507740 808595836 808720648 808876932 808952510 808983684 809037030
3979.2H09037030R2983R8646N9247M7683J6153J9312J15156R9600j2517
$$ 809037030 809130013 809228659 809287906 809335589 809351742 809371054 809486210 809585810 809573293
3997.5H09573293
$$ 809573293
##END=$$ End of the data block
