##TITLE=$$ Begin of the data block
##JCAMP-DX=5.00 $$ ACD/SpecManager v 10.08
##SPECTROMETER/DATA SYSTEM=Alpha
##DATE=15 Apr 2014 09:00:42
##DATA TYPE=INFRARED SPECTRUM
##DATA CLASS=XYDATA
##ORIGIN=
##OWNER=
##NPOINTS=1765
##FIRSTX=399.75695801
##LASTX=3997.56933594
##MAXX=3997.56933594
##MINX=399.75695801
##MAXY=0.85140228
##MINY=0.18734713
##XFACTOR=1.0000000000
##YFACTOR=1.000000000000000e-9
##FIRSTY=0.58694816
##DELTAX=2.03957629
##XUNITS=1/CM
##YUNITS=ARBITRARY UNITS
##XYDATA=(X++(Y..Y))
399.8E86948156k902805j584232o19531j900911k401471n77450k5571j484036j813054
$$ 586948156 584045351 582461119 581841588 579940677 577539206 576961756 576936185 575452149 573639095
418.1E73639095p62403j421213k032996j38163Q25524j153290k022326n53429l38078
$$ 573639095 572876692 571455479 569422483 569284320 570109844 568956554 566934228 566380799 566042721
436.5E66042721j394927p48039M47274m83334j576960k53737P24732q69750j527071
$$ 566042721 564647794 563899755 564347029 563863695 562286735 562032998 562757730 561887980 560360909
454.8E60360909P9035R5070j697123j379133K41876o40571k403975j372993j91867
$$ 560360909 560439944 560535014 558837891 557458758 557700634 557060063 554656088 553283095 553091228
473.2E53091228j579881k088368k48909K43962j424253j290560M54009k49684k049744
$$ 553091228 551511347 549422979 549174070 549418032 547993779 546703219 547157228 546907544 544857800
491.5E44857800j263261q1539j492798k381146n07474J12593k002239k310097l50953
$$ 544857800 543594539 543513000 542020202 539639056 539131582 539244175 537241936 534931839 534580886
509.9E34580886n37336k312898j722574l34561j601875k838314j456439p40528k440334
$$ 534580886 534043550 531730652 530008078 529673517 528071642 525233328 523776889 523036361 520596027
528.3E20596027k741158p41601n31613k269030j724362K70843m86016k189994j023889
$$ 520596027 517854869 517113268 516581655 514312625 512588263 512859106 512373090 510183096 509159207
546.6E09159207K02954j490474k428948o89090m53055k630829k682865q11845j601398
$$ 509159207 509362161 507871687 505442739 504753649 504300594 501669765 498986900 498175055 496573657
565D96573657l824502l192425j692355k894312m038602k377182j344681k996385l450603
$$ 496573657 492749155 489556730 487864375 484970063 480931461 478554279 477209598 474213213 470762610
583.3D70762610j646846j672208l617347l446400j871347k580375m028648l167480
$$ 470762610 469115764 467443556 463826209 460379809 458508462 455928087 451899439 448731959
599.6D48731959k219975l539235l841161j310766L1859j396716j588702P41303K337634
$$ 448731959 446511984 442972749 439131588 437820822 437852681 436455965 434867263 435608566 437946200
618D37946200K501190L709316N284578M431993K951681L939689N105853L669440K426446
$$ 437946200 440447390 444156706 449441284 453873277 456824958 460764647 465870500 469539940 471966386
636.3D71966386L371239L092140M91797O7860L004730M084855J627952j91927l4421
$$ 471966386 475337625 478429765 478921562 478989422 481994152 486079007 487706959 487515032 487480611
654.7D87480611J082331L949731P323176P553041M606485L041208M664659L919900
$$ 487480611 488562942 492512673 499835849 507388890 511995375 515036583 519701242 523621142
671E23621142J863956K199769M009903L569066J482010J828790L301561K201199N75185
$$ 523621142 525485098 527684867 531694770 535263836 536745846 538574636 541876197 544077396 544652581
689.4E44652581J550198K379656P06553j82688J452148K010405N84960Q06868K727926
$$ 544652581 546202779 548582435 549288988 549106300 550558448 552568853 553153813 553960681 556688607
707.7E56688607K733230J398623K097488L570854K703071J399815K607286L724933
$$ 556688607 559421837 560820460 562917948 566488802 569191873 570591688 573198974 576923907
724E76923907K348244J428485K738833L140331J525879J163899K539218K430499J004159
$$ 576923907 579272151 580700636 583439469 586579800 588105679 589269578 591808796 594239295 595243454
742.4E95243454J514435L002107K299070J016200K030492L139078J984954J210273
$$ 595243454 596757889 599759996 602059066 603075266 605105758 608244836 610229790 611440063
758.7F11440063K532720L099024J702786J385152K734781K572774Q34823O03378J393139
$$ 611440063 613972783 617071807 618774593 620159745 622894526 625467300 626302123 626905501 628298640
777.1F28298640M35710j108467o56307L32951k14397l10183J751304L580272L593683
$$ 628298640 628734350 627625883 626969576 627302527 627088130 626777947 628529251 632109523 635703206
795.4F35703206M195452O270170P002831N841374N544484O219208N234599L255010
$$ 635703206 639898658 646168828 653171659 659013033 664557517 670776725 676011324 679266334
811.7F79266334K977609L306568J816153m2378k57552o05583k686799m204392l700078
$$ 679266334 682243943 685550511 687366664 687324286 687066734 686461151 683774352 679569960 675869882
830.1F75869882l529191m652023m798711l519117l225685m121899l767789k067566
$$ 675869882 672340691 667688668 662889957 659370840 656145155 652023256 648255467 646187901
846.4F46187901r50276J95443L054261O312192P914305Q667171R991586J0715842R635449
$$ 646187901 645237625 645433068 648487329 654799521 662713826 671380997 681372583 692088425 701723874
864.8G01723874Q342564Q018672P016301M741133L407418L382087K459169O88076J34587
$$ 701723874 710066438 718085110 725101411 729842544 733249962 736632049 739091218 739779294 739913881
883.1G39913881L26991p37071k151549j853704q78573q90911o05762J101077K334178
$$ 739913881 740240872 739503801 737352252 735498548 734619975 733729064 733123302 734224379 736558557
901.5G36558557J849234J450896J964271J471817m31537j662433k008975l201723m665255
$$ 736558557 738407791 739858687 741822958 743294775 742863238 741200805 739191830 735990107 731324852
919.8G31324852m395843k953768k128005j378655M55975J924038J532674Q33094J239062
$$ 731324852 726929009 723975241 721847236 720468581 720924556 722848594 724381268 725214362 726453424
938.2G26453424J385867M14133j10268K66432k49445j861334k833903l307163m856408
$$ 726453424 727839291 728253424 728143156 728409588 728160143 726298809 723464906 720157743 715301335
956.6G15301335o886244p914484q916139j1250556j3738751j5025497j5810549j6506493
$$ 715301335 708415091 700500607 691584468 680333912 666595161 651569664 635759115 619252622
972.9F19252622j5818477j3521790j1483252j0544837r481012p874847o936490o777704
$$ 619252622 603434145 589912355 578429103 567884266 558403254 550528407 543591917 536814213
989.2E36814213o111741m963458m345000l955364l062129k271056k459049l251851
$$ 536814213 530702472 525739014 521394014 517438650 514376521 512105465 509646416 506394565
1005.5E06394565l995895n059928o585479p540822p473081p185042p028729o456882
$$ 506394565 502398670 497338742 490753263 483212441 475739360 468554318 461525589 455068707
1021.8D55068707n540519n045981m907071m456401l848493l620863l502518l036320
$$ 455068707 449528188 444482207 439575136 435118735 431270242 427649379 424146861 421110541
1038.1D21110541k510280k398819k454161k270907k134741k214640j867920p22319
$$ 421110541 418600261 416201442 413747281 411476374 409341633 407126993 405259073 404536754
1054.5D04536754N61356J381368J826584J731903M98443j642733l734172n330205o495505
$$ 404536754 405098110 406479478 408306062 410037965 410536408 408893675 405159503 399829298 393333793
1072.8C93333793p075608o923497o579071o511986o454260o235390o247938o518364
$$ 393333793 386258185 379334688 372755617 366243631 359789371 353553981 347306043 340787679
1089.1C40787679o332219n216986l548950j923799n14120N09292Q89540P48396M94897
$$ 340787679 334455460 329238474 325689524 323765725 323251605 323760897 324650437 325398833 325893730
1107.5C25893730K32160k55674j031309k083064l685712n822272o849139m667193m45724
$$ 325893730 326125890 325870216 324838907 322755843 319070131 313247859 306398720 301731527 301285803
1125.8C01285803K219051K250255R92477j19925J46717J766622L383219L929526L486663
$$ 301285803 303504854 305755109 306747586 306627661 306774378 308541000 311924219 315853745 319340408
1144.2C19340408K810061K406329K159863J977951K185851K876192L738612M782260
$$ 319340408 322150469 324556798 326716661 328694612 330880463 333756655 337495267 342277527
1160.5C42277527O302714Q113176R639621J0644286J1268884J1425138J0972798J0250062
$$ 342277527 348580241 356693417 366333038 376977324 388246208 399671346 410644144 420894206
1176.8D20894206R665906R022832P927507O574065N189001L455520J422018p0125n37873
$$ 420894206 430560112 439582944 447510451 454084516 459273517 462729037 464151055 464080930 463543057
1195.2D63543057k70873O26922K368569M451513N776048O019682N687266N011112L954917
$$ 463543057 463272184 463899106 466267675 470719188 476495236 482514918 488202184 493213296 497168213
1213.5D97168213L015727K718568K672493K380550K198577K484858K780080K738178
$$ 497168213 500183940 502902508 505575001 507955551 510154128 512638986 515419066 518157244
1229.9E18157244K813458L204405L360332L123700L028214L089667K721071J999795
$$ 518157244 520970702 524175107 527535439 530659139 533687353 536777020 539498091 541497886
1246.2E41497886J579285J378476R02057N19514P80881J284599J606345K166093L183007
$$ 541497886 543077171 544455647 545357704 545877218 546658099 547942698 549549043 551715136 554898143
1264.5E54898143M062772M476130M957080N682885N992472N840779N927086O271302
$$ 554898143 558960915 563437045 568394125 574077010 580069482 585910261 591837347 598108649
1280.8E98108649O255448O009221O202042O525696O208896N599261N364418N096793
$$ 598108649 604364097 610373318 616575360 623101056 629309952 634909213 640273631 645370424
1297.2F45370424M318893L620624L433287L130913K429843J995862J958787J646876
$$ 645370424 649689317 653309941 656743228 659874141 662303984 664299846 666258633 667905509
1313.5F67905509J070023J011849J425325J479388J266956J470327J698375J250267
$$ 667905509 668975532 669987381 671412706 672892094 674159050 675629377 677327752 678578019
1329.8F78578019O00875L53336J21415l65317l50893L58224O79314M48287M63128P07269
$$ 678578019 679178894 679532230 679653645 679288328 678937435 679295659 679974973 680423260 680886388 681593657
1350.2F81593657M91440m5717k16544k65836q85368j547873j367867j196265j670003
$$ 681593657 682085097 682039380 681822836 681557000 680671632 679123759 677755892 676559627 674889624
1368.5F74889624j931548j924217k119362k511203l543020n530536o558180l830790
$$ 674889624 672958076 671033859 668914497 666403294 662860274 657329738 650771558 646940768
1384.9F46940768R57966K970516J493991n31733j554489j770556k410591l014445l265262
$$ 646940768 647898734 650869250 652363241 651831508 650277019 648506463 646095872 643081427 639816165
1403.2F39816165l582656l526330l175378k680302k176404j984537k041041j576603
$$ 639816165 636233509 632707179 629531801 626851499 624675095 622690558 620649517 619072914
1419.5F19072914n82278k92003j95563o258j09196J13309N23686O97076J395345K120197
$$ 619072914 618490636 618198633 618003070 617996812 617887616 618000925 618524611 619221687 620617032 622737229
1439.9F22737229K275109K228737K171755K559721L426016L904760L956019N146027
$$ 622737229 625012338 627241075 629412830 631972551 635398567 639303327 643259346 648405373
1456.2F48405373P912159Q259952P099152P046997P570207P265509O983757P941186
$$ 648405373 656317532 664577484 671676636 678723633 686293840 693559349 700543106 708484292
1472.6G08484292Q363009P148623N649686M341721L269792K011001O47545k28107l08633
$$ 708484292 716847301 723995924 729645610 733987331 737257123 739268124 739915669 739687562 739378929
1490.9G39378929n20468j818835l227830l210008k828420l319144n590260p880628
$$ 739378929 738858461 737039626 733811796 730601788 727773368 724454224 718863964 710983336
1507.2G10983336n573511m130900m801571n296886m891396m060268l996134l368795
$$ 710983336 705409825 701278925 696477354 691180468 686289072 682228804 678232670 674863875
1523.6F74863875k708256k688945k348065k671182l013194j975715j930892l233672
$$ 674863875 672155619 669466674 667118609 664447427 661434233 659458518 657527626 654293954
1539.9F54293954k176225j46508M34339L94166L06367N52059O86526K08914q91864
$$ 654293954 652117729 651971221 652405560 652799726 653106093 653658152 654344678 654553592 653661728
1558.2F53661728j54317R42171k94983j810909l224969m199147m021287n274176p683873
$$ 653661728 653507411 654449582 654154599 652343690 649118721 644919574 640898287 635624111 627940238
1576.6F27940238p195473o640196p722080q412123q717656q947491r064377r039282
$$ 627940238 620744765 614104569 606382489 597970366 589252710 580305219 571240842 562201560
1592.9E62201560r006739q747876q425474q309722q188903p921815p759214p819920
$$ 562201560 553194821 544446945 536021471 527711749 519522846 511601031 503841817 496021897
1609.2D96021897p620931p251710p979005q827836o867081n944699o763607o320000
$$ 496021897 488400966 481149256 473170251 464342415 457475334 451530635 444767028 438447028
1625.5D38447028n538702m897654l778338l489673l619433j642883K57671R14514J206458
$$ 438447028 432908326 428010672 424232334 420742661 417123228 415480345 415738016 416652530 417858988
1643.9D17858988J756489L098101L531188L597706N590111O464988N989194O211758
$$ 417858988 419615477 422713578 426244766 429842472 435432583 441897571 447886765 454098523
1660.2D54098523P141590Q051455P714748P985085R431065R508162R750247J0814429
$$ 454098523 461240113 469291568 477006316 484991401 494422466 503930628 513680875 524495304
1676.5E24495304J0541796R744406J0071516J2800574J3126433J1401892J1298478
$$ 524495304 535037100 544781506 554853022 567653596 580780029 592181921 603480399
1690.8F03480399J0533511J0568857J1304319J1488617J3281703J2052238R859264
$$ 603480399 614013910 624582767 635887086 647375703 660657406 672709644 682568908
1705.1F82568908R545624Q591890P226229O007910N185723N468845O006659N428969
$$ 682568908 692114532 700706422 707932651 713940561 719126284 724595129 730601788 736030757
1721.4G36030757M704774M374444L842652L428579L073334L233850M161299M062414
$$ 736030757 740735531 745109975 748952627 752381206 755454540 758688390 762849689 766912103
1737.7G66912103L753602L874123L853262L711760L550231L544987L926038L777504
$$ 766912103 770665705 774539828 778393090 782104850 785655081 789200068 793126106 796903610
1754G96903610L129781K644896K283156K334833K446115J897454J329244J132607J292586
$$ 796903610 800033391 802678287 804961443 807296276 809742391 811639845 812969089 814101696 815394282
1772.4H15394282J905799K027691J633465J321375J249969J291395J386106J097202
$$ 815394282 817300081 819327772 820961237 822282612 823532581 824823976 826210082 827307284
1788.7H27307284M94778P63655J465261J264751P48992P99060J104652J027167P53820
$$ 827307284 827802062 828565717 830030978 831295729 832044721 832843781 833948433 834975600 835729420
1807H35729420O25789O60241P15256P09533O63937N89668L97444K60890L62694L38375
$$ 835729420 836355209 837015450 837730706 838440239 839104176 839693844 840091288 840352178 840714872 841053247
1827.4H41053247K24710O81996R38714N16415L42667M73439J64032k42114K93792Q63552
$$ 841053247 841277957 841959953 842898667 843415082 843757749 844231188 844395220 844153106 844446898 845310450
1847.8H45310450O64293L51072L09705L74079K85030J87575K16961J78278j32859k07305
$$ 845310450 845974743 846325815 846635520 847009599 847294629 847482204 847699165 847877443 847744584 847537279
1868.2H47537279M12882P85529M55976J50799J68860J81377J00792J06930J21296n007
$$ 847537279 847950161 848735690 849191666 849342465 849511325 849692702 849793494 849900424 850021720 850016713
1888.6H50016713M5955K18392J82271J26481J35422J47044J41025O0200n7578m5895
$$ 850016713 850062668 850281060 850463331 850589812 850725234 850872278 851013303 851073503 851015925 850970030
1909H50970030R5069J33336l9101j71482j6988P2062N5492J69695J34170j8299k7239
$$ 850970030 851065099 851198435 851159334 850987852 850970864 851042926 851098418 851268113 851402283 851383984 851356745
1931.5H51356745P927n2571j12653j60277k50339j79351R179M6015l5941j31667j73152
$$ 851356745 851364672 851312101 851199448 851039171 850788832 850609481 850618660 850664675 850628734 850497067 850323915
1953.9H50323915j47163j58668j97232j77860j95682k73228k10821q1838q2492j39773
$$ 850323915 850176752 850018084 849820852 849642992 849447310 849174082 848963261 848881423 848798931 848659158
1974.3H48659158j75536j63853j35839j40190j85192k42770k80678k90096k01881p5340
$$ 848659158 848483622 848319769 848183930 848043740 847858548 847615778 847335100 847045004 846843123 846767783
1994.7H46767783j07884k04087j88112j68979k24888k76685k75016k44677k22444k65658
$$ 846767783 846659899 846455812 846267700 846098721 845873833 845597148 845322132 845077455 844855011 844589353
2015.1H44589353k89619k15650k11179k78652k74002k21491k25425k51055k48849k24591
$$ 844589353 844299734 844084084 843872905 843594253 843320251 843098760 842873335 842622280 842373431 842148840
2035.5H42148840k18093k59161k46227k03728k30611k34663j65999j49548j99199k32041
$$ 842148840 841930747 841671586 841425359 841221631 840991020 840756357 840590358 840440810 840241611 840009570
2055.9H40009570k19822j92940k07067k14338j48475r8109j32442j34289r6798j20223
$$ 840009570 839789748 839596808 839389741 839175403 839026928 838928819 838796377 838662088 838565290 838445067
2076.3H38445067j42991r2149o0320q7082j11520r5249o4730q5295q8691m1008k7538
$$ 838445067 838302076 838209927 838149607 838062525 837951005 837855756 837791026 837705731 837617040 837576032 837548494
2098.7H37548494o1690n1201J1385k146o5565l2068L3439j0610o3479J3948J15692
$$ 837548494 837486804 837435603 837446988 837444842 837379277 837347209 837380648 837370038 837306559 837320507 837436199
2121.1H37436199P7188K5392R2089J18017L4869J728Q0407J18017N2750L8326J49131
$$ 837436199 837513387 837538779 837630868 837748885 837783754 837785482 837865889 837983906 838036656 838074982 838224113
2143.6H38224113J85609Q2314O3121J30832J00494N2154J15633J48535Q7857Q8930
$$ 838224113 838409722 838492036 838555157 838685989 838786483 838838637 838954270 839102805 839190662 839279592
2164H39279592J66357J52230P1406J08123K09034J65462K8908N5015J97411J80483
$$ 839279592 839445949 839598179 839669585 839777708 839986742 840152204 840181112 840236127 840433538 840614021
2184.4H40614021M7982N7101J47819Q1420l0040N7756J60814O0200j2397P8559J00374
$$ 840614021 840662003 840719104 840866923 840948343 840918303 840976059 841136873 841197073 841184676 841263235 841363609
2206.8H41363609j5676k2948J07825R4414m5836j1683J23322O2823o0439J7584J26481
$$ 841363609 841347933 841324985 841432810 841527224 841481388 841469705 841593027 841655850 841595411 841612995 841739476
2229.2H41739476P987j37091k4974Q9466m2259r8885N2155P1883p1585q5354L2484
$$ 841739476 841747463 841610372 841585398 841674864 841632605 841533720 841585875 841657758 841586173 841500819 841533303
2251.7H41533303j4245j85371j27852N1976M3511m7684o258P6234L7134r537J01328
$$ 841533303 841519058 841333687 841205835 841257811 841301322 841253638 841247380 841323614 841360748 841351211 841452539
2274.1H41452539J64628K7359Q881J62661J80244M3392n722P5937M0590p7188M232
$$ 841452539 841617167 841644526 841653407 841816068 841996312 842039704 842033982 842109919 842150509 842073321 842077553
2296.5H42077553J56284Q2969k3305J08957K22027M6134j03175M7147J78874J4245
$$ 842077553 842233837 842316806 842293501 842402458 842624485 842670619 842567444 842614591 842793465 842807710
2316.9H42807710j59442k3723J10626K9922L2067J22309O0797k4081R6917K34604R9779
$$ 842807710 842648268 842624545 842735171 842765093 842797160 842919469 842980266 842956185 843053102 843287706 843387485
2339.4H43387485j49489j06871K69771N87880N12600K27094o0439l04044k49683N8770
$$ 843387485 843237996 843131125 843400896 843988776 844501376 844728470 844668031 844363987 844114304 844173074
2359.8H44173074R7811J9312K72810M95732L19004K06530M68850O16074M12107L29732
$$ 844173074 844270885 844290197 844563007 845058739 845377743 845584273 846053123 846669197 847081304 847411036
2380.2H47411036N39065N79834K55585N8233K36690K91467L9101J073K35319J99556
$$ 847411036 847950101 848529935 848785520 848843753 849080443 849371910 849411011 849412084 849647403 849846959
2400.6H49846959n8889l398K10464P3493j14620Q8215K61366J9014j71184P867R6262
$$ 849846959 849788070 849784672 849995136 850068629 849954009 850042224 850303590 850322604 850151420 850159287 850255549
2423H50255549j11342j15811J87575K08676r1016j01447J36793P0989j67609q8155
$$ 850255549 850144207 850028396 850215971 850424647 850333631 850232184 850368977 850439966 850272357 850184202
2443.4H50184202R6441n0366j93656K3723J44362r7871j95443N8651J22070j75238
$$ 850184202 850280643 850230277 850036621 850060344 850204706 850106835 849911392 849970043 850092113 849916875
2463.8H49916875k48849M8041J04308j76310j81317P5638M291k36630r8228J02341
$$ 849916875 849668026 849716067 849820375 849644065 849462748 849538386 849542677 849306047 849207819 849310160
2484.2H49310160j29283l26216m8935J14739j78218k73526L8266Q5235k29538k17378
$$ 849310160 849180877 848854661 848805726 848920465 848742247 848468721 848506987 848592222 848362684 848145306
2504.6H48145306R8884L4213k80618j98007P0393o7472k92540p8857J33753j30773
$$ 848145306 848244190 848278403 847997785 847799778 847870171 847802699 847510159 847431302 847565055 847434282
2525H47434282l40998p7724O9916k05636k71261J9610J6332k76864k31683O3300j1861
$$ 847434282 847093284 847015560 847085476 846879840 846608579 846628189 846644521 846367657 846135974 846199274 846187413
2547.4H46187413k91705j49191J18911r3936l63291j44899N4717k03371l47852o3956
$$ 846187413 845895708 845746517 845865428 845771492 845408201 845263302 845318019 845114648 844766796 844702840
2567.8H44702840O318l27170l73423o8069r8526m13358l55304j03831k62379m91262
$$ 844702840 844709158 844381988 844008565 843940496 843841970 843428612 843073308 842969477 842707098 842215836
2588.2H42215836k57790m4465l28183n63383l11375j45018m41194n59032k71141k49803
$$ 842215836 841958046 841913581 841585398 841022015 840710640 840565622 840124428 839565396 839294255 839044452
2608.6H39044452n42760m96149k35796l87311o67632m95076k14219l94523o78718n02110
$$ 839044452 838501692 838005543 837769747 837382436 836714804 836219728 836005509 835610986 834932268 834430158
2629H34430158k59817m44531o07133l62933k62320n55992o00636l06546l15428n88775
$$ 834430158 834170341 833725810 833118677 832755744 832493424 831937432 831336796 831030250 830714822 830126047
2649.4H30126047n44011k97368m10020o61374m85956k22504l82245n77092m11093l04103
$$ 830126047 829582036 829284668 828874648 828213274 827727318 827504814 827122569 826545477 826134384 825830281
2669.8H25830281n03242n45979l10004l21507o28233o21796l21030l56674o46949n74947
$$ 825830281 825327039 824781060 824471056 824149549 823521316 822899520 822578490 822221816 821574867 820999920
2690.2H20999920l23116m69327o80566m94063l72529o28412p38859m77314l93987o80566
$$ 820999920 820676804 820207477 819526911 819032848 818660319 818031907 817293048 816815734 816421747 815741181
2710.6H15741181p52449m92990m91023p41064p01845m49538n00679p42436o62446m58181
$$ 815741181 814988732 814495742 814004719 813263655 812561810 812112272 811611593 810869157 810206711 809748530
2731H09748530n68449o83248n19276m55022o55651p10189m80592m11570o52492p37370
$$ 809748530 809180081 808496833 807977557 807522535 806866884 806156695 805676103 805264533 804612041 803874671
2751.4H03874671n59568n75721p69735p07864n39661o61731q46862p53582o29842p31647
$$ 803874671 803315103 802739382 801969647 801261783 800722122 800060391 799213529 798459947 797830105 797098458
2771.8G97098458q18670p69496q25167r72271r46998p95782q12113r82881r99331r12666
$$ 797098458 796279788 795510292 794685125 793712854 792765856 791970074 791157961 790175080 789175749 788263083
2792.2G88263083j034022j195669j104116j005531j133621j260876j206517j172781
$$ 788263083 787229061 786033392 784929276 783923745 782790124 781529248 780322731 779149950
2808.5G79149950j324296j418531j326263j305938j425445j479387j447142j512587
$$ 779149950 777825654 776407123 775080860 773774922 772349477 770870090 769422948 767910361
2824.8G67910361j672446j738906j758397j924694k157211k352476k706587l296614
$$ 767910361 766237915 764499009 762740612 760815918 758658707 756306231 753599644 750303030
2841.1G50303030l897548m403472m771232m698277l931522k749026j742423j155257
$$ 750303030 746405482 742002010 737230778 732532501 728600979 725851953 724109530 722954273
2857.4G22954273r11236j055240j571179k157509k547741k702653k636254k422929
$$ 722954273 722043037 720987797 719416618 717259109 714711368 712008715 709372461 706949532
2873.7G06949532k166569j901090j734317j741707j809895j917422k090692k195776
$$ 706949532 704782963 702881873 701147556 699405849 697595954 695678532 693587840 691392064
2890.1F91392064k201497k238036k360880k477050k476990k450705k570212k805590
$$ 691392064 689190567 686952531 684591651 682114601 679637611 677186906 674616694 671811104
2906.4F71811104l067851l433347l942013m413128m623532m494667m032910l255784
$$ 671811104 668743253 665309906 661367893 656954765 652331233 647836566 643803656 640547872
2922.7F40547872k319098j412094o03437N8830O39498J261234J846791K257406K540052
$$ 640547872 638228774 636816680 636213243 636272073 636911571 638172805 640019596 642277002 644817054
2941F44817054K680540K466083J895845J236558O67274K11060l5405m0472M7743J99914
$$ 644817054 647497594 649963677 651859522 653096080 653763354 653974414 653939009 653898537 653946280 654146194
2961.4F54146194L70801M41432TM49479M98473N40734N48720O80566Q97646R00030
$$ 654146194 654516995 654958427 655399859 655849338 656347811 656888545 657437265 658117831 659015477 659915507
2981.8F59915507P52568P17938P28548O28471L66449l2484l66092o22511r26137j122713
$$ 659915507 660668075 661386013 662114561 662743032 663109481 663076997 662710905 662088394 661162257 660039544
3002.2F60039544j173854j243353j289725j211584j225948j485109j726985j776338
$$ 660039544 658865690 657622337 656332612 655121028 653895080 652409971 650682986 648906648
3018.5F48906648j801193j901507j994729k040744k052069k075374k079904k154231
$$ 648906648 647105455 645203948 643209219 641168475 639116406 637041032 634961128 632806897
3034.9F32806897k339184k336085k219915k340854k602458k704560k600611k550005
$$ 632806897 630467713 628131628 625911713 623570859 620968401 618263841 615663230 613113225
3051.2F13113225k684474k757013k705038k689063k653778k540052k465427k534211
$$ 613113225 610428751 607671738 604966700 602277637 599623859 597083807 594618380 592084169
3067.5E92084169k648115k655625k577603k486646k420962k479494k647459k746165
$$ 592084169 589436054 586780429 584202826 581716180 579295218 576815724 574168265 571422100
3083.8E71422100k738357k673089k673626k821326k889574k784133k734065k831340
$$ 571422100 568683743 566010654 563337028 560515702 557626128 554841995 552107930 549276590
3100.1E49276590k938389k946377k902627k933026l050744l098488l037393l007472
$$ 549276590 546338201 543391824 540489197 537556171 534505427 531406939 528369546 525362074
3116.4E25362074l086745l337264l586054l538251l365755l343463l438175l493756
$$ 525362074 522275329 518938065 515352011 511813760 508448005 505104542 501666367 498172611
3132.8D98172611l458202l444016l485113l577948l686517l712654l675580l609121
$$ 498172611 494714409 491270393 487785280 484207332 480520815 476808161 473132581 469523460
3149.1D69523460l562212l689647l903478l935308l862202l828525l804982l813714
$$ 469523460 465961248 462271601 458368123 454432815 450570613 446742088 442937106 439123392
3165.4D39123392l868371l899038l858656l807068l814727l839790l798068l778607
$$ 439123392 435255021 431355983 427497327 423690259 419875532 416035742 412237674 408459067
3181.7D08459067l823608l808379l735214l697813l708273l708601l687442l656804
$$ 408459067 404635459 400827080 397091866 393394053 389685780 385977179 382289737 378632933
3198C78632933l610760l518820l394037l353924l402859l384471l301233l246277l209681
$$ 378632933 375022173 371503353 368109316 364755392 361352533 357968062 354666829 351420552 348210871
3216.4C48210871l177643l124594l070891l041923k979875k873957k749532k646566
$$ 348210871 345033228 341908634 338837743 335795820 332815945 329941988 327192456 324545890
3232.7C24545890k683788k763808k678842k534210k459020k410173k347082k297670
$$ 324545890 321862102 319098294 316419452 313885242 311426222 309016049 306668967 304371297
3249C04371297k281576k277881k246499k179772k138972k149463k155184k125293k067745
$$ 304371297 302089721 299811840 297565341 295385569 293246597 291097134 288941950 286816657 284748912
3267.4B84748912j995802j999587k090931k150893k124101k062023k028167k037197
$$ 284748912 282753110 280753523 278662592 276511699 274387598 272325575 270297408 268260211
3283.7B68260211k057016k040386j989395j961082j987457k022147k063692k094477
$$ 268260211 266203195 264162809 262173414 260212332 258224875 256202728 254139036 252044559
3300B52044559k011627j866386j888856k081797k197876k157644k053111j975418j941800
$$ 252044559 250032932 248166546 246277690 244195893 241998017 239840373 237787262 235811844 233870044
3318.4B33870044j901596j829625j791343j843899j908019j907915j846865j735330
$$ 233870044 231968448 230138823 228347480 226503581 224595562 222687647 220840782 219105452
3334.7B19105452j618907j611709j700863j712829j670882j594812j411498j375317
$$ 219105452 217486545 215874836 214173973 212461144 210790262 209195450 207783952 206408635
3351B06408635j569465j630545j448989j286476j260490j221731j086995r81748j043961
$$ 206408635 204839170 203208625 201759636 200473160 199212670 197990939 196903944 195922196 194878235
3369.3A94878235j227036j223296r42334p16373o88598p27117o61969m73961k16738
$$ 194878235 193651199 192427903 191485569 190769196 190080598 189353481 188691512 188217551 188000813
3387.7A88000813K3991k9176l29510l18989J25960L94731R5502k59251p2553K92465
$$ 188000813 188024804 187995628 187666118 187347129 187473089 187867820 187963322 187704071 187631518 187923983
3408.1A87923983M20704M10378L45081L44828M90859O04466O41525P91534J027450
$$ 187923983 188344687 188755065 189100146 189444974 189935833 190540299 191181824 191973358 193000808
3426.5A93000808J203880J208991J253173J392319J238689R34944R82761J282692J517877
$$ 193000808 194204688 195413679 196666852 198059171 199297860 200232804 201215565 202498257 204016134
3444.8B04016134J685068J754135J761764J785517J866996K037600K220556K221227
$$ 204016134 205701202 207455337 209217101 211002618 212869614 214907214 217127770 219348997
3461.1B19348997K198085K467990K704561K468496K023816J998336K351626K704308
$$ 219348997 221547082 224015072 226719633 229188129 231211945 233210281 235561907 238266215
3477.4B38266215K781525K558827K498702K716183K786652K747356K907038L117293
$$ 238266215 241047740 243606567 246105269 248821452 251608104 254355460 257262498 260379791
3493.8B60379791L214211L148943L089726L149628L114462L003419L102034L403455
$$ 260379791 263594002 266742945 269832671 272982299 276096761 279100180 282202214 285605669
3510.1B85605669L682256L690898L474504L485024L746957L997117L956228L717393
$$ 285605669 289287925 292978823 296453327 299938351 303685308 307682425 311638653 315356046
3526.4C15356046L767788M066050M278630M446209M496127M362464M461885M698395
$$ 315356046 319123834 323189884 327468514 331914723 336410850 340773314 345235199 349933594
3542.7C49933594M694969M564881M593402M721314M899919N082041N169302N277634
$$ 349933594 354628563 359193444 363786846 368508160 373408079 378490120 383659422 388937056
3559C88937056N371153N205572M961491N452215O231249O242811O002725O034642O188452
$$ 388937056 394308209 399513781 404475272 409927487 416158736 422401547 428404272 434438914 440627366
3577.4D40627366O403297O621808O569058O275326O445706P093847P056117O810963
$$ 440627366 447030663 453652471 460221529 466496855 472942561 480036408 487092525 493903488
3593.7D93903488P077128P396340P444620P478714P395089O990254O975829P418216
$$ 493903488 500980616 508376956 515821576 523300290 530695379 537685633 544661462 552079678
3610E52079678P634699P691264P416308P244945P900416Q112193P379829O365657O352961
$$ 552079678 559714377 567405641 574821949 582066894 589967310 598079503 605459332 611824989 618177950
3628.4F18177950P703364P800103P214605O919444O614029O461263O340086N739213
$$ 618177950 625881314 633681417 640896022 647815466 654429495 660890758 667230844 672970057
3644.7F72970057M815101M931152O261349O280541N271375N222261N394340M767179
$$ 672970057 677785158 682716310 688977659 695258200 700529575 705751836 711146176 715913355
3661G15913355M232049L936947L198206K656460L226280L017843K381802L301143L831923
$$ 715913355 720145404 724082351 727280557 729937017 733163297 736181140 738562942 741864085 745696008
3679.4G45696008L398299K957225K376795J766086J777053K473771K811730K496481
$$ 745696008 749094307 752051532 754428327 756194413 757971466 760445237 763256967 765753448
3695.7G65753448J902342J326620J248181J698077J619160Q71837L74735R26316J934707
$$ 765753448 767655790 768982410 770230591 771928668 773547828 774419665 774794400 775720716 777655423
3714G77655423J877844J135111O41584O27518P89821R72867J085043O10352p6533o9439
$$ 777655423 779533267 780668378 781309962 781937480 782727301 783700168 784785211 785395563 785319030 785249591
3734.4G85249591Q92341J807451J347125j73927n97298O93262N83231N1439J084388
$$ 785249591 786141932 787949383 789296508 789122581 788525283 789218545 789801776 789853215 790937603
3752.8G90937603J631379R78469N04554P19011P25448M00781K48552K25842O06119
$$ 790937603 792568982 793547451 794052005 794771016 795496464 795897245 796145797 796371639 796977758
3771.1G96977758J001478P21335J65105K5332L70204M45247L52681N24163O09219M51148
$$ 796977758 797979236 798700571 798865676 798891008 799261212 799706459 800059140 800583303 801192522 801643670
3791.5H01643670M8875k32279n0425k36929k55346N37753M73261L62456R04619P28488
$$ 801643670 801692545 801460266 801409841 801172912 800917566 801455319 801928580 802291036 803195655 803924143
3811.9H03924143j82271n78105j88887k63214K13086R97186P10487L63112J40190p0393
$$ 803924143 803741872 803163767 802974880 802711666 802924752 803921938 804632425 804995537 805135727 805065334
3832.3H05065334q7798l69131m65870J73151O73712Q62896P92563K11477r39607j904726
$$ 805065334 804977536 804608405 804142535 804315686 804989398 805852294 806644857 806856334 805916727 804012001
3852.7H04012001l19601J590372J200020K26259l22580q7381J69158k33948j72913
$$ 804012001 803692400 805282772 806482792 806709051 806386471 806299090 806468248 806234300 806061387
3871.1H06061387L82662O74486M80235j79232j47640J58727k0862J71066J23262j16706
$$ 806061387 806444049 807118535 807598770 807419538 807271898 807430625 807409763 807580829 807704091 807587385
3891.5H07587385L43919M76539j87397p29859p02917j38879P34985R87112N21362J18911
$$ 807587385 807931304 808407843 808220446 807490587 806787670 806648791 807383776 808370888 808892250 809011161
3911.9H09011161r6559k86401k01344J07348J23799p8142J0669J35243k2888K623K87652
$$ 809011161 808914602 808628201 808426857 808534205 808658004 808579862 808590531 808725774 808702886 808705509 808993161
3934.3H08993161L36528J34348j21176j97708K2292R8765K1875J48475K82168J87099
$$ 808993161 809329689 809464037 809342861 809145153 809167445 809266210 809288085 809436560 809718728 809905827
3954.7H09905827J2100j6749M0710N4896O8664J25587J62304J08182M1247P1287J70290
$$ 809905827 809917927 809901178 809941888 809996784 810065448 810191035 810353339 810461521 810502768 810574055 810744345
3977.1H10744345J74046R0360J11342J41561N2512J8179R8944J08063L58K7597
$$ 810744345 810918391 811008751 811120093 811261654 811314166 811332345 811431289 811539352 811539710 811567307
3997.5H11567307
$$ 811567307
##END=$$ End of the data block
