##TITLE=$$ Begin of the data block
##JCAMP-DX=5.00 $$ ACD/SpecManager v 10.08
##SPECTROMETER/DATA SYSTEM=Alpha
##DATE=15 Apr 2014 09:00:42
##DATA TYPE=INFRARED SPECTRUM
##DATA CLASS=XYDATA
##ORIGIN=
##OWNER=
##NPOINTS=1765
##FIRSTX=399.75695801
##LASTX=3997.56933594
##MAXX=3997.56933594
##MINX=399.75695801
##MAXY=0.85142523
##MINY=0.18728706
##XFACTOR=1.0000000000
##YFACTOR=1.000000000000000e-9
##FIRSTY=0.58487582
##DELTAX=2.03957629
##XUNITS=1/CM
##YUNITS=ARBITRARY UNITS
##XYDATA=(X++(Y..Y))
399.8E84875822k541840j614749j316131k417922k087056j06395q0645j885235k016067
418.1E70809782q7142l40462j747549o49333N22554q88526j685798m91262n78344j762569
438.5E63101351p62284Q20995k04504j416623r120R45986o99103j422763j44243m18008
458.9E59791684k001345j324296K90990p07030k368451j244127j6690j489162k153874
477.3E48777699l41117J71542j454055j305938L78132m41492k186477r96053L55959
495.6E42958200j397550k689242r36986L8147j640796j916409k16305o86705k557159
514E30955195j889944l16918j446485k813280j526534o65307k283454k648056p52151
532.3E16613066o21855k248943j589417J86920p43985k211512r03666K19405j423299
$$ plain form
399.8 584875822 582333982 580719233 579403102 576985180 574898124 574791729 574711084 572825849 570809782
418.1 570809782 570722640 570382178 568634629 567985296 568507850 567619324 565933526 565442264 564863920 563101351
438.5 563101351 562339067 563160062 562955558 561538935 561529815 562475801 561776698 560353935 560209692 559791684
458.9 559791684 557790339 556466043 556757033 556050003 553681552 552437425 552420735 550931573 548777699
477.3 548777699 548436582 548608124 547154069 545848131 546226263 545784771 543598294 542602241 542958200
495.6 542958200 541560650 538871408 537934422 537972569 536331773 534415364 534199059 533512354 530955195
514 530955195 529065251 528748333 527301848 524488568 522962034 522296727 520013273 517365217 516613066
532.3 516613066 515991211 513742268 512152851 512339771 511595786 509384274 508480608 508700013 507276714
550.7E07276714k330482p09176m55260k485335k578110r41783j857787m066736l347576
569D88504469j689136k722114l707588k060800j309067l153444l587216j808077j789779
587.4D66677248l552377l393531j976877k624244l848731k955049k210111l652781
603.7D42463547l901273j321703J03265j223028j528710O43104K344102K661258L790945
622.1D44031507N185485M280388K933860M004687N085796L647685K436072L332406
638.4D74937886L095835N65172J12295L028959M112363J632541j53720P957J075357
656.7D88414645L984332P353455P443279M432380K885878M657329M164099K058923
673.1E25394320K168477L820360L402054J471996J940608L417671K232194N90205J618326
$$ plain form
550.7 507276714 504946232 504237056 503781796 501296461 498718351 497776568 495918781 491852045 488504469
569 488504469 486815333 484093219 480385631 478324831 477015764 473862320 470275104 468467027 466677248
587.4 466677248 463124871 459731340 457754463 455130219 451281488 448326439 446116328 442463547
603.7 442463547 438562274 437240571 437343836 436120808 434592098 435235202 437579304 440240562 444031507
622.1 444031507 449216992 453497380 456431240 460435927 465521723 469169408 471605480 474937886
638.4 474937886 478033721 478598893 478711188 481740147 485852510 487485051 487331331 487339288 488414645
656.7 488414645 492398977 499752432 507195711 511628091 514513969 519171298 523335397 525394320
673.1 525394320 527562797 531383157 534785211 536257207 538197815 541615486 543847680 544437885 546056211
691.4E46056211K405584O86347k02119J455605K078116O69539Q32200K698600K629578
709.8E59309661J273096K074957L612816K727092J398682K612710L743231K327681
726.1E79079926J385987K741098L146887J482904J173198K614796K442182R88483J541018
744.4E96596479L011287K288639J048744K098858L195584K021134J233518K539992
760.8F14034235L086746J649261J274407K604663K484024Q24809O73830J482427M78149
779.1F28592551j118481o68109L80218j62721l28123J696467L553748L626883M235924
797.5F39808357O271481O992698N824029N500734O176949N228877L253043K969026
813.8F82025194L358483J859725j29282l95895o80089k651572m090726l596306l456116
$$ plain form
691.4 546056211 548461795 549148142 548946023 550401628 552479744 553149283 553981483 556680083 559309661
709.8 559309661 560582757 562657714 566270530 568997622 570396304 573009014 576752245 579079926
726.1 579079926 580465913 583207011 586353898 587836802 589010000 591624796 594066978 595055461 596596479
744.4 596596479 599607766 601896405 602945149 605044007 608239591 610260725 611494243 614034235
760.8 614034235 617120981 618770242 620044649 622649312 625133336 625958145 626631975 628114402 628592551
779.1 628592551 627474070 626805961 627186179 627023458 626695335 628391802 631945550 635572433 639808357
797.5 639808357 646079838 653072536 658896565 664397299 670574248 675803125 679056168 682025194
813.8 682025194 685383677 687243402 687114120 686718225 686038136 683386564 679295838 675699532 672243416
832.1F72243416m598915m773319l536999l252328m091441l734827k085567r37581K29418
850.5F45461857L046513O282628P870793Q642852J0002017J0712564R580136Q267402
866.8G09866762Q017361P082045M746616L327072L377438K581715P54595Q6725K83301
885.2G40123630p36773k171576j921237q95500q38578n95272J092673K375305J893162
903.5G38325834J460016J948476J446903m51506j701712k044022l193736m662454m398048
921.9G26729751k934039k098680j343250M45008J843095J451850Q09789J292527J456976
940.2G27653027M31537q8215L03567k90215j953483k878547l280103m774332o812513
958.6G08310723p919132q966685j1284232j3743222j4993012j5760779j6493559j5824973
$$ plain form
832.1 672243416 667644501 662871182 659334183 656081855 651990414 648255587 646170020 645232439 645461857
850.5 645461857 648508370 654790998 662661791 671304643 681306660 692019224 701599360 709866762
866.8 709866762 717884123 724966168 729712784 733039856 736417294 738999009 739753604 739840329 740123630
885.2 740123630 739386857 737215281 735294044 734398544 733559966 732964694 734057367 736432672 738325834
903.5 738325834 739785850 741734326 743181229 742729723 741028011 738983989 735790253 731127799 726729751
921.9 726729751 723795712 721697032 720353782 720798790 722641885 724093735 724903524 726196051 727653027
940.2 727653027 728084564 727996349 728299916 728009701 726056218 723177671 719897568 715123236 708310723
958.6 708310723 700391591 691424906 680140674 666397452 651404440 635643661 619150102 603325129
974.9F03325129j3505042j1476398j0547995r469688p883012o973386o819129o135881
991.2E30514598m958034m337430l983199l093124k258420k427697l222525l999650
1007.5E02234519n115927o630063p554412p488906p191509p003963o411910n493760
1023.9D49344069n019009m908979m434854l772676l566593l505528l022462k474010
1040.2D18639958k411276k487928k255767k121151k264380j910478p16508N65380J409799
1058.5D06447649J881808J745611M72427j684308l757745n337954o501227p042736
1074.8C86223525o857187o524265o497711o483435o298900o294280o502539o268203
1091.2C34497005n151600l550708j976043n21481N54442Q89749O81489M61906K74927
$$ plain form
974.9 603325129 589820087 578343689 567795694 558326006 550442994 543469608 536650479 530514598
991.2 530514598 525556564 521219134 517235935 514142811 511884391 509456694 506234169 502234519
1007.5 502234519 497118592 490488529 482934117 475445211 468253702 461249739 454837829 449344069
1023.9 449344069 444325060 439416081 434981227 431208551 427641958 424136430 421113968 418639958
1040.2 418639958 416228682 413740754 411484987 409363836 407099456 405188978 404472470 405037850 406447649
1058.5 406447649 408329457 410075068 410547495 408863187 405105442 399767488 393266261 386223525
1074.8 386223525 379366338 372842073 366344362 359860927 353562027 347267747 340765208 334497005
1091.2 334497005 329345405 325794697 323818654 323297173 323851615 324741364 325422853 325884759 326159686
1109.5C26159686k09361j022488k096534l707647n820841o834328m699469n22911K166330
1127.9C03412437K276123J052082j18435J43558J830727L416031L872455L438890K842426
1146.2C22166294K445191K146155J968860K189547K835572L686786M759609O268978
1162.6C48466992Q085549R678006J0711134J1283517J1398405J0937452J0208815R657502
1178.9D30427372R049863P935703O540120N136817L439695J460075m3481n58734k92927
1197.2D63094503O55293K416283M454672N753607O004125N679279N004853L937036
1213.5D96999651L000528K726376K690971K393961K212524K506077K789140K706111
1229.9E18025339K776324L212214L384828L137053L050029L129542K757370K022565
$$ plain form
1109.5 326159686 325950325 324927837 322831303 319123656 313302815 306468487 301769018 301246107 303412437
1127.9 303412437 305688560 306740642 306622207 306765765 308596492 312012523 315884978 319323868 322166294
1146.2 322166294 324611485 326757640 328726500 330916047 333751619 337438405 342198014 348466992
1162.6 348466992 356552541 366230547 376941681 388225198 399623603 410561055 420769870 430427372
1178.9 430427372 439477235 447412938 453953058 459089875 462529570 463989645 463946164 463387430 463094503
1197.2 463094503 463749796 466166079 470620751 476374358 482378483 488057762 493062615 496999651
1213.5 496999651 500000179 502726555 505417526 507811487 510024011 512530088 515319228 518025339
1229.9 518025339 520801663 524013877 527398705 530535758 533585787 536715329 539472699 541495264
1246.2E41495264J582026J356125Q85546N19812P88510J298726J608073K139271L139674
1264.5E54813027M021526M452049M960061N702912O020427N851150N900740O243885
1280.8E97965777O237507N996823O211817O539882O204664N597174N394042N131066
1297.2F45278752M317343L616393L460943L149629K404153J968682J983881J702905
1313.5F67882681J101792J015186J439273J507640J277149J467109J710474J261354
1329.8F78662658N90920L56794J40547l65913l63886L48270O65486M13239M33683P36296
1350.2F81618094N34654n3584k50280k72274q45790j498401j352847j211524j689851
1368.5F74978197j944125j926959k110302k506077l553629n550623o565750l825664
$$ plain form
1246.2 541495264 543077290 544433415 545318961 545838773 546627283 547926009 549534082 551673353 554813027
1264.5 554813027 558834553 563286602 568246663 573949575 579970002 585821152 591721892 597965777
1280.8 597965777 604203284 610200107 616411924 622951806 629156470 634753644 640147686 645278752
1297.2 645278752 649596095 653212488 656673431 659823060 662227213 664195895 666179776 667882681
1313.5 667882681 668984473 669999659 671438932 672946572 674223721 675690830 677401304 678662658
1329.8 678662658 679253578 679610372 679750919 679385006 679021120 679369390 680034876 680448115 680881798 681618094
1350.2 681618094 682152748 682099164 681848884 681576610 680730820 679232419 677879572 676668048 674978197
1368.5 674978197 673034072 671107113 668996811 666490734 662937105 657386482 650820732 646995068
1384.9F46995068R55045K963900J489103n28157j553297j790940k412141k987325l269672
1403.2F39861584l628850l549457l172159k699137k180993j954079k020001j574398
1419.5F19082510n92410l01600k00212j1801j00196J18494N12958O91831J365960K070903
1439.9F22636437K265335K252519K185940K555669L420770L908813L955603N137741
1456.2F48318827P911980Q274019P129192P061303P552087P272065P033467P985235
1472.6G08538175Q355021P090867N595088M341483L296852K041638O69241k55287l49402
1490.9G39323676n25475j809060l224254l214061k839864l319978n565286p885575
1507.2G10940123n632341m168868m807711n292118m870534m012405l952027l356814
$$ plain form
1384.9 646995068 647950113 650914013 652403116 651874959 650321662 648530722 646118581 643131256 639861584
1403.2 639861584 636232734 632683277 629511118 626811981 624630988 622676909 620656908 619082510
1419.5 619082510 618490100 618188500 617988288 617976487 617876291 617994785 618507743 619199574 620565534 622636437
1439.9 622636437 624901772 627154291 629340231 631895900 635316670 639225483 643181086 648318827
1456.2 648318827 656230807 664504826 671634018 678695321 686247408 693519473 700552940 708538175
1472.6 708538175 716893196 723984063 729579151 733920634 737217486 739259124 739928365 739673078 739323676
1490.9 739323676 738798201 736989141 733764887 730550826 727710962 724390984 718825698 710940123
1507.2 710940123 705307782 701138914 696331203 691039085 686168551 682156146 678204119 674847305
1523.6F74847305k697885k675176k346575k651572k978444j970649j941681l238142
1539.9F54347181k165734j35482M26710L93033L28243N72085O89805K16841q79407
1558.2F53793275j61945R48131k75255j794695l215075m213870m050850n303503p747829
1576.6F27978384p248640o617665p674694q404851q749068q978068r067178r018123
1592.9E62220097r006083q804620q476853q303523q167207p919074p783472p851660
1609.2D95907605p616043p247836q027524q841365o814063n930155o789774o333739
1625.5D38307106n535691m884959l763318l478378l618032j668393K19315Q91984J216590
1643.9D17686224J797885L156125L584802L632307N598814O462991N992591O246895
$$ plain form
1523.6 674847305 672149420 669474244 667127669 664476097 661497653 659527004 657585323 654347181
1539.9 654347181 652181447 652045965 652472675 652865708 653193951 653766036 654455841 654672682 653793275
1558.2 653793275 653631330 654579461 654304206 652509511 649294436 645080566 641029716 635726213 627978384
1576.6 627978384 620729744 614112079 606437385 598032534 589283466 580305398 571238220 562220097
1592.9 562220097 553214014 544409394 535932541 527629018 519461811 511542737 503759265 495907605
1609.2 495907605 488291562 481043726 473016202 464174837 457360774 451430619 444640845 438307106
1625.5 438307106 432771415 427886456 424123138 420644760 417026728 415358335 415577650 416469634 417686224
1643.9 417686224 419484109 422640234 426225036 429857343 435456157 441919148 447911739 454158634
1660.2D54158634P191539Q064806P726342Q022815R439856R473919R738446J0855794
1676.5E24672151J0580897R756386J0089874J2801409J3072014J1359930J1289716
1690.8F03622377J0531306J0561228J1301517J1509955J3276399J2018680R860754
1705.1F82682216R543002Q560061P208169O023466N225718N501688O011188N423307
1721.4G36178815M695595M364073L835738L424525L083408L256678M171849M054904
1737.7G67065585L753483L887951L829182L682673L592967L606976L920972L729105
1754G97068894L095090K647758K290726K305984K422273J898647J318633J130939J325130
1772.4H15504074J937926K041280J642943J317679J214445J255393J384080J108706
$$ plain form
1660.2 454158634 461350173 469414979 477141321 485164136 494603992 504077911 513816357 524672151
1676.5 524672151 535253048 545009434 555099308 567900717 580972731 592332661 603622377
1690.8 603622377 614153683 624714911 636016428 647526383 660802782 672821462 682682216
1705.1 682682216 692225218 700785279 707993448 714016914 719242632 724744320 730755508 736178815
1721.4 736178815 740874410 745238483 749074221 752498746 755582154 758838832 763010681 767065585
1737.7 767065585 770819068 774707019 778536201 782218874 785811841 789418817 793339789 797068894
1754 797068894 800163984 802811742 805102468 807408452 809830725 811729372 813048005 814178944 815504074
1772.4 815504074 817442000 819483280 821126223 822443902 823658347 824913740 826297820 827406526
1788.7H27406526N07772P81774J470387J266897P75099Q24332J077831R76681P43211
1807H35830510O39677O54340O95586O93798O59346O11246M36008K57850L20494L45886
1827.4H41144741K67386O66201Q96514N15818L58105M63903J48833k40326K83003Q35359
1847.8H45339537O60181L88682L53634L75807K56539J76847K22981J70946j46509k08616
1868.2H47590029M14551P75575M48168J74641K00927J75834O9320Q9169J31368J2815
1888.6H50082397N2989K13921J71602J14381J28567J57178J45435L6597o8426k4438
1909H51010203J05560J18852l9637j40667L338M9173J6988J47044J38641J5736p630
1931.5H51417601o735o0082j11103j66535k50578j73509L159L9041m2975j40607j71364
$$ plain form
1788.7 827406526 827914298 828696072 830166459 831433356 832208455 833032787 834110618 835087299 835830510
1807 835830510 836470187 837124527 837820113 838513911 839173257 839784503 840220511 840478361 840798855 841144741
1827.4 841144741 841412127 842078328 842974842 843490660 843848765 844312668 844461501 844221175 844504178 845339537
1847.8 845339537 845999718 846388400 846742034 847117841 847374380 847551227 847774208 847945154 847798645 847590029
1868.2 847590029 848004580 848780155 849228323 849402964 849603891 849779725 849849045 849938214 850069582 850082397
1888.6 850082397 850135386 850349307 850520909 850635290 850763857 850921035 851066470 851103067 851034641 851010203
1909 851010203 851115763 851234615 851194978 851054311 851057649 851106822 851123810 851270854 851409495 851425231 851417601
1931.5 851417601 851410866 851350784 851239681 851073146 850822568 850649059 850652218 850691259 850648284 850507677 850336313
1953.9H50336313j43647j62482k01404j71066j73390k43365k08438j14262j00314j36912
1974.3H48681033j77324j65939j31250j47223k11299k52843k52187k63095k05219q0406
1994.7H46794248r6202k01702k14219j78040j96993k71737k90454k44737k21788k70665
2015.1H44607711l06547k38359k04682k44498k52366k25783k27570k35379k39313k48015
2035.5H42185199k42233k48730k36094k10226k46346k77757k12253j59084j71543j89840
2055.9H39991093j86503j73807k11656k35022j42872o9737j27495j46866q1121r0421
2076.3H38525593j49369j17421o4373q8573j26361j16945r2149j01566p6890j3173
2096.7H37578773J0729k4795n5075k3901j3233m3273j0788L6538k0326n4538M8220
$$ plain form
1953.9 850336313 850192666 850030184 849828780 849657714 849484324 849240959 849032521 848918259 848817945 848681033
1974.3 848681033 848503709 848337770 848206520 848059297 847847998 847595155 847342968 847079873 846874654 846794248
1994.7 846794248 846698046 846496344 846282125 846104085 845907092 845635355 845344901 845100164 844878376 844607711
2015.1 844607711 844301164 844062805 843858123 843613625 843361259 843135476 842907906 842672527 842433214 842185199
2035.5 842185199 841942966 841694236 841458142 841247916 841001570 840723813 840511560 840352476 840180933 839991093
2055.9 839991093 839804590 839630783 839419127 839184105 839041233 838971496 838844001 838697135 838616014 838525593
2076.3 838525593 838376224 838258803 838194430 838105857 837979496 837862551 837770402 837668836 837591946 837578773
2096.7 837578773 837589502 837564707 837509632 837485731 837472498 837429225 837418437 837454975 837434649 837380111 837428331
2119.1H37428331J24932M5240j5080O4909J16646N4777J3828P9275J19209O0618N7935
2141.5H38150620J60337J66774O4552P9810J59085R7811J6868Q5831J66595J28686
2161.9H39276969Q2553J29342J42515Q4340J11699J99080J74105O9737Q2016J67191
2182.3H40519547J29998L5405Q4877J83285R7632l0518N2155J68204O9558l2842N8532
2204.8H41335833J05381m053J729J44541J22845l7193k7359Q8811L7313n9903L457
2227.2H41711402J00672L4034o9081J609N5432o0916q3208N9426L7789j26779r1314
2249.6H41569066O2585J8835j29998p2896N0425k0146j03116O556J15037L9995j8179
2272.1H41518164R9003J37985n901J6272J88529J88113N0962Q344Q2553N3644m8161
$$ plain form
2119.1 837428331 837553263 837598503 837583423 837648332 837764978 837819755 837833583 837912858 838032067 838092685 838150620
2141.5 838150620 838310957 838477731 838542283 838622093 838781178 838878989 838895857 838981688 839148283 839276969
2161.9 839276969 839359522 839488864 839631379 839715719 839827418 840026498 840200603 840270340 840352356 840519547
2182.3 840519547 840649545 840684950 840769827 840953112 841050744 841020226 841072381 841240585 841310143 841277301 841335833
2204.8 841335833 841441214 841437161 841438890 841583431 841706276 841669083 841641724 841730535 841767848 841707945 841711402
2227.2 841711402 841812074 841846108 841777027 841778636 841834068 841773152 841689944 841749370 841787159 841660380 841569066
2249.6 841569066 841631651 841650486 841520488 841447592 841498017 841477871 841374755 841381311 841496348 841536343 841518164
2272.1 841518164 841617167 841755152 841749251 841765523 841954052 842142165 842193127 842201471 842284024 842337668 842289507
2294.5H42289507K5034J63913Q4698m1902P2062J93417O0022n0783R3579J74463q225
2316.9H43055785j12832M5061J11580O080K9325J22786O3300m709R3580J57237R000
2339.4H43576193j53422p5877K59101N87404N30481K03550r7453k83063k58028O496
2359.8H44295382R5785J01030L73006M78625K38180J60158M44889O22392M24385L11553
2380.2H47545385N17249N60463K20001M1067K50340L06129O7473L7610K39492J65283
2400.6H49950492r3281l636K36035J01685j15394M9710K27809J3530j60933L9280J28150
2423H50373447j16527j29402J84238J89424j11163r8050J41442M5300j89603o0796
2443.4H50228310J39415l9101k30968j6272J63257o0618j98841L1412J07706j77563
$$ plain form
2294.5 842289507 842314541 842478454 842563152 842521250 842593312 842786729 842846751 842795968 842889547 843064010 843055785
2316.9 843055785 842942953 842988014 843099594 843105674 843134999 843257785 843321085 843316376 843409956 843567193 843576193
2339.4 843576193 843422771 843346894 843605995 844193399 844723880 844927430 844829977 844546914 844288886 844295382
2359.8 844295382 844391167 844492197 844865203 845343828 845582008 845742166 846187055 846809447 847233832 847545385
2380.2 847545385 848062634 848623097 848843098 848884165 849134505 849440634 849508107 849545717 849785209 849950492
2400.6 849950492 849857211 849853575 850089610 850191295 850075901 850125611 850353420 850366950 850206017 850245297 850373447
2423 850373447 850256920 850127518 850311756 850501180 850390017 850291967 850433409 850478709 850289106 850228310
2443.4 850228310 850367725 850328624 850097656 850081384 850244641 850184023 849985182 850016594 850124300 849946737
2463.8H49946737k41220O5863R5189k12312j80661J02698j2159k80142j17957R0480
2484.2H49256516j26720k81751k4438J08957j43826k33292K7179O2228k28823k29358
2504.6H48186672O4432J8776k64585j48535J29461o1512l31700j19328R6619j36793
2525H47433507l11553o3479O2227k02000k53022L1770J5795k68161k02179O0618n8294
2547.4H46245229l10302j52289P7128j25408l31938j00077N9545k03073l29077p8976
2567.8H44750762m3035l33428l24011k9623j04964m42028l58760o1453k20179m83036
2588.2H42350245k78593r7274l79205n41270k54094j59741n04672n83947k53916k43723
2608.6H39053810n61417n13911k28345l41773o27756n02229k60353m22418o27816m41730
$$ plain form
2463.8 849946737 849705517 849771380 849866569 849654257 849473596 849576294 849564135 849283993 849166036 849256516
2484.2 849256516 849129796 848848045 848823607 848932564 848788738 848555446 848582625 848644853 848416030 848186672
2504.6 848186672 848251104 848269880 848005295 847856760 847986221 847924709 847593009 847473681 847570300 847433507
2525 847433507 847121954 847058475 847120702 846918702 846665680 846697450 846713245 846445084 846242905 846303523 846245229
2547.4 846245229 845934927 845782638 845859766 845734358 845402420 845302343 845361888 845158815 844829738 844750762
2567.8 844750762 844707727 844374299 844050288 844020665 843915701 843473673 843114913 843053460 842833281 842350245
2588.2 842350245 842071652 841974378 841595173 841053903 840799809 840640068 840135396 839551449 839297533 839053810
2608.6 839053810 838492393 837978482 837750137 837408364 836780608 836278379 836018026 835595608 834967792 834526062
2629H34526062k77221m88401n94794l21925k61664n74828o10470l15428l27468o05464
2649.4H30148399n39422k71976l91483o42181m70340k24710m10795o12676l89814k49446
2669.8H25945556n07235n87166l21567l11672o00458n90861l24904l77953o63400n97418
2690.2H21062922l37004m58121o81520n28395l88324o03617p12454m64916l90589o80089
2710.6H15817893p56860n19932n16533p34449o62505m18306n21421p72238o65903m55618
2731H09794128n66721o74129m94360m35949o57499p04407m69149m24265o74010p36177
2751.4H03957462n49972n80013p74323p22290n65409o45101p93159p27773o34074p46608
2771.8G97218740q53479p88987p99298r38535r39607q13604q36610r93193r97901r14812
$$ plain form
2629 834526062 834248841 833760440 833165646 832843721 832582057 832007229 831396759 831081331 830753863 830148399
2649.4 830148399 829608977 829337001 828945518 828303337 827832997 827608287 827197492 826584816 826195002 825945556
2669.8 825945556 825438321 824851155 824529588 824217916 823617458 823026597 822701693 822323740 821660340 821062922
2690.2 821062922 820725918 820267797 819586277 819057882 818669558 818065941 817353487 816888571 816497982 815817893
2710.6 815817893 815061033 814541101 814024568 813290119 812627614 812209308 811687887 810915649 810249746 809794128
2731 809794128 809227407 808553278 808058918 807622969 806965470 806261063 805791914 805367649 804693639 803957462
2751.4 803957462 803407490 802827477 802053154 801330864 800765455 800120354 799327195 798599422 797965348 797218740
2771.8 797218740 796365261 795576274 794776976 793838441 792898834 792085230 791248620 790255427 789257526 788342714
2792.2G88342714j020908j147628j068175j009285j145363j277983j227200j173437
2808.5G79272735j302957j391173j304447j310289j471639j525462j448095j483738
2824.8G68034935j642823j715660j741708j921475k195179k405942k693414l259182
2841.1G50459552l915012m440904m791736m686416l887534k717316j726806j141727
2857.4G23152101r23574j063287j546800k159834k599657k735674k613187k402961
2873.7G07107127k191007j943648j759708j721263j777947j906872k065301k167702
2890.1F91573679k193272k241730k375722k479077k474308k446711k537310k777457
2906.4F72048092l079951l482997m003406m440904m611730m471779m018664l262997
$$ plain form
2792.2 788342714 787321806 786174178 785106003 784096718 782951355 781673372 780446172 779272735
2808.5 779272735 777969778 776578605 775274158 773963869 772492230 770966768 769518673 768034935
2824.8 768034935 766392112 764676452 762934744 761013269 758818090 756412148 753718734 750459552
2841.1 750459552 746544540 742103636 737311900 732625484 728737950 726020634 724293828 723152101
2857.4 723152101 722228527 721165240 719618440 717458606 714858949 712123275 709510088 707107127
2873.7 707107127 704916120 702972472 701212764 699491501 697713554 695806682 693741381 691573679
2890.1 691573679 689380407 687138677 684762955 682283878 679809570 677362859 674825549 672048092
2906.4 672048092 668968141 665485144 661481738 657040834 652429104 647957325 643938661 640675664
2922.7F40675664k358198j431287n49078J21475O46472J229763J821935K273142K574444
2941F45004332K696097K460182J887500J244843P00891K36392n8353o9320P5817K47657
2961.4F54426038L74854M26948M26352M11749M50671N27441N89132P26402R07839Q97467
2981.8F60164893P74681P55251P59124O44803L39747n3883l33070o12200r39369j090586
3002.2F60409391j163364j290380j304806j198351j223803j458585j684785j758873
3018.5F49326444j820505j947224k019823k030492k041578k055764k060115k172947
3034.9F33177996k354801k330840k241134k371610k608418k699733k607345k574027
3051.2F13390088k690554k731502k674579k681971k696633k611816k497375Tk603293
$$ plain form
2922.7 640675664 638317466 636886179 636337101 636458576 637105048 638334811 640156746 642429888 645004332
2941 645004332 647700429 650160611 652048111 653292954 653993845 654230237 654171884 654102564 654178381 654426038
2961.4 654426038 654800892 655227840 655654192 656065941 656516612 657044053 657633185 658359587 659267426 660164893
2981.8 660164893 660939574 661694825 662453949 663098752 663438499 663384616 663051546 662439346 661499977 660409391
3002.2 660409391 659246027 657955647 656650841 655452490 654228687 652770102 651085317 649326444
3018.5 649326444 647505939 645558715 643538892 641508400 639466822 637411058 635350943 633177996
3034.9 633177996 630823195 628492355 626251221 623879611 621271193 618571460 615964115 613390088
3051.2 613390088 610699534 607968032 605293453 602611482 599914849 597303033 594805658 592308283 589704990
3069.5E89704990k639472k579510k494276k421200k489150k667725k784371k784431
3085.8E68844855k682328k632618k758980k863407k801180k745986k820552k937972
3102.2E46601832k974391k932310k946735l048658l061831k981245l021539l172219
3118.5E22462904l374338l574311l542602l353894l315985l433168l501475l456950
3134.8D94910181l423751l475308l607750l706336l687322l657133l627658l594935
3151.1D66129988l715455l920287l926605l817409l791899l801793l830701l890633
3167.4D35435206l901273l840030l811240l852784l879875l822327l771096l780723
3183.7D04775858l771216l738880l722787l724158l702879l674745l659338l606766
$$ plain form
3069.5 589704990 587065518 584486008 581991732 579570532 577081382 574413657 571629286 568844855
3085.8 568844855 566162527 563529909 560770929 557907522 555106342 552360356 549539804 546601832
3102.2 546601832 543627441 540695131 537748396 534699738 531637907 528656662 525635123 522462904
3118.5 522462904 519088566 515514255 511971653 508617759 505301774 501868606 498367131 494910181
3134.8 494910181 491486430 488011122 484403372 480697036 477009714 473352581 469724923 466129988
3151.1 466129988 462414533 458494246 454567641 450750232 446958333 443156540 439325839 435435206
3167.4 435435206 431533933 427693903 423882663 420029879 416150004 412327677 408556581 404775858
3183.7 404775858 401004642 397265762 393542975 389818817 386115938 382441193 378781855 375175089
3200.1C75175089l519744l446251l403157l387928l364057l330975l277868l174961
3216.4C48270148l112078l103465l088176l057778k993017k902299k803207k709269
3232.7C24500859k723724k773672k662361k515703k448410k385229k331763k325476
3249C04334521k316028k255350k187818k167464k190202k192229k135932k076716k037525
3267.4B84775257j986802k007156k119392k153307k078474k032995k067358k112150
3283.7B68217623k091735k027244j957267j917154j976460k066106k096384k076328
3300B52008945j981795j877293j908913k019152k095074k138167k094135j987934j920343
3318.4B33986139j891762j880333j861751j878187j924395j883492j787529j707315
$$ plain form
3200.1 375175089 371655345 368209094 364805937 361418009 358053952 354722977 351445109 348270148
3216.4 348270148 345158070 342054605 338966429 335908651 332915634 330013335 327210128 324500859
3232.7 324500859 321777135 319003463 316341102 313825399 311376989 308991760 306659997 304334521
3249 304334521 302018493 299763143 297575325 295407861 293217659 291025430 288889498 286812782 284775257
3267.4 284775257 282788455 280781299 278661907 276508600 274430126 272397131 270329773 268217623
3283.7 268217623 266125888 264098644 262141377 260224223 258247763 256181657 254085273 252008945
3300 252008945 250027150 248149857 246240944 244221792 242126718 239988551 237894416 235906482 233986139
3318.4 233986139 232094377 230214044 228352293 226474106 224549711 222666219 220878690 219171375
3334.7B19171375j635715j640007j712993j712635j667902j588792j433432j432940
3351B06346959j600370j626730j457721j288354j232460j207829j066819r43497j060813
3369.3A94862366j269102j238481r62734p52091o98000o91817o10470m29824j82033
3387.7A88027814N6058l7387l86938l72485R4325L87773J20610k36571r4637K59071
3408.1A87817633M30256M52712L68312L25576M63948O20260O85886Q16286J045972
3426.5A93026841J194268J138210J182631J385152J285151R40189R33930J326934J660138
3444.8B04073444J755580J706511J686797J759946J909181K097548K209395K134204
3461.1B19332606K163052K532080K761602K420754J909911J958102K367109K701655
$$ plain form
3334.7 219171375 217535660 215895653 214182660 212470025 210802123 209213331 207779899 206346959
3351 206346959 204746589 203119859 201662138 200373784 199141324 197933495 196866676 195923179 194862366
3369.3 194862366 193593264 192354783 191392049 190639958 189941958 189250141 188639671 188209847 188027814
3387.7 188027814 188083872 188046485 187659547 187287062 187381387 187769160 187889770 187653199 187558562 187817633
3408.1 187817633 188247889 188700601 189068913 189394489 189858437 190478697 191164583 191980869 193026841
3426.5 193026841 194221109 195359319 196541950 197927102 199212253 200152442 201086372 202413306 204073444
3444.8 204073444 205829024 207535535 209222332 210982278 212891459 214989007 217198402 219332606
3461.1 219332606 221495658 224027738 226789340 229210094 231120005 233078107 235445216 238146871
3477.4B38146871K797664K574920K515018K752751K816737K775669K892256L048926
3493.8B60320812L173888L130704L079117L190398L163874L029138L126353L432780
3510.1B85647064L711254L696143L485233L493011L682762L904999L942132L787279
3526.4C15349877L829926M084349M277140M409492M431724M337043M495948M736454
3542.7C49951953M703700M562289M611939M760265M920483N081147N162537N264789
3559C89019102N331963N141467M941434N519688O324857O259591N955010O031007O238133
3577.4D40762252O441235O615371O527036O269276O472469P105052P091016O849616
3593.7D94133323P083089P379055P432580P527470P449389O997049P006585P471740
$$ plain form
3477.4 238146871 240944535 243519455 246034473 248787224 251603961 254379630 257271886 260320812
3493.8 260320812 263494700 266625404 269704521 272894919 276058793 279087931 282214284 285647064
3510.1 285647064 289358318 293054461 296539694 300032705 303715467 307620466 311562598 315349877
3526.4 315349877 319179803 323264152 327541292 331950784 336382508 340719551 345215499 349951953
3542.7 349951953 354655653 359217942 363829881 368590146 373510629 378591776 383754313 389019102
3559 389019102 394351065 399492532 404433966 409953654 416278511 422538102 428493112 434524119 440762252
3577.4 440762252 447203487 453818858 460345894 466615170 473087639 480192691 487283707 494133323
3593.7 494133323 501216412 508595467 516028047 523555517 531004906 538001955 545008540 552480280
3610E52480280P640183P650078P375836P233918P917404Q107185P332027O356180O421864
3628.4F18514955P772923P811784P205546O916881O608307O474197O347954N706847
3644.7F73359394M804790M993796O307424O261766N247175N196333N391181M777491
3661G16339350M201710L907859L201545K669394L246486L025055K320766L190577L791273
3679.4G45894015L458798L049373K435625J819074J825452K425492K696752K421379
3695.7G66025960J881242J309335J236976J747489J730919R43899L23534Q39352J908481
3714G77947187J888395J167238O65605N89549P46012J021564J147032O24656m9770
3732.4G85747468k1815Q89480J705110J237870j94013n22078Q01742O48320K0504R90808
$$ plain form
3610 552480280 560120463 567770541 575146377 582380295 590297699 598404884 605736911 612093091 618514955
3628.4 618514955 626287878 634099662 641305208 648222089 654830396 661304593 667652547 673359394
3644.7 673359394 678164184 683157980 689465404 695727170 700974345 706170678 711561859 716339350
3661 716339350 720541060 724448919 727650464 730319858 733566344 736591399 738912165 742102742 745894015
3679.4 745894015 749352813 752402186 754837811 756656885 758482337 760907829 763604581 766025960
3695.7 766025960 767907202 769216537 770453513 772201002 773931921 774875820 775199354 776038706 777947187
3714 777947187 779835582 781002820 781668425 782257974 783003986 784025550 785172582 785797238 785747468
3732.4 785747468 785725653 786615133 788320243 789558113 789364100 788842022 789643764 790292084 790312588 791303396
3752.8G91303396J560748R01759M45067P89822Q68737M45068K09332K60651O82711
3771.1G97467291J007617P01606J88649L6001L28958M23968L43621M77373N42224M15683
3791.5H01932991P9333j60277n066k29120k50221N25356M63247L98159R45807P18414
3811.9H04418623k25603n89490j71125k88665J71780J005352P21633L55065J56343
3830.3H05553913k8014p3135l87371n16355J02699O60956Q74639P86841K12609r25243
3850.7H06261539j827061j91569J622617J103163J01507l35396p927K25484k18272
3869H06734085j32501L91483N62072L79205j82033j31428K07663O9558J90139J00672
3889.4H08188915q9526L33667M09841j86383o52373o69539j87814O73830R72867N34713
$$ plain form
3752.8 791303396 792864144 793765903 794210970 795000792 795869529 796314597 796523929 796784580 797467291
3771.1 797467291 798474908 799176514 799365163 799401164 799730122 800154090 800497711 800975084 801517308 801932991
3791.5 801932991 802012324 801852047 801846981 801617861 801367640 801892996 802356243 802754402 803700209 804418623
3811.9 804418623 804193020 803603530 803432405 803143740 803315520 804320872 805042505 805397570 805553913
3830.3 805553913 805525899 805452764 805065393 804549038 804651737 805312693 806187332 806974173 807186782 806261539
3850.7 806261539 804434478 804242909 805865526 806968689 807070196 806734800 806726873 806952357 806734085
3869 806734085 806601584 806993067 807555139 807934344 807752311 807620883 807828546 807898104 808088243 808188915
3889.4 808188915 808099389 808433056 808842897 808656514 808004141 807334602 807146788 807820618 808793485 809328198
3909.8H09328198J19567q0466k63154k32757M5121J33515K5153Q3625J22309p2360
3930.2H09208751n9247K61962L78549J62125j41382j72854P9811R9122m8458M9174
3950.6H09817553K43604K45750J02877K8313K1398L8147J00731J22726R6023P1288
3971H10888410N9306J32442K19047J46627R1315J80661J26302o9618m8578J18435J13904
3993.4H11958253J014O4790
3997.5H12024057
$$ plain form
3909.8 809328198 809447765 809367299 809104145 808871388 808916509 809050024 809075177 809158802 809281111 809208751
3930.2 809208751 809149504 809411466 809790015 809952140 809810758 809637904 809717715 809816837 809768379 809817553
3950.6 809817553 810061157 810306907 810409784 810438097 810459495 810497642 810598373 810721099 810817122 810888410
3971 810888410 810947716 811080158 811299205 811445832 811537147 811717808 811844110 811774492 811725914 811844349 811958253
3993.4 811958253 811959267 812024057
3997.5 812024057
##END=$$ End of the data block
