##TITLE=$$ Begin of the data block
##JCAMP-DX=5.00 $$ ACD/SpecManager v 10.08
##SPECTROMETER/DATA SYSTEM=Alpha
##DATE=15 Apr 2014 09:00:42
##DATA TYPE=INFRARED SPECTRUM
##DATA CLASS=XYDATA
##ORIGIN=
##OWNER=
##NPOINTS=1765
##FIRSTX=399.75695801
##LASTX=3997.56933594
##MAXX=3997.56933594
##MINX=399.75695801
##MAXY=0.85140210
##MINY=0.18703607
##XFACTOR=1.0000000000
##YFACTOR=1.000000000000000e-9
##FIRSTY=0.58534825
##DELTAX=2.03957629
##XUNITS=1/CM
##YUNITS=ARBITRARY UNITS
##XYDATA=(X++(Y..Y))
399.8E85348248k704381j075626q90732k572000k313375j81914j08182j516640j475036
$$ 585348248 582643867 581568241 580677509 578105509 575792134 575610220 575502038 573985398 572510362
418.1E72510362o88255j380742j595139L0875M58240j550614k118171l72171l13580
$$ 572510362 571822107 570441365 568846226 568877101 569335341 567784727 565666556 565294385 564980805
436.5E64980805j752377j015484O88732P987j318157k97308O42121p65205j478016
$$ 564980805 563228428 562212944 562901676 562909663 561591506 561294198 561936319 561171114 559693098
454.8E59693098j67787j25766j679420j390040M232q32260k312303j220822p3552j428664
$$ 559693098 559525311 559399545 557720125 556330085 556334317 555502057 553189754 551968932 551895380 550466716
475.2E50466716j961291k49266J02699j502097j247704M32134l19422k062797j186371
$$ 550466716 548505425 548256159 548358858 546856761 545609057 546041191 545721769 543658972 542472601
493.6E42472601L099j553535k621830p55965J61886j769960k081513j18018m68492
$$ 542472601 542475700 540922165 538300335 537544370 537706256 535936296 533854783 533736765 533268273
511.9E33268273k266050j512348k73287j842082l059626j411438n07891k271414k737224
$$ 533268273 531002223 529489875 529216588 527374506 524314880 522903442 522395551 520124137 517386913
530.3E17386913q20219o17981k296508j744449K21849m08113j922667p64728J73450
$$ 517386913 516566694 515948713 513652205 511907756 512129605 511721492 509798825 509034097 509207547
548.6E09207547j760245k561509n90146l69310k646864k721071r00239j812249m034221
$$ 509207547 507447302 504885793 504295647 503926337 501279473 498558402 497658163 495845914 491811693
567D91811693l227324j612454k840251l988475k250760j285434l106892l508300j582950
$$ 491811693 488584369 486971915 484131664 480143189 477892429 476606995 473500103 469991803 468408853
585.4D68408853j623362l589362l511459j961172k478838l801614k974778k195835
$$ 468408853 466785491 463196129 459684670 457723498 455244660 451443046 448468268 446272433
601.7D46272433l637791l872067j240402J67668j304686j639813O49631K334713K546698
$$ 446272433 442634642 438762575 437522173 437689841 436385155 434745342 435394973 437729686 440276384
620D40276384L709793N244971M416853L018320M022568N082697L626138K494782L486574
$$ 440276384 443986177 449231148 453648001 456666321 460688889 465771586 469397724 471892506 475379080
638.4D75379080L108412M14669O3211L046453M076183J662373o6101P5131J094073
$$ 475379080 478487492 478902161 478965372 482011825 486088008 487750381 487684280 487759411 488853484
656.7D88853484L966540P407785P598042M586339K964735M520119L887653J937568
$$ 488853484 492820024 500227809 507825851 512412190 515376925 519897044 523784697 525722265
673.1E25722265K234996L892064L378510J457632J988172L427506K214014N90325J590669
$$ 525722265 527957261 531849325 535227835 536685467 538673639 542101145 544315159 544905484 546496153
691.4E46496153K388835P18176j84238J449704K069116N88715P15852K677500K705693
$$ 546496153 548884988 549603164 549418926 550868630 552937746 553526461 554242313 556919813 559625506
709.8E59625506J347781K095282L630697K799869J486003K588094L664016K368629
$$ 559625506 560973287 563068569 566699266 569499135 570985138 573573232 577237248 579605877
726.1E79605877J500428K784848L095091J435637J178622K614201K411961R58741J522362
$$ 579605877 581106305 583891153 586986244 588421881 589600503 592214704 594626665 595585406 597107768
744.4E97107768K988517K246559R64940K015948L188550K065480J271725K540529L023684
$$ 597107768 600096285 602342844 603307784 605323732 608512282 610577762 611849487 614390016 617413700
762.8F17413700J623571J360654K667249K458989P69496O15597J461565N24283j079857
$$ 617413700 619037271 620397925 623065174 625524163 626293659 626909256 628370821 628895104 627815247
781.2F27815247p08342L24726j62482k60830J775265L569662L621161M239559O245911
$$ 627815247 627106905 627431631 627269149 627008319 628783584 632353246 635974407 640213966 646459877
799.5F46459877O950617N796731N491435O175220N221606L231227K937853L296316
$$ 646459877 653410494 659207225 664698660 670873880 676095486 679326713 682264566 685560882
815.8F85560882J799762r9420l20971o24418k651334m163921l676176l490448m556298
$$ 685560882 687360644 687261224 686940253 686315835 683664501 679500580 675824404 672333956 667777658
834.2F67777658m672826l480494l289282m171848l765166k029300q89719K19286L048181
$$ 667777658 663104832 659624338 656335056 652163208 648398042 646368742 645479023 645698309 648746490
852.5F48746490O302417P864833Q630156R996355J0653257R473980Q221686Q006155
$$ 648746490 655048907 662913740 671543896 681540251 692193508 701667488 709889174 717895329
868.9G17895329P047176M781545L418803L405809K512872O57797O7652K97904p31945
$$ 717895329 724942505 729724050 733142853 736548662 739061534 739719331 739786983 740084887 739352942
887.2G39352942k088964j796902q76665r07063o41346J054585K316594J849711J485944
$$ 739352942 737263978 735467076 734590411 733683348 733042002 734096587 736413181 738262892 739748836
905.6G39748836K027630J464188n25116j763106k037763l153861m636645m405320k951086
$$ 739748836 741776466 743240654 742715538 740952432 738914669 735760808 731124163 726718843 723767757
923.9G23767757k095818j313984M58061J815617J420737Q01444J287162J417100L73006
$$ 723767757 721671939 720357955 720816016 722631633 724052370 724853814 726140976 727558076 727931082
942.3G27931082j43766K64346k78413j898706k820611l258884m817962o881118p949293
$$ 727931082 727787316 728051662 727773249 725874543 723053932 719795048 714977086 708095968 700146675
960.6G00146675q957267j1258959j3701559j4959037j5771508j6481102j5755832j3471484
$$ 700146675 691189408 679930449 666228890 651269853 635498345 619017243 603261411 589789927
977E89789927j1484563j0553658r474934p878422o968796o841183o185293n013884
$$ 589789927 578305364 567751706 558276772 550398350 543429554 536588371 530403078 525389194
993.3E25389194m384577l998935l083289k285301k483368l263653m045546n174398
$$ 525389194 521004617 517005682 513922393 511637092 509153724 505890071 501844525 496670127
1009.6D96670127o658197p499307p392704p150799o999910o371290n446076n001128
$$ 496670127 490011930 482512623 475119919 467969120 460969210 454597920 449151844 444150716
1025.9D44150716m887402m417717l775448l573567l497511k986461k440750k387286
$$ 444150716 439263314 434845597 431070149 427496582 423999071 421012610 418571860 416184574
1042.2D16184574k452522k239138k125353k242565j882314p18922N39988J358241J836539
$$ 416184574 413732052 411492914 409367561 407124996 405242682 404523760 405063748 406421989 408258528
1060.6D08258528J737296M71413j677245l746271n332827o473005p021606o904751
$$ 408258528 409995824 410467237 408789992 405043721 399710894 393237889 386216283 379311532
1076.9C79311532o571263o447733o402433o271541o306022o529749o292522n136638
$$ 379311532 372740269 366292536 359890103 353618562 347312540 340782791 334490269 329353631
1093.2C29353631l496200j932741n29050N15520R07004P74890N20319K36779k66373
$$ 329353631 325857431 323924690 323395640 323911160 324818164 325593054 326113373 326350152 326083779
1111.6C26083779j025200k072423l722698n873680o859779m694730n25475K147854
$$ 326083779 325058579 322986156 319263458 313389778 306529999 301835269 301309794 303457648
1127.9C03457648K253860J067042p7993J32293J771808L389448L910005L482908K835035
$$ 303457648 305711508 306778550 306700557 306832850 308604658 311994106 315904111 319387019 322222054
1146.2C22222054K439797K188981K006202K183587K815872L680557M760891O272465
$$ 322222054 324661851 326850832 328857034 331040621 333856493 337537050 342297941 348570406
1162.6C48570406Q070022R629309J0654957J1255145J1401474J0953635J0218382R625912
$$ 348570406 356640428 366269737 376924694 388179839 399581313 410534948 420753330 430379242
1178.9D30379242R012758P956952O579638N147755L422201J425236o0767n40346k66403
$$ 430379242 439392000 447348952 453928590 459076345 462498546 463923782 463863015 463322669 463056266
1197.2D63056266O50168K408653M477650N743295N954176N658478N024314L964662
$$ 463056266 463706434 466115087 470592737 476336032 482290208 487948686 492973000 496937662
1213.5D96937662K998799K706588K698421K409518K198040K481640K795517K759040
$$ 496937662 499936461 502643049 505341470 507750988 509949028 512430668 515226185 517985225
1229.9E17985225K819121L190398L344178L120005L046036L138900K775669K046943
$$ 517985225 520804346 523994744 527338922 530458927 533504963 536643863 539419532 541466475
1246.2E41466475J634776J414180R00507N00798P59363J277387J611650K151430L137589
$$ 541466475 543101251 544515431 545415938 545916736 546676099 547953486 549565136 551716566 554854155
1264.5E54854155M002750M430592M954755N696416N973279N787730N884231O253361
$$ 554854155 558856905 563287497 568242252 573938668 579911947 585699677 591583908 597837269
1280.8E97837269O219447N964875O208420O568551O216168N574286N381942N168081
$$ 597837269 604056716 610021591 616230011 622798562 629014730 634589016 639970958 645139039
1297.2F45139039M388034L653049L452063L145576K413392J977920J996756J724839
$$ 645139039 649527073 653180122 656632185 659777761 662191153 664169073 666165829 667890668
1313.5F67890668J131117J030445J421929J475811J247763J449943J722276J289129
$$ 667890668 669021785 670052230 671474159 672949970 674197733 675647676 677369952 678659081
1329.8F78659081O13809L66271J40786l61026l72529L26574O78957M50015M45068P32362
$$ 678659081 679272890 679639161 679779947 679418921 679046392 679372966 680051923 680501938 680947006 681679368
1350.2F81679368N22673q5115k62261k51412q34882j495958j334488j190603j680791
$$ 681679368 682202041 682116926 681854665 681603253 680768371 679272413 677937925 676747322 675066531
1368.5F75066531j948893j946092k144694k534211l547490n529940o571650l842116
$$ 675066531 673117638 671171546 669026852 666492641 662945151 657415211 650843561 647001445
1384.9F47001445R66788K985775J489222n24998j517713j769423k445579l020346l254056
$$ 647001445 647968233 650954008 652443230 651918232 650400519 648631096 646185517 643165171 639911115
1403.2F39911115l593683l542543l187477k697110k173782j966715k036392j568377
$$ 639911115 636317432 632774889 629587412 626890302 624716520 622749805 620713413 619145036
1419.5F19145036n55337k67207j83940n007j17481R2268M93050O71804J374304K087057
$$ 619145036 618589699 618322492 618138552 618133545 618016064 618108332 618601382 619273186 620647490 622734547
1439.9F22734547K251982K223194K169669K557993L412723L910303L998935N181671
$$ 622734547 624986529 627209723 629379392 631937385 635350108 639260411 643259346 648441017
1456.2F48441017P905125Q236051P096529P047236P530689P248938P048488Q015573
$$ 648441017 656346142 664582193 671678722 678725958 686256647 693505585 700554073 708569646
1472.6G08569646Q343875P055521N575717M328549L270745K012074O63698k17974l25144
$$ 708569646 716913521 723969042 729544759 733873308 737144053 739156127 739819825 739601851 739276707
1490.9G39276707n42104j809895l211618l228187k858400l313959n535007p857680
$$ 739276707 738734603 736924708 733713090 730484903 727626503 724312544 718777537 710919857
1507.2G10919857n626857m166067m799485n279899m873931m024506l926992l313244
$$ 710919857 705293000 701126933 696327448 691047549 686173618 682149112 678222120 674908876
1523.6F74908876k678632k676249k351701k658367k986074j953661j887024l167629
$$ 674908876 672230244 669553995 667202294 664543927 661557853 659604192 657717168 654549539
1539.9F54549539k137303j58429L90946L95179L71993O00517O77406J96577q84533
$$ 654549539 652412236 652253807 652644753 653039932 653411925 654012442 654689848 654886425 654001892
1558.2F54001892j87755R18567k89500j803517l208399m214525m068613n293071p690251
$$ 654001892 653814137 654732704 654443204 652639687 649431288 645216763 641148150 635855079 628164828
1576.6F28164828p199824o625235p713080q436977q778453r013415r106219r062469
$$ 628164828 620965004 614339769 606626689 598189712 589411259 580397844 571291625 562229156
1592.9E62229156r051442q803129q424699q302093q232474p964134p779479p839293
$$ 562229156 553177714 544374585 535949886 527647793 519415319 511451185 503671706 495832413
1609.2D95832413p634311p256091q007795q865684o864071n949318o809652o361813
$$ 495832413 488198102 480942011 472934216 464068532 457204461 451255143 444445491 438083678
1625.5D38083678n537003m870951l756791l468842l615439j682192K33800R24319J224041
$$ 438083678 432546675 427675724 423918933 420450091 416834652 415152460 415386260 416310579 417534620
1643.9D17534620J805394L189773L613233L670127N630761O442308N970031O242395
$$ 417534620 419340014 422529787 426143020 429813147 435443908 441886216 447856247 454098642
1660.2D54098642P210284Q108199P754147Q026600R452790R497166R753823J0851502
$$ 454098642 461308926 469417125 477171272 485197872 494650662 504147828 513901651 524753153
1676.5E24753153J0561824R742081J0081828J2800515J3081371J1365295J1282861
$$ 524753153 535314977 545057058 555138886 567939401 581020772 592386067 603668928
1690.8F03668928J0515571J0547042J1299133J1511862J3269902J2006402R854793
$$ 603668928 614184499 624731541 636030674 647542536 660812438 672818840 682673633
1705.1F82673633R545326Q565009P221878O059765N268097N494118N954266N376279
$$ 682673633 692218959 700783968 708005846 714065611 719333708 724827826 730782092 736158371
1721.4G36158371M678845M372478L856003L445924L098368L252208M145623M056692
$$ 736158371 740837216 745209694 749065697 752511621 755609989 758862197 763007820 767064512
1737.7G67064512L780305L890157L834009L713489L604531L584206L898919L730654
$$ 767064512 770844817 774734974 778568983 782282472 785887003 789471209 793370128 797100782
1754G97100782L100276K628267K279997K333880K432584J879156J321971J147271J302897
$$ 797100782 800201058 802829325 805109322 807443202 809875786 811754942 813076913 814224184 815527081
1772.4H15527081J900375K028466J643061J317680J230240J288056J375497J056909
$$ 815527081 817427456 819455922 821098983 822416663 823646903 824934959 826310456 827367365
1788.7H27367365M83930P93636J471103J262128P69138Q10445J081705R98616P55191
$$ 827367365 827851295 828644931 830116034 831378162 832147300 832957745 834039450 835038066 835793257
1807H35793257O43313O63936P09474P05659O47903N69045M09961K76327L43204L49402
$$ 835793257 836436570 837100506 837809980 838515639 839163542 839732587 840142548 840418875 840762079 841111481
1827.4H41111481K79963O86646Q98242N03838L63350M86433J62244k36809K74181Q15690
$$ 841111481 841391444 842078090 842976332 843480170 843843520 844329953 844492197 844255388 844529569 845345259
1847.8H45345259O46949L76939L38435L84391K85387J85251K21253J89602j28269k26081
$$ 845345259 845992208 846369147 846707582 847091973 847377360 847562611 847783864 847973466 847845197 847619116
1868.2H47619116L87430P78437M60982J76132J98066J71781O9261R7215J21653j2279
$$ 847619116 848006546 848784983 849245965 849422097 849620163 849791944 849861205 849958420 850080073 850067794
1888.6H50067794M5419K24650J83225J20401J31965J55925J37866K3901p7247k5928
$$ 850067794 850113213 850337863 850521088 850641489 850773454 850929379 851067245 851091146 851013899 850987971
1909H50987971R8407J18554j7882j23918o497M7088K8193J43588J21653p75J192M530
$$ 850987971 851086378 851204932 851187050 851063132 851056635 851103723 851131916 851275504 851397157 851396382 851397574 851402104
1933.5H51402104p5281j17004j51515k32160j54793J6630M2855l9696j54376k07544
$$ 851402104 851326823 851209819 851058304 850826144 850671351 850687981 850730836 850691140 850536764 850329220
1953.9H50329220j67131j67430j98125j55747j49250k33055k31027j34111q7559j20997
$$ 850329220 850162089 849994659 849796534 849640787 849491537 849258482 849027455 848893344 848805785 848684788
1974.3H48684788j73569j80304j74582j63496j73032k13265k30909k62141k37048j11579
$$ 848684788 848511219 848330915 848156333 847992837 847819805 847606540 847375631 847113490 846876442 846764863
1994.7H46764863p8083j58071j99199k03490k37346k75552k61962k27571k25425k92599
$$ 846764863 846686780 846528709 846329510 846126020 845888674 845613122 845351160 845123589 844898164 844605565
2015.1H44605565l18706k29537k03133k52247k60770k34902k27392k40862k62201k44200
$$ 844605565 844286859 844057322 843854189 843601942 843341172 843106270 842878878 842638016 842375815 842131615
2035.5H42131615k05756k24292k31385k06173k35736k66492k02894j58966k04206k41220
$$ 842131615 841925859 841701567 841470182 841264009 841028273 840761781 840558887 840399921 840195715 839954495
2055.9H39954495k13444j80900k02238j97828j20163q0943j47641j72555j19150j21296
$$ 839954495 839741051 839560151 839357913 839160085 839039922 838958979 838811338 838638783 838519633 838398337
2076.3H38398337j41322q1480m0352p6771j19269j18315q0347p8976o8963j5020j2994
$$ 838398337 838257015 838175535 838135183 838058412 837939143 837820828 837740481 837661505 837592542 837577522 837564528
2098.7H37564528p0333n5850K5332N126o1035j9491M9293J490q3625l0756R2089Q1003
$$ 837564528 837494195 837438345 837463677 837468803 837407768 837388277 837437570 837439060 837355435 837324679 837416768 837497771
2123.2H37497771L0994R3043J17421K1696j0073R4473J32680N7698M1246J20580J64807
$$ 837497771 837528765 837621808 837739229 837760925 837750852 837845325 837978005 838035703 838076949 838197529 838362336
2145.6H38362336J25349J10030J31905Q4400L5405J11938J80244J19150O3777J18256
$$ 838362336 838487685 838597715 838729620 838814020 838849425 838961363 839141607 839260757 839324534 839442790
2166H39442790J40011P7665J14560K25842J81377M5895Q8454K15113J59263K3961M6790
$$ 839442790 839582801 839660466 839775026 840000868 840182245 840228140 840316594 840531707 840690970 840714931 840761721
2188.4H40761721J31309N8294k5094Q6784J70410N3346L576J23322J17898l2126j6511
$$ 840761721 840893030 840951324 840926230 841013014 841183424 841236770 841240346 841363668 841481566 841449440 841432929
2210.9H41432929J25825J00911k3246J3352R9718J4901p1167J7046J04309K2292o9917
$$ 841432929 841558754 841659665 841636419 841649771 841749489 841764390 841693223 841710269 841814578 841836870 841766953
2233.3H41766953R478O4730n6803r6381M1306N4181r1314r8884K5332k742j45316r4235
$$ 841766953 841776431 841841161 841784358 841687977 841729283 841783464 841692150 841593266 841618598 841615856 841470540 841376305
2257.8H41376305N8531J9968q5115k563J10685L4094l1650R3937J58668M5955N0962
$$ 841376305 841434836 841454804 841369689 841367126 841477811 841511905 841480255 841574192 841732860 841778815 841829777
2280.2H41829777J80959J74344N0426J7464Q6665L9518o7771K9207J91509J09136k6464
$$ 841829777 842010736 842185080 842235506 842252970 842339635 842379153 842311382 842340589 842532098 842641234 842614770
2302.7H42614770P0095J66714K3008o0261J41442K18213m4465j72794M0293J55806
$$ 842614770 842684865 842851579 842874587 842814326 842955768 843173981 843129516 842956722 842997015 843152821
2323.1H43152821L4452o56R1135N8234n6445L6120K22385Q8215j64390m8816L12746
$$ 843152821 843187273 843186617 843277752 843335986 843279541 843315661 843538046 843626261 843461871 843413055 843725801
2345.5H43725801N75244N04374K27213p0333l21686k64585O1273J10805M5061K81811
$$ 843725801 844301045 844805419 845032632 844962299 844640613 844376028 844437301 844548106 844593167 844874978
2365.9H44874978M69506L36468K47777M66287N84125L84629L26037N38946N24640J70350
$$ 844874978 845344484 845680952 845928729 846395016 846979141 847363770 847689807 848228753 848753393 848923743
2386.3H48923743M4107K70665L08990P4149L7133K07126J37449p5281K7537K46466
$$ 848923743 848967850 849238515 849547505 849621654 849658787 849865913 850003362 849928081 849955618 850202084
2406.7H50202084J05619j21415K6107K05755L696j40488P5578J20640j65105j58906
$$ 850202084 850307703 850186288 850212395 850418150 850421846 850281358 850356936 850477576 850312471 850153565
2427.1H50153565J91868K05755r9599r7812J29760L9398j90913o3539J46985j3172
$$ 850153565 850345433 850551188 850451589 850353777 850483537 850522935 850332022 850268483 850415468 850402296
2447.5H50402296k00689j8537J26004q4639j77085N5373Q1777k10702k40267P8917
$$ 850402296 850201607 850183070 850309074 850224435 850047350 850102723 850184500 849973798 849733531 849812448
2467.9H49812448R8527k10941j70768J08838j1384k82824j20103R8943j25825k96772
$$ 849812448 849910975 849700034 849529266 849638104 849626720 849343896 849223793 849322736 849196911 848900139
2488.3H48900139k7656J17540j61052k46286N2869P3970k48194k41339N1439n484k66016
$$ 848900139 848872483 848990023 848828971 848582685 848635554 848709524 848461330 848219991 848271430 848265946 847999930
2510.7H47999930j42097J22964m5836l11434j11639J13427j33693l24190p7963L2902
$$ 847999930 847857833 847980797 847934961 847623527 847511888 847625315 847491622 847167432 847089469 847122371
2531.1H47122371k26199k51115N1439M2558k74003k51233M5061k8074l06189j63376
$$ 847122371 846896172 846645057 846696496 846739054 846465051 846213818 846258879 846230805 845924616 845761240
2551.5H45761240Q8810j06811l15428j03474J9670k19822k83718m4107o3181l73543
$$ 845761240 845850050 845743239 845427811 845324337 845344007 845124185 844840467 844796360 844733179 844359636
2571.9H44359636l69906o5148q6248l75509l14892p9691k50041m90606k80261q5116
$$ 844359636 843989730 843924582 843838334 843462825 843147933 843068242 842818201 842327595 842047334 841962218
2592.3H41962218l55124n39422k71619j60753m90487n93305k97546k74718n45800m93466
$$ 841962218 841607094 841067672 840796053 840635300 840144813 839551508 839253962 838979244 838433444 837939978
2612.7H37939978k36512l62455o28412m73738k31981m01855o14285m39286k79606n06818
$$ 837939978 837703466 837341011 836712599 836238861 836006880 835605025 834990740 834551454 834271848 833765030
2633.1H33765030o31750l68118k92838n55396n70476l12149l34621n85735n28633k88546
$$ 833765030 833133280 832765162 832472324 831916928 831346452 831034303 830699682 830113947 829585314 829296768
2653.5H29296768m02987o40631m61936k26319m22776o08682l89517k70187n08547n51999
$$ 829296768 828893781 828253150 827791214 827564895 827142119 826533437 826143920 825873733 825365186 824813187
2673.9H24813187l05056l41654o48618o13213l07560l75628o70075n58079k93314m69685
$$ 824813187 824508131 824166477 823517859 822904646 822597086 822221458 821551383 820993304 820699990 820230305
2694.3H20230305p27653n56588l77417n69522o86408m80055m39167p10428p46608m85957
$$ 820230305 819502652 818946064 818568647 817999125 817312717 816832662 816393495 815683067 814936459 814450502
2714.6H14450502m79102o95646o36756m38750n57840p84695o80089m77671n65052o77109
$$ 814450502 813971400 813275754 812638998 812200248 811642408 810857713 810177624 809699953 809134901 808457792
2735H08457792n30660m50552o34968o95825m81665m25935o52432p10309n46157n91874
$$ 808457792 807927132 807476580 806841612 806145787 805664122 805238187 804585755 803875446 803329289 802737415
2755.4H02737415p80821p26223n80430o81758q29637p29740o04272p10189q36968p91550
$$ 802737415 801956594 801230371 800649941 799968183 799138546 798408806 797804534 797094345 796257377 795465827
2775.8G95465827p96199r27448r36687q27432q52287r82701r84729r39846j042545
$$ 795465827 794669628 793742180 792805493 791978061 791125774 790143073 789158344 788218498 787175953
2794.2G87175953j140773j065552j006425j126706j270712j256942j199603j297236
$$ 787175953 786035180 784969628 783963203 782836497 781565785 780308843 779109240 777812004
2810.5G77812004j394331j320839j302362j446485j515389j478135j527489j655280
$$ 777812004 776417673 775096834 773794472 772347987 770832598 769354463 767826974 766171694
2826.8G66171694j721859j759112j918852k155781k356470k678335l266453l908515
$$ 766171694 764449835 762690723 760771871 758616090 756259620 753581285 750314832 746406317
2843.1G46406317m429579m802346m703105l877640k714335j766026j169146r06109
$$ 746406317 741976738 737174392 732471287 728593647 725879312 724113286 722944140 722038031
2859.5G22038031j053453j563847k161860k579630k732754k653002k417028k113164
$$ 722038031 720984578 719420731 717258871 714679241 711946487 709293485 706876457 704763293
2875.8G04763293j863360j756787j771808j825154j916170k072930k187610k203643
$$ 704763293 702899933 701143146 699371338 697546184 695630014 693557084 691369474 689165831
2892.1F89165831k242327k355397k433956k448916k480507k576053k754152l044784
$$ 689165831 686923504 684568107 682134151 679685235 677204728 674628675 671874523 668829739
2908.4F68829739l473461l983378m430532m638911m504025m020452l243327k328933
$$ 668829739 665356278 661372900 656942368 652303457 647799432 643778980 640535653 638206720
2924.7F38206720j419723n93722Q2076O74248J279175J842916K276778K573431K688646
$$ 638206720 636786997 636193275 636275351 636949599 638228774 640071690 642348468 644921899 647610545
2943.1F47610545K462983J892031J233279O96242K66135k0802p6175L8803K29299L77297
$$ 647610545 650073528 651965559 653198838 653895080 654161215 654140413 654064238 654103041 654332340 654709637
2963.5F54709637M13001L83079L97324N05805N91815O00219O92546Q79109R20594Q01980
$$ 654709637 655122638 655505717 655903041 656408846 657000661 657600880 658293426 659172535 660093129 660895109
2983.9F60895109P20143P06375O32405L90768j966l64006o55055r25779j070083j150310
$$ 660895109 661615252 662321627 662954032 663344800 663342834 662978828 662323773 661397994 660327911 659177601
3004.3F59177601j254022j270652j183092j222193j496911j741529j778483j791418
$$ 659177601 657923579 656652927 655469835 654247642 652750731 651009202 649230719 647439301
3020.6F47439301j888812j962065k022326k083838k074957k021074k122701k357602
$$ 647439301 645550489 643588424 641566098 639482260 637407303 635386229 633263528 630905926
3036.9F30905926k375543k253234k326608k557576k704441k662182k599835k665639
$$ 630905926 628530383 626277149 623950541 621392965 618688524 616026342 613426507 610760868
3053.2F10760868k733231k715886k686977k660513k591670k514898k516389k594531
$$ 610760868 608027637 605311751 602624774 599964261 597372591 594857693 592341304 589746773
3069.5E89746773k644419k599001k505184k444386k516925k664805k722263k713978
$$ 589746773 587102354 584503353 581998169 579553783 577036858 574372053 571649790 568935812
3085.8E68935812k677739k680361k802313k879441k794921k703607k762377k915383
$$ 568935812 566258073 563577712 560775399 557895958 555101037 552397430 549635053 546719670
3102.2E46719670k989590k949297k948523l047645l055215k960801l016293l194511
$$ 546719670 543730080 540780783 537832260 534784615 531729400 528768599 525752306 522557795
3118.5E22557795l360093l510594l532231l409922l338933l428757l537178l485173
$$ 522557795 519197702 515687108 512154877 508744955 505406022 501977265 498440087 494954914
3134.8D94954914l393531l452271l599763l671795l685683l697008l648669l623068
$$ 494954914 491561383 488109112 484509349 480837554 477151871 473454863 469806194 466183126
3151.1D66183126l753573l888160l853887l813773l831685l810853l826439l899008
$$ 466183126 462429553 458541393 454687506 450873733 447042048 443231195 439404756 435505748
3167.4D35505748l910423l834635l782451l825575l885925l840118l774941l800243
$$ 435505748 431595325 427760690 423978239 420152664 416266739 412426621 408651680 404851437
3183.7D04851437l808618l749937l716916l725350l699660l666580l664136l628045
$$ 404851437 401042819 397292882 393575966 389850616 386150956 382484376 378820240 375192195
3200.1C75192195l533065l442526l420323l439009l385812l310711l280729l220409
$$ 375192195 371659130 368216604 364796281 361357272 357971460 354660749 351380020 348159611
3216.4C48159611l171026l124536l050744l003627k965123k922535k842485k715707
$$ 348159611 344988585 341864049 338813305 335809678 332844555 329922020 327079535 324363828
3232.7C24363828k686382k728790k666413k556205k481550k403736k347499k360255
$$ 324363828 321677446 318948656 316282243 313726038 311244488 308840752 306493253 304132998
3249C04132998k349466k242506k142101k131552k170533k199173k181351k123713k043039
$$ 304132998 301783532 299541026 297398925 295267373 293096840 290897667 288716316 286592603 284549564
3267.4B84549564j967370k000422k110809k146154k107084k074093k068788k082795
$$ 284549564 282582194 280581772 278470963 276324809 274217725 272143632 270074844 267992049
3283.7B67992049k077758k033770j959592j915783j978397k065986k109856k092332
$$ 267992049 265914291 263880521 261920929 260005146 258026749 255960763 253850907 251758575
3300B51758575j975119j852736j891851k052456k131879k111361k074659k023428j946897
$$ 251758575 249783456 247930720 246038869 243986413 241854534 239743173 237668514 235645086 233698189
3318.4B33698189j878157j867294j898125j931355j913219j831398j783505j743987
$$ 233698189 231820032 229952738 228054613 226123258 224210039 222378641 220595136 218851149
3334.7B18851149j647681j618162j672834j672536j656920j606703j462817j445740
$$ 218851149 217203468 215585306 213912472 212239936 210583016 208976313 207513496 206067756
3351B06067756j585007j615554j436591j259938j263723j262545j079649r18105j029805
$$ 206067756 204482749 202867195 201430604 200170666 198906943 197644398 196564749 195646644 194616839
3369.3A94616839j278355j258597r65342p88853p47963o95304n98669m35024j91957
$$ 194616839 193338484 192079887 191114545 190325692 189577729 188882425 188283756 187848732 187656775
3387.7A87656775M8399k6554l38673l03880J42575L87817Q8632k46107o6743K75344
$$ 187656775 187705174 187678620 187339947 187036067 187178642 187566459 187655091 187408984 187342241 187617585
3408.1A87617585L98621M01974L64974L85165N10961N86152O21736Q04737J063913
$$ 187617585 188016206 188418180 188783154 189168319 189679280 190265432 190887168 191691905 192755818
3426.5A92755818J219869J173079J195580J390517J286760R44271R53913J320153J607985
$$ 192755818 193975687 195148766 196344346 197734863 199021623 199965894 200919807 202239960 203847945
3444.8B03847945J670763J657426J739740J842708J921981K060280K201363K164960
$$ 203847945 205518708 207176134 208915874 210758582 212680563 214740843 216942206 219107166
3461.1B19107166K173990K478227K673686K414017K011389K039269K372950K663746
$$ 219107166 221281156 223759383 226433069 228847086 230858475 232897744 235270694 237934440
3477.4B37934440K745882K548948K496585K746880K849296K791733K900272L091812
$$ 237934440 240680322 243229270 245725855 248472735 251322031 254113764 257014036 260105848
3493.8B60105848L200144L136754L085077L151655L096253K995520L134281L439784
$$ 260105848 263305992 266442746 269527823 272679478 275775731 278771251 281905532 285345316
3510.1B85345316L678083L644884L482014L547758L753096L953874L941267L774941
$$ 285345316 289023399 292668283 296150297 299698055 303451151 307405025 311346292 315121233
3526.4C15121233L822119M060745M282504M435599M475504M416436M516304M673928
$$ 315121233 318943352 323004097 327286601 331722200 336197704 340614140 345130444 349804372
3542.7C49804372M657626M562139M612983M763126M934698N081773N153447N245120
$$ 349804372 354461998 359024137 363637120 368400246 373334944 378416717 383570164 388815284
3559C88815284N312174N154878M957617N499959O316989O309718O003082O028294O224812
$$ 388815284 394127458 399282336 404239953 409739912 416056901 422366619 428369701 434397995 440622807
3577.4D40622807O428390O605476O529689O271363O507158P139593P051766O786734
$$ 440622807 447051197 453656673 460186362 466457725 472964883 480104476 487156242 493942976
3593.7D93942976P101178P501483P535577P519424P426679P017791O997228P426441
$$ 493942976 501044154 508545637 516081214 523600638 531027317 538045108 545042336 552468777
3610E52468777P630229P729411P508874P305562P896066Q046448P261574O308496O456376
$$ 552468777 560099006 567828417 575337291 582642853 590538919 598585367 605846941 612155437 618611813
3628.4F18611813P858395P842183P163286O878078O631315O487489O323934N694210
$$ 618611813 626470208 634312391 641475677 648353755 654985070 661472559 667796493 673490703
3644.7F73490703M784644M941046O271005O253779N257785N261421N461156M803896
$$ 673490703 678275347 683216393 689487398 695741177 700998962 706260383 711721539 716525435
3661G16525435M219294L898323L153383K613187L187299K995729K365292L271400L815830
$$ 716525435 720744729 724643052 727796435 730409622 733596921 736592650 738957942 742229342 746045172
3679.4G46045172L424943L021478K413750J754701J797199K530098K802015K427935
$$ 746045172 749470115 752491593 754905343 756660044 758457243 760987341 763789356 766217291
3695.7G66217291J842022J277030J231432J769900J727700Q87156K86519Q74401J941740
$$ 766217291 768059313 769336343 770567775 772337675 774065375 774952531 775239050 776113451 778055191
3714G78055191J871944J122415O33657O15358Q00609J023770J135170O46055o9141
$$ 778055191 779927135 781049550 781683207 782298565 783099174 784122944 785258114 785904169 785835028
3732.4G85835028q0943R07659J785576J267612k29835n93662P25507N83530j0371J066088
$$ 785835028 785754085 786661744 788447320 789714932 789485097 788891435 789616942 790200472 790190101 791256189
3752.8G91256189J712144J064062N68032P96974P87198L88563J92642K11895O24239
$$ 791256189 792968333 794032395 794600427 795397401 796184599 796573162 796765804 796977699 797601938
3771.1G97601938R73165O42360J12414M0531L94821M47214L51429M97162N50091M07398
$$ 797601938 798575103 799217463 799329877 799370408 799765229 800212443 800563872 801061034 801611125 802018523
3791.5H02018523N9962j54912J6093k71022l05355N57244N01037L93867R25780O93023
$$ 802018523 802078485 801923573 801939666 801668644 801363289 801920533 802421570 802815437 803741217 804434240
3811.9H04434240k07603n26190j26779k53260J90556R76145P04885L64899J31905o1273
$$ 804434240 804226637 803700447 803573668 803320408 803510964 804487109 805191994 805556893 805688798 805627525
3832.3H05627525n9843l72827m95911J58370O86466Q30651P07745J94192q59678j817345
$$ 805627525 805567682 805194855 804698944 804857314 805543780 806374431 807082176 807276368 806416690 804599345
3852.7H04599345l14534J572430J188994K02298l00646l6061J47343k83063j20103
$$ 804599345 804284811 805857241 807046235 807248533 806947887 806911826 807059169 806776106 806656003
3871.1H06656003M88102O62744L96491j98305j32918J67250K921J85549J23084j08600
$$ 806656003 807144105 807806849 808203340 808005035 807872117 808039367 808042288 808227837 808350921 808242321
3891.5H08242321L33846M53174j68145o84917o84082j80483O58273R79662N33343P0870
$$ 808242321 808576167 809029341 808861196 808176279 807492197 807311714 807969987 808949649 809482992 809553862
3911.9H09553862j20640k40505j83403N9783J23322j2696M6075J39773k6346k7954
$$ 809553862 809433222 809192717 809009314 809069097 809192419 809179723 809225798 809365571 809339225 809311271
3932.3H09311271K68817L69250J69933j49131k55942J1921J20103J6153J33097L08633
$$ 809311271 809580088 809949338 810119271 809970140 809714198 809726119 809846222 809862375 809995472 810304105
3952.7H10304105K38180O0857K6822M0352L3081R3758J65045J75417Q6665L576Q5354
$$ 810304105 810542285 810603142 810629964 810670316 810703397 810797155 810962200 811137617 811224282 811227858 811313212
3975.1H11313212K04563J79708J19507J34290O1750q6904l1352J18137P0333j7047
$$ 811313212 811517775 811697483 811816990 811951280 812013030 811926126 811894774 812012911 812083244 812066197
3995.5H12066197J06514
$$ 812066197 812172711
3997.5H12172711
$$ 812172711
##END=$$ End of the data block
