##TITLE=$$ Begin of the data block
##JCAMP-DX=5.00 $$ ACD/SpecManager v 10.08
##SPECTROMETER/DATA SYSTEM=Alpha
##DATE=15 Apr 2014 09:00:42
##DATA TYPE=INFRARED SPECTRUM
##DATA CLASS=XYDATA
##ORIGIN=
##OWNER=
##NPOINTS=1765
##FIRSTX=399.75695801
##LASTX=3997.56933594
##MAXX=3997.56933594
##MINX=399.75695801
##MAXY=0.85202980
##MINY=0.18790796
##XFACTOR=1.0000000000
##YFACTOR=1.000000000000000e-9
##FIRSTY=0.58900267
##DELTAX=2.03957629
##XUNITS=1/CM
##YUNITS=ARBITRARY UNITS
##XYDATA=(X++(Y..Y))
399.8 589002669 585905433 584676623 584172726 582029223 579420328 578596950 578135490 576411307 575022221
418.1 575022221 575069547 574195921 572245300 571654081 571874321 570331037 568114698 567526817 567188621
436.5 567188621 565685153 564920306 565524638 565159142 563659430 563377857 563850701 562793195 561250746
454.8 561250746 561161101 560999274 559248507 558018982 558430076 557794213 555320442 553876221 553578377
473.2 553578377 551865220 549763978 549700320 550126135 548792839 547421038 547566652 547027588 544987977
491.5 544987977 543988407 544096112 542633176 540224612 539609671 539649844 537759721 535599887 535183370
509.9 535183370 534302294 531661212 529964507 529918790 528490901 525615096 524158418 523517013 521130383
528.3 521130383 518409610 517665923 517085612 514830947 513211966 513481796 512828350 510561049 509626448
546.6 509626448 509832382 508224726 505799413 505224884 504833996 502230704 499523759 498612911 496941507
565 496941507 493139178 489973515 488211751 485220432 481211662 479018986 477798879 474748909 471240848
583.3 471240848 469598413 467918485 464338273 460918963 459016085 456503004 452605397 449484617
599.6 449484617 447219729 443651766 439830720 438509673 438558578 437245011 435676575 436358511 438679457
618 438679457 441198915 444902569 450185180 454640687 457640052 461602747 466664523 470309407 472793311
636.3 472793311 476250201 479442626 480018973 480061024 482933253 486894518 488504231 488410234 488486052
654.7 488486052 489622235 493636668 501044989 508630097 513244867 516362488 521053433 524894774
671 524894774 526736081 528958380 532955229 536450624 537921190 539822757 543150544 545332432 545919061
689.4 545919061 547523201 549961150 550689757 550475955 551884711 553869069 554425836 555239856 558022082
707.7 558022082 560747981 562080622 564170063 567765832 570492327 571896911 574450791 578168869
724 578168869 580577374 582025349 584775865 587954700 589486480 590637624 593183815 595618308 596623898
742.4 596623898 598153412 601140678 603410125 604422510 606393695 609449029 611415744 612657785
758.7 612657785 615266740 618380666 620012283 621345282 624005556 626492441 627341866 628007233 629386067
777.1 629386067 629791141 628713131 628087997 628436625 628261447 627988338 629722416 633285403 636919260
795.4 636919260 641151547 647428632 654428959 660248280 665732801 671867430 677054703 680289626
811.7 680289626 683214784 686454833 688199222 688101053 687823355 687209845 684562743 680416405 676722825
830.1 676722825 673170447 668546021 663872659 660429299 657137990 653005660 649379075 647436857
846.4 647436857 646534324 646772802 649861932 656148076 663952112 672500551 682439506 693098664 702628374
864.8 702628374 710905433 718881190 725808918 730500937 733921051 737336099 739847064 740547240 740641534
883.1 740641534 740903914 740104198 737950742 736138701 735276282 734325647 733629823 734714150 737068474
901.5 737068474 738892555 740301430 742266595 743751109 743308842 741637528 739637494 736458838 731790841
919.8 731790841 727381051 724440515 722307503 720891178 721280396 723074555 724454284 725231230 726509690
938.2 726509690 727890134 728255153 728165150 728477180 728182733 726233363 723394156 720138073 715305924
956.6 715305924 708421707 700501680 691562533 680291951 666604578 651693642 635937989 619421363
972.9 619421363 603652418 590222120 578755915 568158686 558634579 550746202 543782234 536958992
989.2 536958992 530825257 525852919 521462679 517423928 514271200 511903822 509358108 506065011
1005.5 506065011 502047420 496968806 490395427 482860923 475398272 468288898 461361021 454994082
1021.8 454994082 449546963 444582939 439723253 435326934 431597024 428074419 424618274 421659023
1038.1 421659023 419222772 416822881 414369941 412137687 410002172 407758623 405921549 405272484
1054.5 405272484 405856729 407213598 408985525 410626411 411046416 409354568 405595720 400252610 393765241
1072.8 393765241 386764497 379925072 373382777 366899312 360454261 354182869 347903192 341413587
1089.1 341413587 335177422 330066860 326578289 324673057 324150473 324661344 325579345 326343000 326854378
1107.5 326854378 327132583 326884359 325795472 323676705 319973171 314086735 307155758 302418381 301878005
1125.8 301878005 303974330 306191206 307288438 307273149 307465732 309257716 312620521 316486835 319928497
1144.2 319928497 322762638 325230211 327402890 329367191 331549823 334391266 338077933 342829376
1160.5 342829376 349106520 357200027 366837561 377464503 388687611 400061756 410976559 421175987
1176.8 421175987 430816621 439830959 447767317 454321682 459425420 462815106 464256495 464221686 463691860
1195.2 463691860 463436961 464104682 466519028 470975637 476710767 482687891 488364875 493385792 497327179
1213.5 497327179 500305831 503003776 505686045 508073747 510266423 512767136 515589058 518352807
1229.9 518352807 521149576 524344742 527747810 530934453 534018636 537160099 539924860 541967213
1246.2 541967213 543594718 545005679 545911729 546423197 547204733 548498869 550095618 552199662 555288792
1264.5 555288792 559273958 563699365 568608224 574221373 580149889 585956872 591868162 598121703
1280.8 598121703 604331315 610292673 616498291 623055458 629278123 634898067 640312314 645450652
1297.2 645450652 649783969 653436482 656940520 660121322 662556767 664566457 666565955 668261349
1313.5 668261349 669382870 670422494 671842813 673323274 674607635 676106513 677824676 679050863
1329.8 679050863 679626346 680007517 680164218 679815948 679479003 679813683 680444300 680865407 681335390 682082355
1350.2 682082355 682612658 682564378 682324350 682072163 681256950 679774642 678396106 677152932 675452173
1368.5 675452173 673512042 671608448 669494808 666946054 663365960 657806933 651233613 647424877
1384.9 647424877 648421645 651399314 652883112 652386248 650873661 649074793 646625102 643619716 640373647
1403.2 640373647 636773646 633221269 630050838 627379656 625207722 623256266 621279299 619736731
1419.5 619736731 619139969 618842959 618650019 618638098 618527949 618643999 619192839 619918704 621252120 623265505
1439.9 623265505 625482678 627684414 629838943 632393003 635807216 639712870 643743813 649021685
1456.2 649021685 656936526 665089250 672149718 679194272 686708510 693946242 701008499 709043801
1472.6 709043801 717392862 724434435 729980111 734291792 737577736 739618480 740301967 740076125 739713430
1490.9 739713430 739141405 737336576 734144747 730898440 728010893 724739432 719340622 711571276
1507.2 711571276 705892682 701673925 696848392 691580474 686769664 682818115 678916693 675567210
1523.6 675567210 672859251 670170724 667816103 665200353 662266374 660322189 658488274 655443370
1539.9 655443370 653323948 653076351 653396845 653773785 654157102 654785454 655528367 655842841 655064344
1558.2 655064344 654803216 655580401 655228376 653416157 650202990 645980537 641923130 636668801 628974974
1576.6 628974974 621698976 615020216 607286870 598833621 590065360 581083834 571984887 562897146
1592.9 562897146 553820193 544994175 536516309 528173387 519949615 511989236 504188120 496327341
1609.2 496327341 488681108 481422037 473436862 464576483 457666516 451695740 444899023 438532352
1625.5 438532352 432950109 428007364 424220264 420803636 417251945 415564865 415777296 416698396 417947799
1643.9 417947799 419804454 423037529 426707864 430473387 436098427 442428172 448345244 454611421
1660.2 454611421 461865336 469980717 477741718 485819519 495320708 504824638 514575005 525417149
1676.5 525417149 535978675 545759857 555907667 568720639 581743956 593048751 604283214
1690.8 604283214 614802003 625411510 636770606 648307085 661545634 673493028 683318794
1705.1 683318794 692861855 701423943 708638251 714719772 720059395 725612581 731539190 736875057
1721.4 736875057 741545081 745901346 749743044 753212810 756365836 759639680 763744116 767786443
1737.7 767786443 771567583 775429845 779243767 782951415 786552608 790129900 794000685 797708571
1754 797708571 800819039 803470969 805774510 808104813 810501158 812373579 813725591 814897835 816192627
1772.4 816192627 818055749 820066988 821711600 823021352 824253559 825564086 826957703 828050971
1788.7 828050971 828596711 829400599 830818772 832029879 832783103 833602726 834679961 835673392 836444378
1807 836444378 837101638 837752700 838440120 839138448 839794636 840376377 840774477 841037750 841393948 841758072
1827.4 841758072 842042446 842718780 843606353 844106615 844452202 844925165 845120192 844927609 845201433 845989108
1847.8 845989108 846591651 846935570 847299159 847727358 848012984 848185778 848416388 848616958 848515868 848334372
1868.2 848334372 848704755 849417031 849836826 849994063 850178540 850342810 850418150 850530326 850669205 850681603
1888.6 850681603 850729227 850929201 851105511 851239145 851374447 851527274 851675332 851713955 851642072 851622880
1909 851622880 851730347 851834834 851794541 851670921 851668477 851713836 851758063 851919174 852029800 852006555 851985395
1931.5 851985395 851963282 851876378 851765811 851621568 851385236 851219594 851234138 851279140 851244807 851114333
1951.9 851114333 850940704 850789845 850612819 850398540 850242198 850098491 849849939 849604845 849478006 849389434
1972.3 849389434 849264622 849096954 848926485 848767400 848607004 848426342 848209798 847959340 847676754 847462833
1992.6 847462833 847385347 847292185 847099721 846896827 846708238 846487701 846207261 845914185 845673263 845463753
2013 845463753 845193923 844881713 844637990 844426274 844179690 843927622 843702495 843486667 843261659 843020439
2033.4 843020439 842767119 842521369 842278421 842055619 841861963 841624737 841345429 841135740 840979636 840795517
2053.8 840795517 840580106 840374053 840192914 839994252 839776218 839611113 839525461 839433908 839299023 839167535
2074.2 839167535 839047432 838919103 838816106 838745832 838661253 838545918 838438809 838367641 838279009 838172734
2094.6 838172734 838118851 838108599 838069677 838032365 838050842 838046670 837988317 837963164 838004470 838034213 838017404 838026881
2119.1 838026881 838088095 838118374 838127017 838215351 838343382 838399470 838423848 838513792 838607669 838633299 838675261
2141.5 838675261 838810682 838970840 839084744 839204729 839363098 839468241 839511216 839619517 839786530 839879155
2161.9 839879155 839913905 840042770 840223491 840319395 840425372 840642035 840827823 840890050 840985417 841188371
2182.3 841188371 841337502 841360390 841420233 841577947 841646910 841611624 841698229 841879785 841930211 841917515 842011273
2204.8 842011273 842097461 842056155 842041433 842167199 842281282 842281222 842309892 842421055 842433512 842323899 842310607
2227.2 842310607 842438698 842488110 842406988 842398465 842463374 842415571 842322767 842359245 842396080 842276037 842173159
2249.6 842173159 842251062 842313111 842191279 842090011 842128754 842126191 842038274 842042148 842139602 842156172 842130721
2272.1 842130721 842244387 842408478 842443466 842468143 842616200 842787206 842860162 842884183 842955649 842986465 842935979
2294.5 842935979 843003333 843222976 843328536 843302250 843409419 843622148 843697369 843693137 843828261 844021738
2314.9 844021738 844049871 843979180 844017267 844106793 844145834 844229698 844382465 844473422 844480574 844551444 844715059
2337.3 844715059 844751775 844621480 844604731 844869912 845343173 845796525 846093476 846185148 846057594 845930398
2357.7 845930398 845984995 846023738 846029758 846283793 846657455 846814036 846912086 847309828 847841918 848167479
2378.1 848167479 848427892 848886132 849365592 849571884 849687219 849985659 850249231 850258172 850276411 850512385
2398.5 850512385 850681007 850612164 850637734 850871623 850952685 850834191 850886941 851096511 851094604 850959122 851027191
2421 851027191 851128042 850957572 850803316 850974619 851154149 851061821 851002932 851164937 851198971 851000845
2441.3 851000845 850937963 851045609 850978315 850791633 850836277 850979090 850869596 850671291 850718379 850816011
2461.7 850816011 850632250 850416899 850504756 850597918 850393057 850222826 850314379 850289583 850024581 849935949
2482.1 849935949 850026667 849866033 849564552 849565744 849684179 849498749 849255025 849325180 849410534 849167764
2502.5 849167764 848935902 849014878 849014580 848705769 848527968 848618805 848522246 848208070 848142266 848273814 848129630
2525 848129630 847817123 847773790 847828567 847592473 847319245 847366571 847393453 847092450 846866488 846961141 846948862
2547.4 846948862 846630752 846451819 846541822 846429348 846086860 845985174 846029580 845794380 845476329 845427394
2567.8 845427394 845385969 845044494 844709873 844673038 844573975 844150960 843817472 843757570 843509138 843011320
2588.2 843011320 842751205 842666924 842283607 841725528 841445029 841280341 840799272 840243459 839992106 839748681
2608.6 839748681 839219332 838716686 838446081 838050842 837390661 836902261 836709738 836326003 835675776 835226953
2629 835226953 834961176 834472060 833881676 833557308 833272159 832685709 832093775 831785321 831435740 830838084
2649.4 830838084 830330729 830038905 829612374 828988254 828553319 828337550 827934682 827351868 826969206 826682806
2669.8 826682806 826152086 825586259 825291157 824962258 824313104 823718071 823430538 823052287 822375178 821815073
2690.2 821815073 821512461 821033061 820327818 819800198 819411695 818809748 818107069 817636669 817220092 816530824
2710.6 816530824 815795064 815289140 814774573 814077318 813445687 812983811 812425673 811677933 811029255 810565829
2731 810565829 809984088 809283912 808771133 808341622 807710886 807032228 806571007 806140780 805466235 804740608
2751.4 804740608 804185092 803584635 802809119 802102745 801538706 800861478 800041437 799327254 798719645 797989905
2771.8 797989905 797148228 796367884 795557737 794609308 793689132 792873323 792005122 791013479 790045798 789139569
2792.2 789139569 788095117 786909819 785826206 784823418 783671081 782391489 781190455 780053377
2808.5 780053377 778771579 777371466 776043117 774726868 773271382 771760166 770300865 768787682
2824.8 768787682 767117202 765363574 763585746 761673391 759527802 757170618 754502833 751259744
2841.1 751259744 747353256 742910981 738128364 733455896 729564607 726822972 725056350 723886967
2857.4 723886967 722969949 721910775 720341444 718188822 715643346 712913513 710228145 707791269
2873.7 707791269 705661714 703795075 702049732 700288892 698486626 696583509 694506764 692311943
2890.1 692311943 690096617 687865376 685540318 683105469 680642605 678165317 675573289 672779739
2906.4 672779739 669736147 666317225 662363231 657932639 653320193 648860872 644866407 641618371
2922.7 641618371 639278829 637862504 637284935 637371421 638029635 639299870 641146183 643431783 646013796
2941 646013796 648685753 651108563 652993500 654266953 654983163 655225694 655192494 655127227 655165076 655381918
2961.4 655381918 655751944 656180382 656605005 657014906 657477856 658023715 658612311 659333766 660243571 661129832
2981.8 661129832 661878765 662619174 663371146 664011776 664405584 664414763 664049029 663367629 662407398 661334991
3002.2 661334991 660212219 658968151 657686889 656512082 655304492 653815925 652097583 650320292
3018.5 650320292 648491740 646589875 644639790 642626047 640545070 638442576 636381805 634246826
3034.9 634246826 631915152 629590809 627361834 625022173 622464240 619792163 617167950 614576519
3051.2 614576519 611901045 609188378 606500685 603801370 601106405 598488808 595977604 593475103
3067.5 593475103 590885758 588276684 585732579 583251715 580803037 578296602 575649679 572892070
3083.8 572892070 570116460 567413032 564750135 561995983 559165895 556393206 553664386 550849259
3100.1 550849259 547914028 544936478 541990101 539041877 535997212 532912016 529896915 526886046
3116.4 526886046 523756862 520394206 516815186 513282299 509917438 506577015 503156245 499669373
3132.8 499669373 496167302 492695391 489231497 485656172 481951654 478228390 474541783 470922500
3149.1 470922500 467340440 463627815 459727407 455807000 451956064 448142469 444356441 440547138
3165.4 440547138 436648458 432723403 428863436 425037950 421190858 417326927 413510948 409720987
3181.7 409720987 405895501 402104735 398394883 394687355 390937179 387206465 383537710 379904002
3198 379904002 376283377 372719288 369256437 365854949 362431586 359008074 355662674 352380842 349156827
3216.4 349156827 346009761 342899412 339802414 336777240 333836794 330925047 328064024 325315773
3232.7 325315773 322604895 319848001 317138523 314557433 312083662 309696048 307365566 305033147
3249 305033147 302728653 300523072 298380584 296217740 293992192 291762143 289608330 287511200 285453260
3267.4 285453260 283458143 281445354 279331893 277184069 275080025 273002803 270942509 268917859
3283.7 268917859 266893655 264856070 262849510 260883927 258914888 256917387 254887491 252815157
3300 252815157 250781536 248892829 247022897 244973153 242780551 240608618 238558322 236591920 234628618
3318.4 234628618 232681930 230775431 228892505 227001786 225110054 223288700 221535489 219820023
3334.7 219820023 218168497 216526240 214833081 213138774 211457491 209837690 208377749 206953466
3351 206953466 205408379 203837514 202389166 201062307 199783459 198562413 197499618 196567968 195539191
3369.3 195539191 194262370 192982256 192023590 191288292 190570906 189844474 189209491 188772231 188576907
3387.7 188576907 188599795 188570514 188243672 187907964 188026041 188444033 188576370 188352481 188298628 188598305
3408.1 188598305 189004004 189392403 189756036 190121874 190574169 191146076 191831246 192678064 193698391
3426.5 193698391 194844007 196007997 197256908 198690757 200005144 200961471 201886982 203166440 204761401
3444.8 204761401 206479236 208195448 209909022 211703792 213622659 215674907 217852935 219998941
3461.1 219998941 222177088 224706993 227445915 229876220 231851429 233828977 236159548 238851294
3477.4 238851294 241646022 244194373 246684000 249424040 252221376 254971892 257883221 260981560
3493.8 260981560 264145225 267223239 270268857 273440689 276609063 279683113 282859564 286285043
3510.1 286285043 289972246 293667257 297141314 300658971 304436475 308425337 312368840 316118807
3526.4 316118807 319926322 324000061 328316391 332812488 337297976 341656893 346162826 350867808
3542.7 350867808 355528265 360055774 364623159 369372249 374311388 379397482 384596914 389917880
3559 389917880 395260870 400398970 405367464 410936534 417286724 423548192 429489970 435484618 441722780
3577.4 441722780 448203176 454843670 461384773 467668414 474175721 481307030 488391578 495285958
3593.7 495285958 502478302 509963453 517453253 524944067 532348931 539391994 546477020 553993225
3610 553993225 561649144 569328189 576758206 584037006 591957927 600033939 607352376 613751471 620195985
3628.4 620195985 627882540 635662735 642926455 649843514 656398058 662833214 669177413 674966931
3644.7 674966931 679912984 684939265 691131532 697309852 702553749 707758784 713128924 717896461
3661 717896461 722141981 726097167 729318798 732014716 735264421 738290012 740636706 743786573 747493088
3679.4 747493088 750885725 753902137 756375551 758275926 760131299 762527525 765168011 767523468
3695.7 767523468 769395113 770775080 772055686 773728788 775363147 776323497 776750863 777623653 779485643
3714 779485643 781379461 782604039 783318639 783967376 784742475 785651922 786659539 787292480 787305772 787268341
3734.4 787268341 788136005 789862931 791141272 791022182 790519357 791211545 791763544 791747749 792745233
3752.8 792745233 794361174 795351088 795839608 796572387 797370970 797793984 798000753 798218787 798827291
3771.1 798827291 799778342 800442100 800637722 800734222 801102281 801521599 801870465 802364945 802927315 803377628
3791.5 803377628 803476989 803280056 803250194 803090990 802890956 803396761 803857088 804224372 805098295 805813730
3811.9 805813730 805696845 805224597 805078745 804750144 804809928 805686295 806353092 806720793 806912839 806910157
3832.3 806910157 806865752 806483209 805975199 806150377 806862533 807727337 808480740 808746874 807999194 806235433
3852.7 806235433 805819988 807268918 808395982 808573484 808249533 808206439 808424115 808216691 808060348
3871.1 808060348 808447123 809066832 809501410 809335649 809183717 809343517 809372425 809558272 809664547 809546173
3891.5 809546173 809861779 810308754 810150206 809511364 808929026 808782101 809329331 810135722 810576797 810731530
3911.9 810731530 810741663 810521483 810290217 810344577 810503900 810536206 810630560 810759187 810674787 810613096 810857654
3934.3 810857654 811180890 811339557 811262548 811077595 811092854 811196268 811227083 811352789 811554730 811678588
3954.7 811678588 811710179 811754405 811849356 811932564 812004566 812139511 812327981 812428772 812418282 812494874 812708080
3977.1 812708080 812838614 812869012 813008547 813192785 813231587 813197672 813243985 813341856 813372791 813441455
3997.5 813441455
##END=$$ End of the data block
