##TITLE=$$ Begin of the data block
##JCAMP-DX=5.00 $$ ACD/SpecManager v 10.08
##SPECTROMETER/DATA SYSTEM=Alpha
##DATE=15 Apr 2014 09:00:42
##DATA TYPE=INFRARED SPECTRUM
##DATA CLASS=XYDATA
##ORIGIN=
##OWNER=
##NPOINTS=1765
##FIRSTX=399.75695801
##LASTX=3997.56933594
##MAXX=3997.56933594
##MINX=399.75695801
##MAXY=0.85197073
##MINY=0.18751189
##XFACTOR=1.0000000000
##YFACTOR=1.000000000000000e-9
##FIRSTY=0.58657151
##DELTAX=2.03957629
##XUNITS=1/CM
##YUNITS=ARBITRARY UNITS
##XYDATA=(X++(Y..Y))
399.8E86571515l166378j190424m59492k185702k381802l41892j32263j598001j479387
418.1E73636174m25935j176834j855731m18544K51472j790523k396345l55423l8325
436.5E65429986j384974o52790P63357l33310j613020j40429Q75413r45448j740456
454.8E60258329j59502m0710j729548j487255P7724q03232k584457j316428K25901
473.2E52440822j277268k042889k01583K00689j605869j400113L30627m72844k152800
491.5E43818772j221776j29938j644433k508521o35087Q1658j736999j866221j49727
509.9E34007728p54595k591371j785219l05474j555681k763450j336157n80371k407312
528.3E19928098k793670o91652m45485k229631j725376J20580o88255k120792q13544
$$ y = [586571515, 583405137, 582214713, 581755221, 579569519, 577187717, 576845825, 576713562, 575115561, 573636174, 573210239, 572033405, 570177674, 569759130, 570010602, 568220079, 565823734, 565468311, 565429986, 564045012, 563392222, 564155579, 563822269, 562209249, 562068820, 562944233, 561998785, 560258329, 560098827, 560058117, 558328569, 556841314, 556919038, 556115806, 553531349, 552214921, 552440822, 551163554, 549120665, 548919082, 549119771, 547513902, 546113789, 546444416, 545971572, 543818772, 542596996, 542467058, 540822625, 538314104, 537679017, 537760675, 536023676, 534157455, 534007728, 533253133, 530661762, 528876543, 528571069, 527015388, 524251938, 522915781, 522335410, 519928098, 517134428, 516442776, 515997291, 513767660, 512042284, 512162864, 511474609, 509353817, 508540273]
546.6E08540273K28584j588285k482594o49034m13478k657115k737880r07093j614988
565D95718390l679842l125340j775801k936721l927648k110720j184165l092825l551573
583.3D70333755j709372j715332l526211l358036j864672k477556l832430l135413
599.6D48714733k366841l585070l761679j265496Q4579j306027j561553O86646K311110
618D37950402K612651L839999N261690M353821K952635L948748N061388L666521K505898
636.3D72153753L482997L209889N67496R4861K999336M084944J743198o5893p0304
654.7D88200277J036465L989071P357359P555902M674494L317535M806578L693998
671E24631679J702070K168536L985286L495276J504719J995981L378988K132535N82695
$$ y = [508540273, 508768857, 507180572, 504697978, 504048944, 503635466, 500978351, 498240471, 497333378, 495718390, 492038548, 488913208, 487137407, 484200686, 480273038, 478162318, 476978153, 473885328, 470333755, 468624383, 466909051, 463382840, 460024804, 458160132, 455682576, 451850146, 448714733, 446347892, 442762822, 439001143, 437735647, 437820226, 436514199, 434952646, 435639292, 437950402, 440563053, 444403052, 449664742, 454018563, 456971198, 460919946, 465981334, 469647855, 472153753, 475636750, 478846639, 479414135, 479508996, 482508332, 486593276, 488336474, 488270581, 488200277, 489236742, 493225813, 500583172, 508139074, 512813568, 516131103, 520937681, 524631679, 526333749, 528502285, 532487571, 535982847, 537487566, 539483547, 542862535, 544995070, 545577765]
689.4E45577765J663506K440512O85692k20120J437723K000988N87880Q88050K833009
707.7E57895005K705276J276850K068937L607750K701402J460612K739191L745496
724E78200519K264321J437247K814054L070235J393199J203418K646983K396703R57906
742.4E96384585J569867L002822K230108J027346K102733L141224J952231J277149
758.7F12688065K628743L029287J529992J292288K658963K462864Q39174P44104J515389
777.1F29388869M74512j123547o89745L15964k16007k94984J736522L529728L636419
795.4F36757731M322589O329536O920934N696178N435884O115257N149901L216148
811.7F79944158K921640L251732J787305p6652l02672o38008k664268m162908l687978
$$ y = [545577765, 547241271, 549681783, 550367475, 550147355, 551585078, 553586066, 554173946, 555061996, 557895005, 560600281, 561877131, 563946068, 567553818, 570255220, 571715832, 574455023, 578200519, 580464840, 581902087, 584716141, 587786376, 589179575, 590382993, 593029976, 595426679, 596384585, 597954452, 600957274, 603187382, 604214728, 606317461, 609458685, 611410916, 612688065, 615316808, 618346095, 619876087, 621168375, 623827338, 626290202, 627129376, 627873480, 629388869, 629863381, 628739834, 628050089, 628366053, 628150046, 627855062, 629591584, 633121312, 636757731, 641080320, 647409856, 654330790, 660026968, 665462852, 671578109, 676728010, 679944158, 682865798, 686117530, 687904835, 687828183, 687525511, 686887503, 684223235, 680060327, 676372349]
830.1F76372349l484487m507065m592300l402113l241182m083991l609478j960159
846.4F47491574r37462J84238L038645O278098P786929Q495629R888172J0608614R434819
864.8G02269256Q184850Q032799P080197M788340L461480L384411K380908N78820J00136
883.1G40261197L58284p06375k085328j792491q89003r72211p14779J061320K337873
901.5G36858487J815856J418411J935184J404107m99249j676678j970470l154397m640103
919.8G31491148m366517k941191k180517j442193L86834J773417J340150P40946J258850
938.2G26060927J361966L30389r8944L55303k59936j948118k853811l296375m876912
956.6G14774489o877899p895767q965075j1289120j3681472j4920234j5712977j6413092
$$ y = [676372349, 672887862, 668380797, 663788497, 660386384, 657145202, 653061211, 649451733, 647491574, 646554112, 646738350, 649776995, 656055093, 663842022, 672337651, 682225823, 692834437, 702269256, 710454106, 718486905, 725567102, 730355442, 733816922, 737201333, 739582241, 740161061, 740261197, 740619481, 739913106, 737827778, 736035287, 735146284, 734174073, 733459294, 734520614, 736858487, 738674343, 740092754, 742027938, 743432045, 742932796, 741256118, 739285648, 736131251, 731491148, 727124631, 724183440, 722002923, 720560730, 720947564, 722720981, 724061131, 724802077, 726060927, 727422893, 727753282, 727654338, 728009641, 727749705, 725801587, 722947776, 719651401, 714774489, 707896590, 700000823, 691035748, 679746628, 666065156, 651144922, 635431945, 619018853]
972.9F19018853j5703798j3419926j1451840j0545016r461104p902444p036269o859123
989.2E36639333o150484n018950m452228m059554l117144k369165k638936l398478
1005.5E05434394m080594n124986o587535p457405p360787p082283o899118o267429
1021.8D54574257n377263m969448m835218m320889l673286l483802l439903l006339
1038.1D21468109k478689k345085k358288k186864k135814k251386j840830o64562
1054.5D05206591N42968J312137J755685J638651L91006j734167l761560n301952o440014
1072.8C93609345o995559o868899o545007o470829o453723o272882o251663o454647
1089.1C41296136o202459n077273l477722j901954m85450N55425R34035P70062N07921
$$ y = [619018853, 603315055, 589895129, 578443289, 567898273, 558437169, 550534725, 543498456, 536639333, 530488849, 525469899, 521017671, 516958117, 513840973, 511471808, 508832872, 505434394, 501353800, 496228814, 489641279, 482183874, 474823087, 467740804, 460841686, 454574257, 449196994, 444227546, 439392328, 435071439, 431398153, 427914351, 424474448, 421468109, 418989420, 416644335, 414286047, 412099183, 409963369, 407711983, 405871153, 405206591, 405749559, 407061696, 408817381, 410456032, 410847038, 409112871, 405351311, 400049359, 393609345, 386613786, 379744887, 373199880, 366729051, 360275328, 354002446, 347750783, 341296136, 335093677, 330016404, 326538682, 324636728, 324151278, 324706703, 325640738, 326410800, 326918721]
1107.5C26918721K46734k64258j058310k110481l740937n874335o874055m774034o73413
1125.8C01795632J972228K161711J140803R2090K91824J829624L337830L837854L432930
1144.2C19892526K804517K420485K158106J976669K197414K860457L704756M742235
1160.5C42757165O226480Q032740R615451J0666638J1282832J1394530J0887265J0140867
1176.8D21003968R590715Q986443P889241O520480N134493L419012J411855p2241n38498
1195.2D63345468k47836P00444K459228M479170N734890N966306N637944M963338L946513
1213.5D96985465L032714K704502K648234K373099K223254K550899K824724K725721
1229.9E18068612K794981L217637L400624L181457L108979L199875K819359K062202
$$ y = [326918721, 327165455, 326901197, 325842887, 323732406, 319991469, 314117134, 307243079, 302469045, 301795632, 303767860, 305929571, 307070374, 307162464, 307454288, 309283912, 312621742, 316459596, 319892526, 322697043, 325117528, 327275634, 329252303, 331449717, 334310174, 338014930, 342757165, 348983645, 357016385, 366631836, 377298474, 388581306, 399975836, 410863101, 421003968, 430594683, 439581126, 447470367, 453990847, 459125340, 462544352, 463956207, 463883966, 463345468, 463097632, 463798076, 466257304, 470736474, 476471364, 482437670, 488075614, 493038952, 496985465, 500018179, 502722681, 505370915, 507744014, 509967268, 512518167, 515342891, 518068612, 520863593, 524081230, 527481854, 530663311, 533772290, 536972165, 539791524, 541853726]
1246.2E41853726J635373J413822R02295N11408P88271J301110J584828K099931L089130
1264.5E55179894L924847M343450M876733N597591N892575N771219N885363O229043
1280.8E97700715O210864O003797O227016O520748O185115N620122N437433N159915
1297.2F45065725M358113L699660L538787L180743K444565K039969K022028J717508
1313.5F68067098J163125J090467J429915J429200J247049J501977J715243J230001
1329.8F78874075O06358M04954J52052l68774l44098L59297O51658M05729M46975P45773
1350.2F81933999N35548l7611k17557k48849q36074j487494j356363j235247j708925
1368.5F75341427j934170j903654k133131k557575l566206n540669o582021l845394
$$ y = [541853726, 543489099, 544902921, 545805216, 546316624, 547104895, 548406005, 549990833, 552090764, 555179894, 559104741, 563448191, 568324924, 573922515, 579815090, 585586309, 591471672, 597700715, 603911579, 609915376, 616142392, 622663140, 628848255, 634468377, 639905810, 645065725, 649423838, 653123498, 656662285, 659843028, 662287593, 664327562, 666349590, 668067098, 669230223, 670320690, 671750605, 673179805, 674426854, 675928831, 677644074, 678874075, 679480433, 679885387, 680037439, 679668665, 679324567, 679683864, 680335522, 680741251, 681188226, 681933999, 682469547, 682431936, 682214379, 681965530, 681129456, 679641962, 678285599, 677050352, 675341427, 673407257, 671503603, 669370472, 666812897, 663246691, 657706022, 651124001, 647278607]
1384.9F47278607R85622L019572J517236n11706j527488j789809k458751l024041l258229
1403.2F40231013l626525l577173l164589k654195k155662j942515j990438j545846
1419.5F19574070n74648k78712j87099j0729r0658J52468N61595P02620J297534J986503
1439.9F23132944K201736K182245K110899K505898L398121L908932M005492N206227
1456.2F48652494P890582Q212984P110595P059217P536054P266581P071375Q056641
1472.6G08856523Q396328P071077N552292M304886L257275K009570O70433k47061l91245
1490.9G39480078n81801j808285l205598l257513k874076l273785n466819p817328
1507.2G11194873n634666m157245m738271n200684m831731m023016l925323l273428
$$ y = [647278607, 648264229, 651283801, 652801037, 652289331, 650761843, 648972034, 646513283, 643489242, 640231013, 636604488, 633027315, 629862726, 627208531, 625052869, 623110354, 621119916, 619574070, 618999422, 618720710, 618533611, 618522882, 618432224, 618584692, 619146287, 619848907, 621146441, 623132944, 625334680, 627516925, 629627824, 632133722, 635531843, 639440775, 643446267, 648652494, 656543076, 664756060, 671866655, 678925872, 686461926, 693728507, 700799882, 708856523, 717252851, 724323928, 729876220, 734181106, 737438381, 739447951, 740118384, 739871323, 739480078, 738898277, 737089992, 733884394, 730626881, 727752805, 724479020, 719012201, 711194873, 705560207, 701402962, 696664691, 691464007, 686632276, 682609260, 678683937, 675410509]
1523.6F75410509k631247k662182k330422k595425k927482j930237j857161l114224
1539.9F55362129k099871j35720M20511M18424L73542N93484O94096K53975q30292
1558.2F55050278k38300Q36075l08216j775861l206730m256367m074514n229771p666409
1576.6F29130185p260800o647348p716835q488536q839845r050846r120763r063542
1592.9E62941670r065210q877576q561671q390069q240521p991194p828295p861645
1609.2D96125489p648408p276505q008480q868218o913989o010622o858439o390690
1625.5D38150138n550355m899174l782243l464311l600150j683504K21312R47625J321971
1643.9D17661309J931012L254324L643096L726571N648196O382406N960315O336093
$$ y = [675410509, 672779262, 670117080, 667786658, 665191233, 662263751, 660333514, 658476353, 655362129, 653262258, 653126538, 653547049, 653965473, 654339015, 654932499, 655626595, 655880570, 655050278, 654811978, 655648053, 655339837, 653563976, 650357246, 646100879, 642026365, 636796594, 629130185, 621869385, 615222037, 607505202, 599016666, 590176821, 581125975, 572005212, 562941670, 553876460, 544998884, 536437213, 528047144, 519806623, 511815429, 503987134, 496125489, 488477081, 481200576, 473192096, 464323878, 457409889, 451399267, 444540828, 438150138, 432599783, 427700609, 423918366, 420454055, 416853905, 415170401, 415391713, 416339338, 417661309, 419592321, 422846645, 426489741, 430216312, 435864508, 442246914, 448207229, 454543322]
1660.2D54543322P333011Q183360P830500Q126557R492189R472281R755194J0870695
1676.5E25607109J0539115R724140J0138929J2833714J2992561J1278212J1251807
1690.8F04365587J0532081J0577441J1308848J1517823J3250649J1969924R839297
1705.1F83361650R522497Q537293P216751O080389N320728N555689N960346N363047
1721.4G36918390M676282M351199L838360L471852L170490L301739M112781M021525
1737.7G67862618L758073L859997L819406L708958L594339L576219L877998L689527
1754G97747135L077328K649546K318859K322197K383173J882493J367509J168073J296758
1772.4H16213071J880646K011478J642406J320362J236916J297295J379609J089632
$$ y = [454543322, 461876333, 470059693, 477890193, 486016750, 495508939, 504981220, 514736414, 525607109, 536146224, 545870364, 556009293, 568843007, 581835568, 593113780, 604365587, 614897668, 625475109, 636783957, 648301780, 661552429, 673522353, 683361650, 692884147, 701421440, 708638191, 714718580, 720039308, 725594997, 731555343, 736918390, 741594672, 745945871, 749784231, 753256083, 756426573, 759728312, 763841093, 767862618, 771620691, 775480688, 779300094, 783009052, 786603391, 790179610, 794057608, 797747135, 800824463, 803474009, 805792868, 808115065, 810498238, 812380731, 813748240, 814916313, 816213071, 818093717, 820105195, 821747601, 823067963, 824304879, 825602174, 826981783, 828071415]
1788.7H28071415N30661P89165J451016J257181P60078Q04246J075923R92358P47680
1807H36479723O17803O43193P37846P51436O58154N47290L94523K87235L42846L18051
1827.4H41778100K42769O65546R08971N34474L84212M92215J71185k31624K75671Q37863
1847.8H46059382O46651L37958L21448L79145K61843J71364K26497J96398j20163k13027
1868.2H48267496L78191P39694M36365J81496K03908J72377P7247J07289J35958j6690
1888.6H50683331J1802K08616J82868J16109J41025J70946J62125O5565n7757m8161
1909H51636469O4612Q8930k4915j06513j0372K2114J8477J43767J26481J1384K98j907
1933.5H51968825o3718q9943j26779k39551j89662j967N1975l1054j54853k00390j68205
$$ y = [828071415, 828602076, 829391241, 830842257, 832099438, 832859516, 833663762, 834739685, 835732043, 836479723, 837097526, 837740719, 838478565, 839230001, 839888155, 840435445, 840829968, 841117203, 841460049, 841778100, 842020869, 842686415, 843595386, 844129860, 844514072, 845006287, 845177472, 844945848, 845221519, 846059382, 846706033, 847043991, 847365439, 847744584, 848006427, 848177791, 848404288, 848600686, 848480523, 848267496, 848645687, 849385381, 849821746, 850003242, 850207150, 850379527, 850456774, 850564063, 850700021, 850683331, 850695133, 850903749, 851086617, 851202726, 851343751, 851514697, 851676822, 851742387, 851684630, 851636469, 851701081, 851790011, 851765096, 851658583, 851648211, 851670325, 851688802, 851832569, 851959050, 851970434, 851970732, 851968825, 851905107, 851815164, 851688385, 851448834, 851259172, 851257205, 851309180, 851278126, 851123273, 850922883, 850754678]
1955.9H50754678j76072j98126j67787j71721k56300k34067j06871p8202j25527j62959
1976.3H49077046j60933j48356j54376j91152k34067k45214k57253k13981j06871j08898
1996.7H47255945j90317k15292k12014k27273k67028k77937k49803k18749k40862k69890
2017.1H44886780k17915k12312k61783k55287k35855k57254k61009k44200k32756k19286
2037.5H42489123k22921k18630k09987k45273k76387k20716j73151k02954k21074j87218
2057.9H40310812j64628j95324k13325j55092j06752j38759j33694r3996j17779j45852
2078.3H38845611r5070n4955j00017j35958r8825o0260r9063j09136l0935J1802k5988
2100.7H38047206l2127J7465r776p1763j5438N4181r299p1823P391J14083P6234J5319
$$ y = [850754678, 850578606, 850380480, 850212693, 850040972, 849784672, 849550605, 849443734, 849365532, 849240005, 849077046, 848916113, 848767757, 848613381, 848422229, 848188162, 847942948, 847685695, 847471714, 847364843, 847255945, 847065628, 846850336, 846638322, 846411049, 846144021, 845866084, 845616281, 845397532, 845156670, 844886780, 844668865, 844456553, 844194770, 843939483, 843703628, 843446374, 843185365, 842941165, 842708409, 842489123, 842266202, 842047572, 841837585, 841592312, 841315925, 841095209, 840922058, 840719104, 840498030, 840310812, 840146184, 839950860, 839737535, 839582443, 839475691, 839336932, 839203238, 839109242, 838991463, 838845611, 838750541, 838695586, 838595569, 838459611, 838360786, 838300526, 838201463, 838092327, 838061392, 838073194, 838047206, 838015079, 838032544, 838022768, 837951005, 837935567, 837989748, 837980449, 837908626, 837916017, 838030100, 838106334, 838121653]
2125.2H38121653P3909J03891M5955M1306R6381R1195M0114M5240J12891J38939J13487
2147.7H39024961J31786J54435Q3626M2558J37329J83105R5606N4419J32918J45972
2168H40186715P2837J19507K34604J95146P0989Q6665J66953J25408M2081J06215J86742
2190.5H41593862O4492m8220O3061J46091L4511O855J24991J05321l3557j133J56641
2212.9H42212915J26303j7643K1159R9123j0848q1182M9830J36196k324j24157j0371
2235.4H42399001P1466m4942o4194O7294K9862j23084p4744P9393K2233j46211r5784
2257.8H42120290L1292j2338o0797O1155J44124R715n4061J00911J35839j1147K4796
2280.2H42489779K02000K12014P5698K9206R3579L4750p1824K7359J73688J19328M1485
$$ y = [838121653, 838195562, 838299453, 838345408, 838386714, 838483095, 838574290, 838614404, 838659644, 838772535, 838911474, 839024961, 839156747, 839311182, 839394808, 839437366, 839574695, 839757800, 839853406, 839907825, 840040743, 840186715, 840259552, 840379059, 840613663, 840808809, 840879798, 840966463, 841133416, 841258824, 841300905, 841407120, 841593862, 841658354, 841610134, 841673195, 841819286, 841853797, 841860652, 841985643, 842090964, 842057407, 842056274, 842212915, 842339218, 842321575, 842342734, 842441857, 842431009, 842349827, 842399657, 842535853, 842533529, 842409372, 842399001, 842470467, 842425525, 842361331, 842428625, 842458487, 842335403, 842260659, 842340052, 842362285, 842216074, 842120290, 842151582, 842139244, 842078447, 842139602, 842283726, 842293441, 842239380, 842340291, 842476130, 842464983, 842489779, 842691779, 842903793, 842979491, 843008697, 843102276, 843137026, 843065202, 843092561, 843266249, 843385577, 843427062]
2302.7H43427062J26720J89006P2479m411J22965J76072k682q5116Q9705J43469R417
2325.1H44264686M3333J59740R4116O437R4950J43946o6758k10642M2438L65555N02587
2347.5H45440388M62830K53081n3882k36393j45137M709L993J05560L81708M22597
2367.9H46639454J88470J33395M18306N42104L35872L11971N27561M79638J38402M2618
2388.3H49757791K59578K63512K7716N5969K60115J49488p2122L5644J96576M2021
2408.7H50976288q9705J08242K26617o914j25706O4075P0333j78218j31666J95682
2429.1H51109028J81436j04844p1705J35184K4318j73032n1260Q9228r0122j91212
2449.5H50857019N3764J34051j31965j78754R1135Q1182k32697k17140J09137Q8751
$$ y = [843427062, 843553782, 843742788, 843815267, 843810856, 843933821, 844109893, 844107211, 844022095, 844111800, 844255269, 844264686, 844308019, 844467759, 844561875, 844568312, 844663262, 844807208, 844740450, 844529808, 844572246, 844937801, 845440388, 845903218, 846156299, 846102417, 845866024, 845720887, 845725596, 845729589, 845835149, 846216857, 846639454, 846827924, 846961319, 847379625, 847921729, 848257601, 848569572, 849097133, 849576771, 849715173, 849757791, 850017369, 850280881, 850308597, 850364566, 850624681, 850774169, 850702047, 850737691, 850934267, 850976288, 850886583, 850994825, 851221442, 851214528, 851088822, 851152897, 851223230, 851045012, 850913346, 851109028, 851290464, 851185620, 851113915, 851249099, 851273417, 851100385, 851049125, 851138353, 851048231, 850857019, 850910783, 851044834, 850912869, 850734115, 850825250, 850906432, 850673735, 850456595, 850565732, 850654483]
2469.9H50654483k12550j50860R6858n4002k74718n7578J19686j64032l06964r715
2490.3H49640608Q6903j87277k15531N3406K1160k48015j59443J13070l4213l38495
2510.7H48732173j54554J44720o6042l13819r4056Q6188j52051k77221j9252M0173
2531.1H47926259k57552k65538M4882k0444l14713j66297J26481o1571l51072j36196
2551.5H46524239J23560j34349l50833q7380M0352k37882l04759m1484p4089l85523
2571.9H45071852l11374m054j35898m48764l10778o1989k79784n23269k69473o2704
2592.3H42663765l47436n25355k48611j72317n30362n59390k12907k65718n76615m69029
2612.7H38756025k10643m00782o87122n03838k26140l87430o11961m40896k91884n15341
$$ y = [850654483, 850441933, 850291073, 850387931, 850333929, 850059211, 850001633, 850121319, 849957287, 849650323, 849640608, 849727511, 849540234, 849324703, 849378109, 849399269, 849151254, 848991811, 849104881, 849070668, 848732173, 848577619, 848722339, 848656297, 848342478, 848248422, 848334610, 848182559, 847905338, 847886086, 847926259, 847668707, 847403169, 847448051, 847427607, 847112894, 846946597, 847073078, 847011507, 846660435, 846524239, 846647799, 846513450, 846162617, 846075237, 846115589, 845877707, 845572948, 845531464, 845457375, 845071852, 844760478, 844756424, 844620526, 844171762, 843860984, 843798995, 843519211, 842995942, 842726469, 842663765, 842316329, 841790974, 841542363, 841370046, 840839684, 840280294, 840067387, 839801669, 839225054, 838756025, 838545382, 838144600, 837457478, 836953640, 836727500, 836340070, 835728109, 835287213, 834995329, 834479988]
2633.1H34479988n93782l09884k85030n83231n69940k94983l55840o05464m98950k76328
2653.5H30106556m41432o68227m55559k14397m15326n86748l62932k66076n08785n42700
2673.9H25644374l18766l97145o80626n78701k91408m03404o56545n19514l26753n07474
2694.3H20964038o55532m77254m04417o31512p06792m89473m52280o83606p01427m87566
2714.6H15274179n10991p00771o13690m36425n82576p74026o27339m52220n85258o84679
2735H09306204n16951m63068o39975o55473m48644m38809o86884p30872n50986n87344
2755.4H03587198p60853o92785n57363o93142q41737p04944n98371p57575q51691p45118
2775.8G96383619p78913r64105r64403q18015q23259r60350r77039r29296j049281
$$ y = [834479988, 833886206, 833576322, 833291292, 832708061, 832138121, 831843138, 831487298, 830881834, 830382884, 830106556, 829665124, 828996897, 828541338, 828326941, 827911615, 827324867, 826961935, 826695859, 826187074, 825644374, 825325608, 824928463, 824247837, 823669136, 823377728, 822974324, 822317779, 821798265, 821471512, 820964038, 820308506, 819831252, 819426835, 818795323, 818088531, 817599058, 817146778, 816463172, 815761745, 815274179, 814763188, 814062417, 813448727, 813012302, 812429726, 811655700, 811028361, 810576141, 809990883, 809306204, 808789253, 808326185, 807686210, 807030737, 806582093, 806143284, 805456400, 804725528, 804174542, 803587198, 802826345, 802133560, 801576197, 800883055, 800041318, 799336374, 798738003, 797980428, 797128737, 796383619, 795604706, 794640601, 793676198, 792858183, 792034924, 791074574, 790097535, 789168239, 788118958]
2794.2G88118958j178622j094520j032770j168429j265645j193464j167059j308263
2810.5G78710186j391828j298129j292110j473844j541912j451016j497566j665593
2826.8G67098188j721322j748264j934230k171874k362550k691090l275633l900289
2843.1G47292936m393816m760504m705429l922403k738178j749754j156389q94368
2859.5G22972095j049399j595736k181053k551854k708733k656042k434552k163708
2875.8G05631018j910329j752377j721203j769304j916767k086102k153397k177358
2892.1F90144181k255618k380610k454936k445221k457738k583981k791285l051818
2908.4F69722974l443241l962338m426181m633188m487217l994882l212988k304435
$$ y = [788118958, 786940336, 785845816, 784813046, 783644617, 782378972, 781185508, 780018449, 778710186, 777318358, 776020229, 774728119, 773254275, 771712363, 770261347, 768763781, 767098188, 765376866, 763628602, 761694372, 759522498, 757159948, 754468858, 751193225, 747292936, 742899120, 738138616, 733433187, 729510784, 726772606, 725022852, 723866463, 722972095, 721922696, 720326960, 718145907, 715594053, 712885320, 710229278, 707794726, 705631018, 703720689, 701968312, 700247109, 698477805, 696561038, 694474936, 692321539, 690144181, 687888563, 685507953, 683053017, 680607796, 678150058, 675566077, 672774792, 669722974, 666279733, 662317395, 657891214, 653258026, 648770809, 644775927, 641562939, 639258504]
2924.7F39258504j398742n53727J20937O81520J260400J816868K247930K556741K692640
2943.1F48683071K456010J877784J242101P12276K63154m1127r4056K6465K25126L98696
2963.5F55749500M46558M16338L96788M45724N52356O33836P41124Q96394R21369Q18014
2983.9F62018001P61807P31170O33240M05908O198l66508o42419r16422j061439j126528
3004.3F60443008j235008j249433j161039j241028j520753j721919j764774j806378
3020.6F48742676j895666j955688j994849k055227k099693k061129k106905k312541
3036.9F32260978k359330k261222k340853k579212k702594k637029k613961k691210
3053.2F12075567k694487k662123k694785k688170k594590k529740k550006k608657
$$ y = [639258504, 637859762, 637306035, 637426972, 638108492, 639368892, 641185760, 643433690, 645990431, 648683071, 651139081, 653016865, 654258966, 654971242, 655234396, 655193269, 655099213, 655125678, 655350804, 655749500, 656196058, 656612396, 657009184, 657454908, 658007264, 658641100, 659382224, 660278618, 661199987, 662018001, 662779808, 663510978, 664144218, 664550126, 664556324, 664189816, 663547397, 662630975, 661569536, 660443008, 659208000, 657958567, 656797528, 655556500, 654035747, 652313828, 650549054, 648742676, 646847010, 644891322, 642896473, 640841246, 638741553, 636680424, 634573519, 632260978, 629901648, 627640426, 625299573, 622720361, 620017767, 617380738, 614766777, 612075567, 609381080, 606718957, 604024172, 601336002, 598741412, 596211672, 593661666, 591053009]
3069.5E91053009k614617k549351k474963k430260k502144k687156k796292k760470
3085.8E70237756k678812k667486k764583k826214k775073k747297k837837k959430
3102.2E47981024k989352k951682k940893l034472l113330l057360l025115l122508
3118.5E23746312l349305l556668l505707l349066l357768l465533l510058l454119
3134.8D96198088l397524l444642l601313l747970l755748l670454l584415l588676
3151.1D67407346l757149l928453l918797l843486l803283l791183l837645l910512
3167.4D36616838l931075l880084l835320l842593l866046l832281l785789l819346
3183.7D05824304l852517l779709l675729l664255l682465l685504l692627l659934
$$ y = [591053009, 588438392, 585889041, 583414078, 580983818, 578481674, 575794518, 572998226, 570237756, 567558944, 564891458, 562126875, 559300661, 556525588, 553778291, 550940454, 547981024, 544991672, 542039990, 539099097, 536064625, 532951295, 529893935, 526868820, 523746312, 520397007, 516840339, 513334632, 509985566, 506627798, 503162265, 499652207, 496198088, 492800564, 489355922, 485754609, 482006639, 478250891, 474580437, 470996022, 467407346, 463650197, 459721744, 455802947, 451959461, 448156178, 444364995, 440527350, 436616838, 432685763, 428805679, 424970359, 421127766, 417261720, 413429439, 409643650, 405824304, 401971787, 398192078, 394516349, 390852094, 387169629, 383484125, 379791498, 376131564]
3200.1C76131564l576725l462226l400772l438175l415644l311813l251523l210127
3216.4C49064559l179193l151983l115773l055960k952844k883464k821773k741575
3232.7C25161994k752811k765298k662033k575308k526194k417683k328694k330125
3249C04803848k315283k240449k177417k176195k200187k184003k130389k086252k048195
3267.4B85245478j987994k002567k101093k136588k110809k112270k115905k096385
3283.7B68581867k071887k025813j963138j921833j948595k039254k123058k104729
3300B52383560j985699j893491j936361k079710k177268k168596k068550j937732j877993
3318.4B34258160j895547j910180j892686j912042j929954j849741j761019j719892
$$ y = [376131564, 372554839, 369092613, 365691841, 362253666, 358838022, 355526209, 352274686, 349064559, 345885366, 342733383, 339617610, 336561650, 333608806, 330725342, 327903569, 325161994, 322409183, 319643885, 316981852, 314406544, 311880350, 309462667, 307133973, 304803848, 302488565, 300248116, 298070699, 295894504, 293694317, 291510314, 289379925, 287293673, 285245478, 283257484, 281254917, 279153824, 277017236, 274906427, 272794157, 270678252, 268581867, 266509980, 264484167, 262521029, 260599196, 258650601, 256611347, 254488289, 252383560, 250397861, 248504370, 246568009, 244488299, 242311031, 240142435, 238073885, 236136153, 234258160, 232362613, 230452433, 228559747, 226647705, 224717751, 222868010, 221106991, 219387099]
3334.7B19387099j652822j625523j690581j717076j690179j616582j473904j443580
3351B06476852j558095j589745j459599j309275j246393j217947j099362r82002j060218
3369.3A94954216j212835j167059r60216q03128p27385p11471o39647m49955j88470
3387.7A88094050M9904k0549l17410k94104J17242L65705J21042j99497n1319K90945
3408.1A88156009M06265L77506L56883L96415N02244N91353O61522Q14274J012966
3426.5A93275437J183003J220167J282513J401573J242683R62764J008719J307308
3442.8B02884167J556308J699179J733676J760512J813322J892582K064139K209454
3459.1B17613339K139599K137839K481088K710402K429143J995727K009079K353177
$$ y = [219387099, 217734277, 216108754, 214418173, 212701097, 211010918, 209394336, 207920432, 206476852, 204918757, 203329012, 201869413, 200560138, 199313745, 198095798, 196996436, 196014434, 194954216, 193741381, 192574322, 191614106, 190810978, 190083593, 189372122, 188732475, 188282520, 188094050, 188143954, 188123405, 187805995, 187511891, 187629133, 187994838, 188115880, 187916383, 187865064, 188156009, 188562274, 188939780, 189296663, 189693078, 190195322, 190786675, 191448197, 192262471, 193275437, 194458440, 195678607, 196961120, 198362693, 199605376, 200568140, 201576859, 202884167, 204440475, 206139654, 207873330, 209633842, 211447164, 213339746, 215403885, 217613339, 219752938, 221890777, 224371865, 227082267, 229511410, 231507137, 233516216, 235869393]
3475.4B35869393K664581K730086K529845K502396K741039K832189K811611K946228
3491.7B57627368L106147L176928L090739L015041L106237L124118L052204L146857
3508B82445639L431797L698469L658563L461390L522724L762245M003257M004866L806054
3526.4C15795004L821910M071325M303038M463792M479647M387557M520893M710555
3542.7C50553721M688055M587680M638373M791201M947245N044549N108536N279720
3559C89639080N403131N196869M960656N528242O308585O260306N990982O035209O219625
3577.4D41542685O469935O714046O638348O313145O468475P132501P149666O903231
3593.7D95332032P136196P481099P557868P588506P483363P056892P044733P477224
$$ y = [235869393, 238533974, 241264060, 243793905, 246296301, 249037340, 251869529, 254681140, 257627368, 260733515, 263910443, 267001182, 270016223, 273122460, 276246578, 279298782, 282445639, 285877436, 289575905, 293234468, 296695858, 300218582, 303980827, 307984084, 311988950, 315795004, 319616914, 323688239, 327991277, 332455069, 336934716, 341322273, 345843166, 350553721, 355241776, 359829456, 364467829, 369259030, 374206275, 379250824, 384359360, 389639080, 395042211, 400239080, 405199736, 410727978, 417036563, 423296869, 429287851, 435323060, 441542685, 448012620, 454726666, 461365014, 467678159, 474146634, 481279135, 488428801, 495332032, 502468228, 509949327, 517507195, 525095701, 532579064, 539635956, 546680689, 554157913]
3610E54157913P651984P703484P471799P315517P964730Q161724P396996O399035O404460
3628.4F20627642P700085P778168P226110O928205O581366O417990O301582N724787
3644.7F75285935M874707N019903O263196O226600N255878N219399N364657M715681
3661G18225956M164398L904581L219247K686619L229618K979160K269804L202796L859759
3679.4G47741938L481805L027677K427936J819909J824021K448380K705753K382696
3695.7G67860115J835346J287460J247823J754463J694441R18090L54708Q69393J888931
3714G79710770J872182J187980P03096O26445P51197R73940J112521O24955o3181n186
3734.4G87494719R35316J712084J287520q4341n22196O67930N47170k1755R87708J620352
$$ y = [554157913, 561809897, 569513381, 576985180, 584300697, 592265427, 600427151, 607824147, 614223182, 620627642, 628327727, 636105895, 643332005, 650260210, 656841576, 663259566, 669561148, 675285935, 680160642, 685180545, 691443741, 697670341, 702926219, 708145618, 713510275, 718225956, 722390354, 726294935, 729514182, 732200801, 735430419, 738409579, 740679383, 743882179, 747741938, 751223743, 754251420, 756679356, 758499265, 760323286, 762771666, 765477419, 767860115, 769695461, 770982921, 772230744, 773985207, 775679648, 776597738, 776952446, 777821839, 779710770, 781582952, 782770932, 783474028, 784100473, 784851670, 785825610, 786938131, 787563086, 787499905, 787494719, 788430035, 790142119, 791429639, 791345298, 790823102, 791491032, 792038202, 792016447, 793004155, 794624507]
3754.8G94624507J012862N21600P57695P81476M12822K34187K28047N77688R35197
3773.2H00086081O75917J64747N2988M04597M83572L58165M75764N26965L76403N8889
3793.6H03664088j42872J9014k13504k28465N64099M79996L81410R05097O89446j86264
3814H05932045n37694j55627k46406J79470R26852O46055L22938J52468J729l219l45468
3836.4H06873143n02348J61171O82831Q14616P37429K67804p87259j828730m07457
3854.8H06011200J525640J166642J78814l13580l0220K03670j96398j12712L83556
3873.1H08816612N68092L79860j88947j35064J98126R3758K54929R6202k16603K37882
3893.5H10104847M46439r9957n66483n99801k12312N62370Q84056M94778J22547n6624
$$ y = [794624507, 795637369, 796158969, 796916664, 797698140, 798110962, 798345149, 798573196, 799150884, 800086081, 800761998, 800926745, 800979733, 801384330, 801867902, 802226067, 802701831, 803228796, 803605199, 803664088, 803521216, 803540230, 803326726, 803098261, 803662360, 804142356, 804523766, 805428863, 806118309, 805932045, 805394351, 805238724, 804992318, 805171788, 806098640, 806744695, 807067633, 807220101, 807221830, 807218611, 806873143, 806370795, 806531966, 807214797, 808029413, 808766842, 809034646, 808247387, 806418657, 806011200, 807536840, 808703482, 808882296, 808568716, 808538496, 808742166, 808545768, 808433056, 808816612, 809384704, 809764564, 809575617, 809440553, 809638679, 809732437, 809987366, 810083568, 809866965, 810104847, 810551286, 810451329, 809884846, 809285045, 809072733, 809635103, 810519159, 811013937, 811136484, 811079860]
3913.9H11079860k34902j72973R4354J14858k3424J04427K39730J9610q3089J96636
3934.3H11335087L49343J49428j68085k23636M5120J22190j073J02162K59221J99080
3954.7H12168837O6995J9908L1591P8439J09136R1851J01090Q5056K7596R6024J87337
3977.1H13063860R6500O9022K07841J61529m888L9578J42515Q2850j669Q5652
3997.5H13942790
$$ y = [811079860, 810844958, 810671985, 810766339, 810881197, 810857773, 810962200, 811201930, 811221540, 811138451, 811335087, 811684430, 811833858, 811665773, 811442137, 811487257, 811609447, 811608374, 811710536, 811969757, 812168837, 812235832, 812255740, 812287331, 812365770, 812474906, 812566757, 812667847, 812752903, 812780499, 812876523, 813063860, 813160360, 813229382, 813437223, 813598752, 813593864, 813633442, 813775957, 813858807, 813857138, 813942790]
##END=$$ End of the data block
