##TITLE=$$ Begin of the data block
##JCAMP-DX=5.00 $$ ACD/SpecManager v 10.08
##SPECTROMETER/DATA SYSTEM=Alpha
##DATE=15 Apr 2014 09:00:42
##DATA TYPE=INFRARED SPECTRUM
##DATA CLASS=XYDATA
##ORIGIN=
##OWNER=
##NPOINTS=1765
##FIRSTX=399.75695801
##LASTX=3997.56933594
##MAXX=3997.56933594
##MINX=399.75695801
##MAXY=0.84441197
##MINY=0.19500494
##XFACTOR=1.0000000000
##YFACTOR=1.000000000000000e-9
##FIRSTY=0.58882648
##DELTAX=2.03957629
##XUNITS=1/CM
##YUNITS=ARBITRARY UNITS
##XYDATA=(X++(Y..Y))
399.8E88826478l113330j135111j389146k864301k119362k88427k98083p95066j30773
$$ 588826478 585713148 584578037 583188891 580324590 578205228 577916801 577618718 576823652 576692879
418.1E76692879j78098j328409j595259j171350o10412o73830j371205j349986p50005
$$ 576692879 576514781 575186372 573591113 572419763 571809351 571135521 569764316 568414330 567664325
436.5E67664325p81178r44972k90335K73586k77519r51767o74069q0824j61171q18908
$$ 567664325 566883147 565938175 565647840 565921426 565643907 564692140 564018071 563937247 563776076 562957168
456.9E62957168j148641o70374n18858j051069j096069n44966o62803j411736j513541
$$ 562957168 561808527 561138153 560619295 559568226 558472157 557927191 557264388 555852652 554339111
475.2E54339111j068413p74980p36952q24034p56204n45621n58615r53555j294434
$$ 554339111 553270698 552495718 551758766 550934732 550178528 549632907 549074292 548120737 546826303
493.6E46826303j271069j299143j451969j318157r48965q23915j083315j388788j308083
$$ 546826303 545555234 544256091 542804122 541485965 540537000 539713085 538629770 537240982 535932899
511.9E35932899j050354j171112j404821j416624j496375j789927k163828k103090
$$ 535932899 534882545 533711433 532306612 530889988 529393613 527603686 525439858 523336768
528.3E23336768j574159j488745j864910j643419q67248o47962j047253j073301p17104
$$ 523336768 521762609 520273864 518408954 516765535 515898287 515250325 514203072 513129771 512412667
546.6E12412667r81748j698792j699030j148522j208842j950681k348900j976669j922905
$$ 512412667 511430919 509732127 508033097 506884575 505675733 503725052 501376152 499399483 497476578
565D97476578k837360l403843k935141k528727k857685l174424k692372k209514k472550
$$ 497476578 494639218 491235375 488300234 485771507 482913822 479739398 477047026 474837512 472364962
583.3D72364962k841949k655447k360880k656967l035992k776921k432346k831936
$$ 472364962 469523013 466867566 464506686 461849719 458813727 456036806 453604460 450772524
599.6D50772524l533453l439247k504945j678646j389921j313150q81642J4454J219422
$$ 450772524 447239071 443799824 441294879 439616233 438226312 436913162 436031520 436045974 437265396
618D37265396K579838L514588L655195L300280L206670L630519M066646M036754L774017
$$ 437265396 439845234 443359822 447015017 450315297 453521967 457152486 461219132 465255886 469029903
636.3D69029903L414721K534121J215637R20117K425432L627419K577782J64896j198828
$$ 469029903 472444624 474978745 476194382 477114499 479539931 483167350 485745132 485910028 484711200
654.7D84711200O77347M663676O687999N789161M258990M077613M199207K710581K372921
$$ 484711200 485388547 490052223 496740222 502529383 506788373 510865986 515065193 517775774 520148695
673.1E20148695K784371K763986K505780K313792K172292J967609J651704J368940
$$ 520148695 522933066 525697052 528202832 530516624 532688916 534656525 536308229 537677169
689.4E37677169J265347J102984P74264N15819O26147J000583J188576J174927J483857
$$ 537677169 538942516 540045500 540819764 541335583 541961730 542962313 544150889 545325816 546809673
707.7E46809673K047956K252579K096772K150059K566993K691865K291382K112507
$$ 546809673 548857629 551110208 553206980 555357039 557924032 560615897 562907279 565019786
724E65019786K465904K610803K173364J804531J980960K168417J758098J304091J604616
$$ 565019786 567485690 570096493 572269857 574074388 576055348 578223765 579981863 581285954 582890570
742.4E82890570K212227K121090J650989J816869K369583K296328J822770J983225
$$ 582890570 585102797 587223887 588874876 590691745 593061328 595357656 597180426 599163651
758.7E99163651K628923K665937J995504J835823K395391K348304J276553N34534P60019
$$ 599163651 601792574 604458511 606454015 608289838 610685229 613033533 614310086 614844620 615604639
777.1F15604639O88016l51488j101017o21081J65880L64125P85351K428591M348576
$$ 615604639 616292655 615941167 614840150 614219069 614384949 614749074 615534425 617963016 622311592
795.4F22311592N191207N499244O398797P232725O638885N262017M671216M647196
$$ 622311592 627502799 633002043 639400840 646633565 653272450 658534467 663205683 667852879
811.7F67852879L832936K345741J496374J269460K89381j535416k787411l105581l589273
$$ 667852879 671685815 674031556 675527930 676797390 677086771 675551355 672763944 669658363 666069090
830.1F66069090m612863m976153m191876l611981m100442m611016m042029k852619
$$ 666069090 661456227 656480074 652288198 648676217 644575775 639964759 635922730 633070111
846.4F33070111j753986r7811K871871O194294Q329987R328008J0279357J1035502
$$ 633070111 631316125 631218314 634090185 640284479 648614466 657942474 668221831 679257333
862.7F79257333J0550380R081721P902563P192075N992651M300297L212392K886355
$$ 679257333 689807713 698889434 706791997 713984072 719976723 724277020 727489412 730375767
879.1G30375767K209902P51495m78685p96676r21070j478195j740873q79526N22673
$$ 730375767 732585669 733337164 732858479 732061803 731140733 729662538 727921665 727042139 727564812
897.4G27564812J339554J598478K014518K402067J970708P88033k88844j058698k152621
$$ 727564812 728904366 730502844 732517362 734919429 736890137 737678170 737389326 736330628 734178007
915.8G34178007l612638m517794m256546l302097k261401r44078P74205K045274K100289
$$ 734178007 730565369 726047575 721791029 718488932 716227531 715283453 716057658 718102932 720203221
934.1G20203221J498461J287758J400650J044869K41280k72274m49896j137555k581477
$$ 720203221 721701682 722989440 724390090 725434959 725676239 725403965 724954069 723816514 721235037
952.5G21235037l922463m722297n787968p683695r747624j1420191j3208508j5505970
$$ 721235037 717312574 712590277 706802309 699118614 689370990 677950799 664742291 649236321
968.8F49236321j7381966j7576277j6183555j4326036j2590230j0998785r397626p669628
$$ 649236321 631854355 614278078 598094523 583768487 571178257 560179472 550781846 543112218
985.1E43112218o426930n830467n167603m481852m004658l311991k334893j685441
$$ 543112218 536685288 530854821 525687218 521205366 517200708 513888717 511553824 509868383
1001.4E09868383j828253k544224l454983m704982o275267p405162p653445p404297
$$ 509868383 508040130 505495906 502040923 497335941 491060674 483655512 476002067 468597770
1017.7D68597770p161439o934315o429583n787491n447746n327433m908472m168630
$$ 468597770 461436331 454502016 448072433 442284942 436837196 431509763 426601291 422432661
1034.1D22432661l618061l380657l044098k539277k286464k489061k791434k689600
$$ 422432661 418814600 415433943 412389845 409850568 407564104 405075043 402283609 399594009
1050.4C99594009k120644j224458M0412J524091K476513K201736Q07136j131445l191918
$$ 399594009 397473365 396248907 396289319 397813410 400289923 402491659 403298795 402167350 398975432
1068.7C98975432n103260o486804p092952p219285p352412p382035o882340n983144
$$ 398975432 393872172 387385368 380292416 373073131 365720719 358338684 351456344 345473200
1085C45473200n335689n156725m895061m028440k721786j432181l20315N64754J058310
$$ 345473200 340137511 334980786 330085725 326057285 323335499 321903318 321583003 322147757 323206067
1103.4C23206067J030564P45446O08474N71310K03729p85589k445877m512489n585461
$$ 323206067 324236631 324982077 325590551 326161861 326365590 325580001 323134124 318621635 313036174
1121.8C13036174l826499j0252K603769K505243Q13156n73993j81973J551181K904892
$$ 313036174 309209675 309199423 311803192 314308435 315121591 314547598 314365625 315916806 318821698
1140.1C18821698L152371K777427K299846J954853J825064J937241K311826K895057
$$ 318821698 321974069 324751496 327051342 329006195 330831259 332768500 335080326 337975383
1156.4C37975383L728747N012572O758422Q676707J0394186J1596888J2166083J2134523
$$ 337975383 341704130 346716702 353475124 362151831 372546017 384142905 396308988 408443511
1172.7D08443511J1598378J0774761R930700R042174P873386O351292M529208K550692
$$ 408443511 420041889 430816650 440747350 449789524 457662910 464014202 468543410 471094102
1189.1D71094102O53177q44240j549959j269579j46598J483470L162325M408061M901231
$$ 471094102 471747279 470903039 469353080 468083501 467936903 469420373 472582698 476990759 481891990
1207.4D81891990M576772L690303K742052K133160J872600J721322J610816J695335
$$ 481891990 486468762 490159065 492901117 495034277 496906877 498628199 500239015 501934350
1223.7E01934350J967251K202630K339303K523303K757609K878666K853811K802014
$$ 501934350 503901601 506104231 508443534 510966837 513724446 516603112 519456923 522258937
1240.1E22258937K715648K430319J915455J381099J022995Q14199O54757O88255J142025
$$ 522258937 524974585 527404904 529320359 530701458 531724453 532538652 533193409 533881664 535023689
1258.4E35023689J863003K554476L261388M126012M967928N530059N807400O005704
$$ 535023689 536886692 539441168 542702556 546828568 551796496 557326555 563133955 569139659
1274.7E69139659O234944O324709O240546O232679O421626O604671O552697O334364
$$ 569139659 575374603 581699312 587939858 594172537 600594163 607198834 613751531 620085895
1291F20085895O092131N729616N103469M384875L861189L486037L010929K467751K135158
$$ 620085895 626178026 631907642 637011111 641395986 645257175 648743212 651754141 654221892 656357050
1309.4F56357050J963139J640379J266777J203001J316965J334786J324415J375914
$$ 656357050 658320189 659960568 661227345 662430346 663747311 665082097 666406512 667782426
1325.7F67782426J417279J234949P48634K27869j6272q4401k29477k71976K9981L95596
$$ 667782426 669199705 670434654 671183288 671411157 671394885 671310484 671081007 670809031 670839012 671234608
1346.1F71234608N01871M04537K75731J28686j38640m41611p22408j139343j617253
$$ 671234608 671736479 672141016 672416747 672545433 672406793 671965182 671242774 670103431 668486178
1364.5F68486178j851499j905501j836002j904368k474487l268063m744351p630229
$$ 668486178 666634679 664729178 662893176 660988808 658514321 655246258 650501907 642871678
1380.8F42871678q843184m307568K550185M533112K320767N08248o42717j653075k582669
$$ 642871678 634028494 629720926 632271111 636804223 639124990 639633238 638990521 637337446 634754777
1399.1F34754777l255010l563761l864944l814459l393829l003001k514661j771092
$$ 634754777 631499767 627936006 624071062 620256603 616862774 613859773 611345112 609574020
1415.5F09574020j275241j447022j378060q58009n66899m31657l42012p6473N11110
$$ 609574020 608298779 606851757 605473697 604615688 604048789 603617132 603275120 603198647 603709757
1433.8F03709757J063645J248002J371324J842380K247393K596796L110885L628314
$$ 603709757 604773402 606021404 607392728 609235108 611482501 614079297 617190182 620818496
1450.1F20818496M145205N027890P137239Q584976P063747O511747P434071P659018
$$ 620818496 624963701 629991591 637128830 645713806 652777553 659289300 666723371 674382389
1466.4F74382389P240831Q009017R463727Q661688O468773M980385L999412L259540
$$ 674382389 681623220 689632237 699095964 707757652 714226425 719206810 723206222 726465762
1482.8G26465762K467990J589417M07279r14038j511395j882910k946437l857672l825426
$$ 726465762 728933752 730523169 730930448 730016410 728505015 726622105 723675668 719817996 715992570
1501.1G15992570l406286m099131o838143p341683o285131n941510n391300m560589
$$ 715992570 712586284 708487153 701649010 694307327 688022196 682080686 676689386 672128797
1517.4F72128797l793121m023015m312277l948152l903508l519535l081561l201782
$$ 672128797 668335676 664312661 660000384 656052232 652148724 648629189 645547628 642345846
1533.7F42345846k707243j790464j994133k548754k040089j398682o57261J05799P47203
$$ 642345846 639638603 637848139 635854006 633305252 631265163 629866481 629209220 629315019 630062222
1552.1F30062222J247287J618326J406789k91825j297593j430690j734435k503276
$$ 630062222 631309509 632927835 634334624 634042799 632745206 631314516 629580081 627076805
1568.4F27076805l832937m258871m691124o662905p315338o890654p291377p672965
$$ 627076805 623243868 618984997 614293873 607630968 600315630 593424976 586133599 578460634
1584.7E78460634p942915q171201q270383q186102q151889q009493p698774p459939
$$ 578460634 570517719 562346518 554076135 545890033 537738144 529728651 522029877 514569938
1601.1E14569938p330417p182956p102609p223070p118672o636023o892979p848382
$$ 514569938 507239521 500056565 492953956 485730886 478612214 471976191 465083212 457234830
1617.4D57234830o705761n679161o147414n951285n314142m796743l667057k669901
$$ 457234830 450529069 444849908 438702494 432751209 427437067 422640324 418973267 416303366
1633.7D16303366k499818j893938p52628K76238J182437K085626K611220K588361L594131
$$ 416303366 413803548 411909610 411156982 411433220 412615657 414701283 417312503 419900864 423494995
1652D23494995N003392M252702M340589N683422P027209P540167P313013Q327722R544403
$$ 423494995 428498387 432751089 437091678 442775100 449802309 457342476 464655489 472983211 482527614
1670.4D82527614Q922755R404362J0418355R808421R577871J1020124J3473331J2001276
$$ 482527614 491450369 500854731 511273086 521081507 530659378 541679502 555152833 567154109
1686.7E67154109J0195494J0742188J0581672J1624515J2643337J2535453J3619304
$$ 567154109 577349603 588091791 598673463 610297978 622941315 635476768 649096072
1701F49096072J1338949R512305R449303Q324981P491767P058025O837308O795287
$$ 649096072 660435021 669947326 679396629 687721610 695213377 702271402 709108710 715903997
1717.3G15903997N577147M241229M127502M366755M288316M218757M111767M379809
$$ 715903997 721481144 725722373 729849875 734216630 738504946 742723703 746835470 751215279
1733.6G51215279L965974L143430L406167L790557L876627L945469L959597L932118
$$ 751215279 755181253 758324683 761730850 765521407 769398034 773343503 777303100 781235218
1749.9G81235218L642917L066003K859235K844453K746641K520383J963854J834094
$$ 781235218 784878135 787944138 790803373 793647826 796394467 798914850 800878704 802712798
1766.3H02712798K145887K174615J711905J203597J181006J411438J360059J187086
$$ 802712798 804858685 807033300 808745205 809948802 811129808 812541246 813901305 815088391
1782.6H15088391J265645J316309J250089J297831J276493R54330P99358Q79049R57609
$$ 815088391 816354036 817670345 818920434 820218265 821494758 822449088 823248446 824127495 825085104
1800.9H25085104Q57174O82950O64830Q14855Q39949N74469M46499N79834P06374O82950
$$ 825085104 825942278 826625228 827290058 828104913 828944862 829519331 829965830 830545664 831252038 831934988
1821.3H31934988O46294O45935O85573N97298K66135K06291M14908M58598M18485O04510
$$ 831934988 832581282 833227217 833912790 834510088 834776223 834982514 835397422 835856020 836274505 836879015
1841.7H36879015P32899L69131m77Q5831L31283M01675L18826K74956L40342L53396
$$ 836879015 837611914 837981045 837980568 838066399 838397682 838799357 839118183 839393139 839733481 840086877
1862.1H40086877L40343M47571M53472J32799q8512J6331J72496K18511J71899J77086
$$ 840086877 840427220 840874791 841328263 841461062 841372550 841388881 841561377 841779888 841951787 842128873
1882.5H42128873K53200K73049J78814O8665J23679J92583P1228n484J09076J77801
$$ 842128873 842382073 842655122 842833936 842902601 843026280 843218863 843290091 843284607 843393683 843571484
1902.9H43571484J15395P0512R8824R5964M4167J09971K09629R6023p5280j03891m0651
$$ 843571484 843686879 843757391 843856215 843952179 843996346 844106317 844315946 844411969 844336689 844232798 844192147
1925.3H44192147K3306j4246n7041J192K2530l4869m2915O199k3603j40965k34247
$$ 844192147 844215453 844201207 844144166 844145358 844167888 844133019 844090104 844096303 844072700 843931735 843697488
1947.8H43697488j88529o3360r9778k40922k15232p0215q7082j75715j16765n6625
$$ 843697488 843508959 843445599 843345821 843104899 842889667 842819452 842732370 842556655 842439890 842383265
1968.2H42383265j63733k92898k49862j11997r9898j96397j79172n1260m0173j88172
$$ 842383265 842219532 841926634 841676772 841564775 841464877 841268480 841089308 841038048 840997875 840809703
1988.6H40809703k31028j47342j93119l10064k78115j36852j30773k65896l11196j93060
$$ 840809703 840578675 840431333 840238214 839928150 839650035 839513183 839382410 839116514 838805318 838612258
2009H38612258j28746k25603k94089k29002j96874l19004l67760k31743j47581k51353
$$ 838612258 838483512 838257909 837963820 837734818 837537944 837218940 836851180 836619437 836471856 836220503
2029.4H36220503l40164k47300j32501j92880l24786l08692k05994k25961l30568k97606
$$ 836220503 835880339 835633039 835500538 835307658 834982872 834674180 834468186 834242225 833911657 833614051
2049.8H33614051j81377k14040l40283k96891j40428j25110k24114k43723j29461r2745
$$ 833614051 833432674 833218634 832878351 832581460 832441032 832315922 832091808 831848085 831718624 831625879
2070.2H31625879j94192k01225p4625m1306j42515j83284r1076k9207j09732j66297
$$ 831625879 831431687 831230462 831155837 831114531 830972016 830788732 830697656 830668449 830558717 830392420
2090.5H30392420q4877j5318r0599j42217k9981L8445o0380j18374l3319R894p8797
$$ 830392420 830307543 830292225 830201626 830059409 830029428 830067873 830007493 829889119 829855800 829865694 829786897
2113H29786897j44065m1127R5368P1644k8014j79J04428R6440J3530J7882J02639Q5532
$$ 829786897 829642832 829601705 829697073 829768717 829740703 829740524 829844952 829941392 829954922 829972804 830075443 830160975
2137.5H30160975j2874J788R0122Q4162K1398M6909J29878J40906Q0704O2585J25468
$$ 830160975 830148101 830149889 830240011 830324173 830345571 830392480 830522358 830663264 830743968 830806553 830932021
2159.9H30932021J39654M6134J6391J20819J82509J04725M6909J18316J54078O1154
$$ 830932021 831071675 831117809 831134200 831255019 831437528 831542253 831589162 831707478 831861556 831922710
2180.3H31922710N424Q0764J42694P0989j9312K9266J08302M9948j5139M4167Q2314
$$ 831922710 831928134 832008898 832151592 832222581 832203269 832232535 832340837 832390785 832375646 832419813 832502127
2202.7H32502127J79p1645l219J00374P0215k4856M173R9838L8564j04189o0201P2479
$$ 832502127 832502306 832430661 832427442 832527816 832598031 832573175 832577348 832677186 832715750 832611561 832551360 832623839
2227.2H32623839L3558q0526o3598K3246J0192r1016j03116R119L1412r4295j45554
$$ 832623839 832657397 832576871 832513273 832536519 832546711 832455695 832352579 832361698 832393110 832298815 832153261
2249.6H32153261n6029P75n6863r5605k4260L6300j6809m9949K7597J06812Q2135P570
$$ 832153261 832097232 832098007 832041144 831945539 831921279 831957579 831940770 831890821 831918418 832025230 832107365 832114935
2274.1H32114935K6286N0902j6451k2888Q6844J77800J66953J04964J22487J97232
$$ 832114935 832141221 832192123 832175672 832152784 832239628 832417428 832584381 832689345 832811832 833009064
2294.5H33009064J71602R9599J31846K52127L08812K81632K88844L19123K90394K41399
$$ 833009064 833180666 833280265 833412111 833664238 833973050 834254682 834543526 834862649 835153043 835394442
2314.9H35394442L12507M96090N68092M42028L50773L78966L76225K58207J68264K38001
$$ 835394442 835706949 836203039 836771131 837213159 837563932 837942898 838319123 838577330 838745594 838983595
2335.3H38983595K56241J65939J08659n96k83003l75270J0967O00457R47356R14812
$$ 838983595 839239836 839405775 839514434 839513838 839230835 838855565 838866532 839466989 840414345 841329157
2355.7H41329157P73073M76420R4175j49846k79546m08709m97043n42641n17189m06444
$$ 841329157 842102230 842578650 842672825 842522979 842243433 841834724 841337681 840795040 840277851 839871407
2376.1H39871407l60668l68118k76506q6725M0889N7995Q5592J50562J58965Q4698
$$ 839871407 839510739 839142621 838866115 838779390 838820279 838878274 838963866 839114428 839273393 839358091
2396.5H39358091M3333J16229J64747P5996p748M7445J24991Q1420J6808M8220O5267
$$ 839358091 839401424 839517653 839682400 839758396 839750648 839798093 839923084 840004504 840021312 840069532 840134799
2418.9H40134799k9623j51753j65880k2054J14620Q2433K6107P5340R5964J78n5611
$$ 840134799 840105176 839953423 839787543 839765489 839880109 839962542 839988649 840063989 840159953 840160131 840104520
2441.3H40104520N842M0888k7895r2506m8637J6152k0623q3625m0054J9013m5299j33038
$$ 840104520 840110362 840151250 840123355 840030849 839982212 839998364 839977741 839894116 839854062 839873075 839827776 839694738
2465.8H39694738j08838m3153n4658r6261o6042M112k7001j30951j28448m2140m1724
$$ 839694738 839585900 839542747 839488089 839391828 839325786 839329898 839302897 839171946 839043498 839001358 838959634
2488.3H38959634j23679j29938n2870j5914n9664j14918j05798o7413p7963j34111
$$ 838959634 838835955 838706017 838653147 838637233 838577569 838462651 838356853 838289440 838211477 838077366
2508.7H38077366j26361m9651n4956j41918j75834j45018j13309j05202r8228q3804
$$ 838077366 837951005 837901354 837846398 837704480 837528646 837383628 837270319 837165117 837066889 836983085
2529H36983085j01686j26421j03534o9856r5844j54436j71542j40250j00911j13010
$$ 836983085 836881399 836754978 836651444 836581588 836485744 836331308 836159766 836019516 835918605 835805595
2549.4H35805595j34587j21594j20878j32620j63794j85013j42395j23203j87635k62797
$$ 835805595 835671008 835549414 835428536 835295916 835132122 834947109 834804714 834681511 834493876 834231079
2569.8H34231079k61009j98782j82092k07484k40325k70308k71320k89976l13521k92659
$$ 834231079 833970070 833771288 833589196 833381712 833141387 832871079 832599759 832309783 831996262 831703603
2590.2H31703603k84791l15249l44455l62694l68834m00185m50135m43279m15445m38273
$$ 831703603 831418812 831103563 830759108 830396414 830027580 829627395 829177260 828733981 828318536 827880263
2610.6H27880263m71770m50790m08948l94285m17530m66585m79162m59552m78089n05626
$$ 827880263 827408493 826957703 826548755 826154470 825736940 825270355 824791193 824331641 823853552 823347926
2631H23347926m71651m23551m38869m72009m65989m60327m62472m67897m96805n05447
$$ 823347926 822876275 822452724 822013855 821541846 821075857 820615530 820153058 819685161 819188356 818682909
2651.4H18682909m87387m71831m46915m18544m13835m69208n29170m85897m23074m61757
$$ 818682909 818195522 817723691 817276776 816858232 816444397 815975189 815446019 814960122 814537048 814075291
2671.8H14075291n16593m70460l98338m60624n94557n77151m64440m69982n45085n70238
$$ 814075291 813558698 813088238 812689900 812229276 811634719 811057568 810593128 810123146 809578061 809007823
2692.2H09007823n40494n22018n64337n76794n15222n06938n79834o24120o09815n88715
$$ 809007823 808467329 807945311 807380974 806804180 806288958 805782020 805202186 804578066 803968251 803379536
2712.6H03379536o37353o97791o39499n59032n87701o62148o73116o23285o19769o60658
$$ 803379536 802742183 802044392 801404893 800845861 800258160 799596012 798922896 798299611 797679842 797019184
2733G97019184o21140n39780n59449o50764o54816n69523n43296n94676o39140o59585
$$ 797019184 796398044 795858264 795298815 794648051 793993235 793423712 792880416 792285740 791646600 790987015
2753.4G90987015o87719p22169p28548o98030o89507p47382p92921p70628p39396p67350
$$ 790987015 790299296 789577127 788848579 788150549 787461042 786713660 785920739 785150111 784410715 783643365
2773.8G83643365q55684r07004q77500q61883r07063r59814r43840r20832j014054
$$ 783643365 782787681 781880677 781003177 780141294 779234231 778274417 777330577 776409745 775395691
2792.2G75395691j114428j095235j055539j113057j210928j238763j210094j203119
$$ 775395691 774281263 773186028 772130489 771017432 769806504 768567741 767357647 766154528
2808.5G66154528j291871j407028j400292j358449j404285j457453j482666j541376
$$ 766154528 764862657 763455629 762055337 760696888 759292603 757835150 756352484 754811108
2824.8G54811108j646936j748860j819730j910090k085209k389014k797126l305912
$$ 754811108 753164172 751415312 749595582 747685492 745600283 743211269 740414143 737108231
2841.1G37108231l973246m659832m953324m490555l401100k256990j450658r96112
$$ 737108231 733134985 728475153 723521829 719031274 715630174 713373184 711922526 710926414
2857.4G10926414r03666j172781j636386k107680k484858k693713k634466k373755
$$ 710926414 710022748 708849967 707213581 705105901 702621043 699927330 697292864 694919109
2873.7F94919109k107024j883328j716375j644910j663506j769661j941026k106666
$$ 694919109 692812085 690928757 689212382 687567472 685903966 684134305 682193279 680086613
2890.1F80086613k203524k276421k380490k451718k472639k538741k690017k919436
$$ 680086613 677883089 675606668 673226178 670774460 668301821 665763080 663073063 660153627
2906.4F60153627l273189l766536m313350m684329m604399m094303l434777k756238
$$ 660153627 656880438 653113902 648800552 644116223 639511824 635417521 631982744 629226506
2922.7F29226506k020777j274704o57857j94073K94328R01222J488746J942157K277971
$$ 629226506 627205729 625931025 625273168 625079095 625373423 626274645 627763391 629705548 631983519
2941F31983519K456069K287447J729250J079977N89013J82926j44899k21073n5671
$$ 631983519 634439588 636727035 638456285 639536262 640125275 640308201 640163302 639942229 639886558
2959.4F39886558J88351M04715N32091N81562O17981O52135O16431N27322N55694O48916
$$ 639886558 640074909 640479624 641011715 641593277 642211258 642863393 643479824 644007146 644562840 645211756
2979.8F45211756N71311M61399N05746N06401L87490J94549j20580m36664p17461r85086
$$ 645211756 645783067 646244466 646750212 647256613 647644103 647838652 647718072 647281408 646563947 645578861
3000.2F45578861j138448j234949j317978j316190j285851j375913j586020j772881
$$ 645578861 644440413 643205464 641887486 640571296 639285445 637909532 636323512 634550631
3016.5F34550631j865148j887799j893520j977682k096236k101004k074540k120852
$$ 634550631 632685483 630797684 628904164 626926482 624830246 622729242 620654702 618533850
3032.8F18533850k246857k354145k296925k258539k411365k577007k642155k668679
$$ 618533850 616286993 613932848 611635923 609377384 606966019 604389012 601746857 599078178
3049.1E99078178k678513k659857k635718k683043k759517k715170k577066k490104
$$ 599078178 596399665 593739808 591104090 588421047 585661530 582946360 580369294 577879190
3065.5E77879190k533972k629340k631187k549350k464414k424478k481938k585709
$$ 577879190 575345218 572715878 570084691 567535341 565070927 562646449 560164511 557578802
3081.8E57578802k655625k715945k703012k633750k695322k804458k788782k713859
$$ 557578802 554923177 552207232 549504220 546870470 544175148 541370690 538581908 535868049
3098.1E35868049k740383k898813k967179k860367k838135k980530l011763k904952
$$ 535868049 533127666 530228853 527261674 524401307 521563172 518582642 515570879 512665927
3114.4E12665927k933979l128349l343881l447026l382891l290027l294260l366649
$$ 512665927 509731948 506603599 503259718 499812692 496429801 493139774 489845514 486478865
3130.7D86478865l429234l416091l345132l367931l526151l607958l575206l559470
$$ 486478865 483049631 479633540 476288408 472920477 469394326 465786368 462211162 458651692
3147D58651692l505975l449470l562093l750801l787130l744036l741264l711403l680646
$$ 458651692 455145717 451696247 448134154 444383353 440596223 436852187 433110923 429399520 425718874
3165.4D25718874l698737l717839l719420l736347l741204l712952l673077l631652
$$ 425718874 422020137 418302298 414582878 410846531 407105327 403392375 399719298 396087646
3181.7C96087646l621280l629982l609270l560990l521979l501087l469110l425896
$$ 396087646 392466366 388836384 385227114 381666124 378144145 374643058 371173948 367748052
3198C67748052l395289l352434l271132l201843l186404l164411l124058l084928k992809
$$ 367748052 364352763 361000329 357729197 354527354 351340950 348176539 345052481 341967553 338974744
3216.4C38974744k901614k898544k895802k830237k763808k687901k577037k507716
$$ 338974744 336073130 333174586 330278784 327448547 324684739 321996838 319419801 316912085
3232.7C16912085k557725k596289k512961k425671k351582k259314k227307k234250
$$ 316912085 314354360 311758071 309245110 306819439 304467857 302208543 299981236 297746986
3249B97746986k169490k059698k003729k018362k053172k045095j976698j927287j921683
$$ 297746986 295577496 293517798 291514069 289495707 287442535 285397440 283420742 281493455 279571772
3267.4B79571772j881004j863599j923799j969755j948684j901686j864225j851380
$$ 279571772 277690768 275827169 273903370 271933615 269984931 268083245 266219020 264367640
3283.7B64367640j846880j792401j710951j698762j784057j863390j866341j843661
$$ 264367640 262520760 260728359 259017408 257318646 255534589 253671199 251804858 249961197
3300B49961197j775309j645535j641169j821563j940549j880332j794160j766056j741364
$$ 249961197 248185888 246540353 244899184 243077621 241137072 239256740 237462580 235696524 233955160
3318.4B33955160j701206j647935j621752j677692j714766j630977j516104j448110
$$ 233955160 232253954 230606019 228984267 227306575 225591809 223960832 222444728 220996618
3334.7B20996618j422882j440123j470834j458481j433640j362905j208872j195922
$$ 220996618 219573736 218133613 216662779 215204298 213770658 212407753 211198881 210002959
3351B10002959j339749j384094j267985j094848r81718r46462q68380p73311q43465
$$ 210002959 208663210 207279116 206011131 204916283 203934565 202988103 202119723 201346412 200502947
3369.3B00502947j019999r98497p64713o03229n37336n14179m59776k83151n4077J23620
$$ 200502947 199482948 198484451 197719738 197116509 196579173 196064994 195605218 195322067 195267990 195391610
3389.7A95391610M7595k27705k06560K18779M74721K16171j25304q523L38867M81293
$$ 195391610 195439205 195211500 195004940 195223719 195698440 195914611 195789307 195780784 196119651 196600944
3410.1A96600944M71458M32148M04060N02035O55502P12648P95156R88781J180456
$$ 196600944 197072402 197504550 197908610 198410645 199066147 199778795 200573951 201562732 202743188
3428.5B02743188J207441J260146J401022J220584R05126R83045J318991J558632J613512
$$ 202743188 203950629 205210775 206611797 207832381 208737507 209720552 211039543 212598175 214211687
3446.8B14211687J545325J594484J766741J884446J986250K097041K063796K057552
$$ 214211687 215757012 217351496 219118237 221002683 222988933 225085974 227149770 229207322
3463.2B29207322K348512K577633K309382J886427J937837K285689K555296K594158
$$ 229207322 231555834 234133467 236442849 238329276 240267113 242552802 245108098 247702256
3479.5B47702256K378628K354711K645582K747327K666533K744913K877146K983153
$$ 247702256 250080884 252435595 255081177 257828504 260495037 263239950 266117096 269100249
3495.8B69100249K982050K956659L040135L003239K918661L064126L301948L462612
$$ 269100249 272082299 275038958 278079093 281082332 284000993 287065119 290367067 293829679
3512.1B93829679L449381L314316L334642L551155L842324L852934L620833L621727
$$ 293829679 297279060 300593376 303928018 307479173 311321497 315174431 318795264 322416991
3528.4C22416991L819734L968328M139334M239053M132092M225164M543364M633695
$$ 322416991 326236725 330205053 334344387 338583440 342715532 346940696 351484060 356117755
3544.7C56117755M390508M234284M415334M646837M676342M758328N000264N070865
$$ 356117755 360508263 364742547 369157881 373804718 378481060 383239388 388239652 393310517
3561.1C93310517M919916M985989N561500N764217N355060N268693N551606N781442
$$ 393310517 398230433 403216422 408777922 414542139 419897199 425165892 430717498 436498940
3577.4D36498940N988479O174743O193131O190419O368101O418615O180257O319583
$$ 436498940 442487419 448662162 454855293 461045712 467413813 473832428 480012685 486332268
3593.7D86332268O720513O853371O820530O793976O700993O659686P011652P242978
$$ 486332268 493052781 499906152 506726682 513520658 520221651 526881337 533892989 541135967
3610E41135967P124424P112801O989598P133961P495642O996393O404936O487429P409871
$$ 541135967 548260391 555373192 562362790 569496751 576992393 583988786 590393722 596881151 604291022
3628.4F04291022P745445O563246O154179O319404O265283O243825O145000N896568
$$ 604291022 612036467 618599713 624753892 631073296 637338579 643582404 649727404 655623972
3644.7F55623972N955100O525994O220579M841804M426182M994571M870355M273117
$$ 655623972 661579072 668105066 674325645 679167449 683593631 688588202 693458557 697731674
3661F97731674M032671L928900L828287L968239L925621L300965L177107L047108K450288
$$ 697731674 701764345 705693245 709521532 713489771 717415392 720716357 723893464 726940572 729390860
3679.4G29390860K348423K528786K713084L034056K867281J994014J554310J633704
$$ 729390860 731739283 734268069 736981153 740015209 742882490 744876504 746430814 748064518
3695.7G48064518J713991J722872J737118J552463J327455J408934J535833J346469
$$ 748064518 749778509 751501381 753238499 754790962 756118417 757527351 759063184 760409653
3712G60409653R87470Q67725J042366J196027J106143Q84831P80105Q19564R02474
$$ 760409653 761397123 762264848 763307214 764503241 765609384 766494215 767274320 768093884 768996358
3730.3G68996358J128256J211286Q75413N03421L06189L47376P54178R01937O04570
$$ 768996358 770124614 771335900 772211313 772714734 773020923 773368299 774122477 775024414 775628984
3748.7G75628984N07414M64738L87549L68774TL87669M27007N34118N35488M17530
$$ 775628984 776136398 776601136 776988685 777357459 777726233 778113902 778540909 779075027 779610515 780028045
3769.1G80028045L22998K78651L74079N67675N83172L32534J76668J87934K07603K63333
$$ 780028045 780351043 780629694 781003773 781571448 782154620 782487154 782663822 782851756 783059359 783322692
3789.5G83322692L20971L88205N63681O09279M09364L15488K15530J07944J43469Q5175
$$ 783322692 783643663 784031868 784595549 785204828 785614192 785929680 786145210 786253154 786396623 786481798
3809.9G86481798J27613L67940N60939M56929K50399J64986K4378j5258N9902J34230
$$ 786481798 786609411 786977351 787538290 787995219 788245618 788410604 788434982 788419724 788479626 788613856
3830.3G88613856K72512L95239L85105K17974l8981j63734q3446O3955K27988L45409
$$ 788613856 788886368 789281607 789666712 789884686 789845705 789681971 789598525 789662480 789890468 790235877
3850.7G90235877L31044J57297p3314j24276J2339J98006K78294J42753L0339N7519
$$ 790235877 790566921 790724218 790650904 790526628 790538967 790736973 791015267 791158020 791188359 791245878
3871.1G91245878j3411p3850m5896R5427K53260J62542M3035m3631j09732m0710J967
$$ 791245878 791232467 791158617 791112721 791208148 791461408 791623950 791666985 791623354 791513622 791472912 791474879
3893.5G91474879L7551J83284K53856J31071m9055j86682k34603j58966q941J32561
$$ 791474879 791512430 791695714 791949570 792080641 792031586 791844904 791610301 791451335 791442394 791574955
3913.9G91574955K17199J78695M8935n7339r6977q6069l1948Q2850J74761R8288o1929
$$ 791574955 791792154 791970849 792019784 791962445 791865468 791779399 791747451 791830301 792005062 792103350 792041421
3936.3G92041421o8903M3273Q0466N7638R0659J10805L7670k0206j1027L6001N5611
$$ 792041421 791972518 792015791 792096257 792153895 792244554 792355359 792393029 792372823 792361796 792397797 792453408
3958.8G92453408J2219K206P4982J34409Q3148L9518J10984J34528N7876L4928J20461
$$ 792453408 792465627 792467833 792542815 792677224 792760372 792799890 792910874 793045402 793103278 793138206 793258667
3981.2G93258667K07603J37091o914n37O2108L4928K8432Q1003
$$ 793258667 793466270 793603361 793596447 793595910 793658018 793692946 793721378 793802381
3997.5G93802381
$$ 793802381
##END=$$ End of the data block
