##TITLE=$$ Begin of the data block
##JCAMP-DX=5.00 $$ ACD/SpecManager v 10.08
##SPECTROMETER/DATA SYSTEM=Alpha
##DATE=15 Apr 2014 09:00:42
##DATA TYPE=INFRARED SPECTRUM
##DATA CLASS=XYDATA
##ORIGIN=
##OWNER=
##NPOINTS=1765
##FIRSTX=399.75695801
##LASTX=3997.56933594
##MAXX=3997.56933594
##MINX=399.75695801
##MAXY=0.84430116
##MINY=0.19497512
##XFACTOR=1.0000000000
##YFACTOR=1.000000000000000e-9
##FIRSTY=0.58171576
##DELTAX=2.03957629
##XUNITS=1/CM
##YUNITS=ARBITRARY UNITS
##XYDATA=(X++(Y..Y))
399.8E81715763k049148j322508j714409k486229j607716K9981j09613j136779p02262
418.1E70617080J79052n56171j424312j179696k86459l71278j347661j380503o51836
436.5E63598216m19140n74827m20452R8944J01388m87090o00278l34501m51207r04680
456.9E59606373r39130l58344l76045j017213j130343p02083p14123j307368j484394
475.2E51577330j095117q15391q52108q59022n33581l64184o67930j000762j076162
493.6E44313073j078546j294374j459957j259923q99732p55906j065612j430809j302242
511.9E33765972j050413j238883j539588j490712j430094j745164k071560j892447
528.3E21307111j517594j590490j984179j768470q66473n55515j067102j176238p42615
$$ y = [581715763, 579666615, 578344107, 576629698, 574143469, 572535753, 572565734, 572456121, 571319342, 570617080, 570796132, 570239961, 568815649, 567635953, 567349494, 566978216, 565630555, 564250052, 563598216, 563179076, 562604249, 562183797, 562282741, 562384129, 561897039, 561296761, 560962260, 560511053, 559606373, 558667243, 558308899, 557932854, 556915641, 555785298, 555083215, 554369092, 553061724, 551577330, 550482213, 549666822, 548814714, 547955692, 547422111, 547057927, 546389997, 545389235, 544313073, 543234527, 541940153, 540480196, 539220273, 538320541, 537564635, 536499023, 535068214, 533765972, 532715559, 531476676, 529937088, 528446376, 527016282, 525271118, 523199558, 521307111, 519789517, 518199027, 516214848, 514446378, 513579905, 513024390, 511957288, 510781050, 510038435]
546.6E10038435q08656j442373j656055j266479j243473j886665k231598j940966j984507
565D95577663k784192l311783k913952k597630k954275l020704k432525k147346k580286
583.3D70834970k947956k643257k413690k910108l277421k771914k217829k629369
599.6D49023426l482104l487617k517402j634061j350969j255065q37088n7042J171708
618D35573786K755553L757447L691345L198416L142774L606498M112065M089445L691792
636.3D67619121L288508K564847J349866R43989K363801L615171K582937K11597j108319
654.7D83431518O67751M682481O871134N914718M132688L801942M207671K926647K447665
673.1E19084215K810180K826214K544403K276898K186000K078295J694619J299382
$$ y = [510038435, 509229779, 507787406, 506131351, 504864872, 503621399, 501734734, 499503136, 497562170, 495577663, 492793471, 489481688, 486567736, 483970106, 481015831, 477995127, 475562602, 473415256, 470834970, 467887014, 465243757, 462830067, 459919959, 456642538, 453870624, 451652795, 449023426, 445541322, 442053705, 439536303, 437902242, 436551273, 435296208, 434459120, 434402078, 435573786, 438329339, 442086786, 445778131, 448976547, 452119321, 455725819, 459837884, 463927329, 467619121, 470907629, 473472476, 474822342, 475766331, 478130132, 481745303, 484328240, 484539837, 483431518, 484099269, 488781750, 495652884, 501567602, 505700290, 509502232, 513709903, 516636550, 519084215, 521894395, 524720609, 527265012, 529541910, 531727910, 533806205, 535500824, 536800206]
689.4E36800206J190543J087725P70152M94301O48856J060248J238405J215041J531064
707.7E46036541K088488K250850K086282K149403K517283K619445K281666K156555
724E64186513K538920K695680K230763J852035K056003K199292J694799J254678J602947
742.4E82311630K201081K093553J597583J766742K384722K361834J853645J957476
758.7E98528266K603233K674222K033591J840413K317309K319753J405537O51837P31408
777.1F15105569O28591l68893j093030n67377K02835L42250P70211K426743M318238
795.4F21765137N132615N511821O489813P248759O548822N133987M621028M770756
811.7F67222738L950119K270878J391887J289308L28303j558066k803385l065288l526390
$$ y = [536800206, 537990749, 539078474, 539848626, 540342927, 540991783, 542052031, 543290436, 544505477, 546036541, 548125029, 550375879, 552462161, 554611564, 557128847, 559748292, 562029958, 564186513, 566725433, 569421113, 571651876, 573503911, 575559914, 577759206, 579454005, 580708683, 582311630, 584512711, 586606264, 588203847, 589970589, 592355311, 594717145, 596570790, 598528266, 601131499, 603805721, 605839312, 607679725, 609997034, 612316787, 613722324, 614374161, 615105569, 615734160, 615365267, 614272237, 613704860, 613907695, 614249945, 615020156, 617446899, 621765137, 626897752, 632409573, 638899386, 646148145, 652696967, 657830954, 662451982, 667222738, 671172857, 673443735, 674835622, 676124930, 676453233, 674895167, 672091782, 669026494, 665500104]
830.1F65500104m545033m944920m266799l742039m133820m479885l871561k795517
846.4F32720530j786888p3671K943218O176591Q266389R285748J0212243J0983526
862.7F78727686J0564506R116829P906258P141888N960584M347741L244937K852499
879.1G29862928K179325P76887m09246p50899r60946j563549j748562q04961N56529
897.4G27137506J308858J562953J993537K394975J968979P87855k73228j055658k184272
915.8G33641505l620207m476786m217207l273010k222836r54688O93023J983881K094031
934.1G19647706J494646J262068J393915J074493K71201k56956m37021j124859k570510
952.5G20754683l904819m700959n780995p684052r729803j1384725j3178826j5522003
$$ y = [665500104, 660955071, 656010151, 651743352, 648001313, 643867493, 639387608, 635516047, 632720530, 630933642, 630859971, 633803189, 639979780, 648246169, 657531917, 667744160, 678727686, 689292192, 698409021, 706315279, 713457167, 719417751, 723765492, 727010429, 729862928, 732042253, 732819140, 732409894, 731658995, 730698049, 729134500, 727385938, 726580977, 727137506, 728446364, 730009317, 732002854, 734397829, 736366808, 737154663, 736881435, 735825777, 733641505, 730021298, 725544512, 721327305, 718054295, 715831459, 714876771, 715569794, 717553675, 719647706, 721142352, 722404420, 723798335, 724872828, 725144029, 724887073, 724450052, 723325193, 720754683, 716849864, 712148905, 706367910, 698683858, 688954055, 677569330, 664390504, 648868501]
968.8F48868501j7399847j7512203j6125083j4360368j2638807j0998190r390175p696271
985.1E42747557o467402n864262n178094m462898m000664l351629k381861j731217
1001.4E09309530j867413k546788l457546m705250o252408p411391p668793p380903
1017.7D68019038p123559o900341o399631n777836n447388n276233m847645m207820
1034.1D22038585l683180l365785l003001k512634k277880k519072k816706k666921
1050.4C99193406k077907j195908J8448J466781K465248K212822P76232j147151l152878
1068.7C98559093n059093o476253p113099p241398p368118p400214o883800n972684
1085C45044434n326539n116016m855275m058629k759695j405388k81871N62847J046240
$$ y = [648868501, 631468654, 613956451, 597831368, 583471000, 570832193, 559834003, 550443828, 542747557, 536280155, 530415893, 525237799, 520774901, 516774237, 513422608, 511040747, 509309530, 507442117, 504895329, 501437783, 496732533, 490480125, 483068734, 475399941, 468019038, 460895479, 453995138, 447595507, 441817671, 436370283, 431094050, 426246405, 422038585, 418355405, 414989620, 411986619, 409473985, 407196105, 404677033, 401860327, 399193406, 397115499, 395919591, 395938039, 397404820, 399870068, 402082890, 402859122, 401711971, 398559093, 393500000, 387023747, 379910648, 372669250, 365301132, 357900918, 351017118, 345044434, 339717895, 334601879, 329746604, 325687975, 322928280, 321522892, 321241021, 321803868, 322850108]
1103.4C22850108J063973Q05139O06150N02974J64747p72417k438068m518181n576968
1121.8C12687457l802538q315K586514K512186Q24541n83827j99825J531422K891839
1140.1C18439454L143459K754957K296775J987756J845419J930267K296537K900422
1156.4C37595046L759533N025178O741285Q661777J0385662J1576146J2141139J2127876
1172.7D08013642J1617809J0797352R928733R029120P863909O337643M533827K585084
1189.1D70707119O96718q01295j553178j311779j39922J524061L159136M371434M884750
1207.4D81537044M584909L707349K758026K126604J844228J716286J653879J730949
1223.7E01659274J944065K154172K325117K536178K762377K896607K886534K813697
$$ y = [322850108, 323914081, 324719220, 325325370, 325828344, 325993091, 325220674, 322782606, 318264425, 312687457, 308884919, 308876604, 311463118, 313975304, 314799845, 314216018, 314016193, 315547615, 318439454, 321582913, 324337870, 326634645, 328622401, 330467820, 332398087, 334694624, 337595046, 341354579, 346379757, 353121042, 361782819, 372168481, 383744627, 395885766, 408013642, 419631451, 430428803, 440357536, 449386656, 457250565, 463588208, 468122035, 470707119, 471403837, 470602542, 469049364, 467737585, 467597663, 469121724, 472280860, 476652294, 481537044, 486121953, 489829302, 492587328, 494713932, 496558160, 498274446, 499928325, 501659274, 503603339, 505757511, 508082628, 510618806, 513381183, 516277790, 519164324, 521978021]
1240.1E21978021K718866K442061J927674J402796J051724Q09788O10352O64234J157939
1258.4E34763455J888216K577484L257095M101813M956484N490184N733192N979180
1274.7E68747103O268382O350339O234228O215632O410241O623209O587326O342292
1291F19778752O083131N711198N081773M399001L898740L485084K971887K456725K164543
1309.4F56030834J975774J632154J273692J208663J321674J346051J326204J397371
1325.7F67512417J454770J249493P53641K37763q941q8692k54929k86519N7518M28021
1346.1F71054542N06580M16636K94090R8824j99914m75585p14839j115441j603723
1364.5F68261170j840710j882971j816630j908660k488017l262699m723072p630169
$$ y = [521978021, 524696887, 527138948, 529066622, 530469418, 531521142, 532330930, 532941282, 533605516, 534763455, 536651671, 539229155, 542486250, 546588063, 551544547, 557034731, 562767923, 568747103, 575015485, 581365824, 587600052, 593815684, 600225925, 606849134, 613436460, 619778752, 625861883, 631573081, 636654854, 641053855, 644952595, 648437679, 651409566, 653866291, 656030834, 658006608, 659638762, 660912454, 662121117, 663442791, 664788842, 666115046, 667512417, 668967187, 670216680, 670970321, 671208084, 671199143, 671110451, 670855522, 670569003, 670626521, 671054542, 671561122, 671977758, 672271848, 672370672, 672170758, 671695173, 670980334, 669864893, 668261170, 666420460, 664537489, 662720859, 660812199, 658324182, 655061483, 650338411, 642708242]
1380.8F42708242q882701m356504K541304M596054K378702M63844p38800j681983k551735
1399.1F34476423l225982l550708l843069l781975l374159l001273k512335j785100
1415.5F09401822j335204j468241j340151q49187n55933l96609l32415j05500M69088
1433.8F03487670J033605J259923J421272J895428K252698K533615L060758L644526
1450.1F20589495M139960M925370O992876Q598507P206440O593287P437586P651389
1466.4F74134910P224202P931292R365082Q673370O566763N057216M028380L252148
1482.8G26233363K425373J529395L70205r03547j494586j918734k995431l827691l780782
1501.1G15637565l463805m267633o914914p204473o148576n893648n421758m611969
$$ y = [642708242, 633825541, 629469037, 632010341, 636606395, 638985097, 639448941, 638710141, 637028158, 634476423, 631250441, 627699733, 623856664, 620074689, 616700530, 613699257, 611186922, 609401822, 608066618, 606598377, 605258226, 604409039, 603853106, 603456497, 603124082, 603018582, 603487670, 604521275, 605781198, 607202470, 609097898, 611350596, 613884211, 616944969, 620589495, 624729455, 629654825, 636647701, 645246208, 652452648, 659045935, 666483521, 674134910, 681359112, 689290404, 698655486, 707328856, 713895619, 718952835, 722981215, 726233363, 728658736, 730188131, 730558336, 729654789, 728160203, 726241469, 723246038, 719418347, 715637565, 712173760, 707906127, 700991213, 693786740, 687638164, 681744516, 676322758, 671710789]
1517.4F71710789l841102m063427m274905l855229l813564l474772l122390l265976
1533.7F41999424k744735j876771k053738k469540j957774j333177o06417J24335P42435
1552.1F29824042J203776J506924J299322j81079j132011j373589j742542k517998
1568.4F26886845l795147m242361m783571o710708p226586o825447p279515p659555
1584.7E78363955p924080q181810q314550q219481q155703q017779p719218p472933
1601.1E14358401p338702p197500p127344p236302p110745o658494o944657p830649
1617.4D56914008o654621n677461o162226n972535n336731m792452l665477k716422
1633.7D15936083k536625j840860p01695K74896J151920K060175K637952K611041L555656
$$ y = [671710789, 667869687, 663806260, 659531355, 655676126, 651862562, 648387790, 645265400, 641999424, 639254689, 637377918, 635324180, 632854640, 630896866, 629563689, 628957272, 629081607, 629824042, 631027818, 632534742, 633834064, 633652985, 632520974, 631147385, 629404843, 626886845, 623091698, 618849337, 614065766, 607355058, 600128472, 593303025, 586023510, 578363955, 570439875, 562258065, 553943515, 545724034, 537568331, 529550552, 521831334, 514358401, 507019699, 499822199, 492694855, 485458553, 478347808, 471689314, 464744657, 456914008, 450259387, 444581926, 438419700, 432447165, 427110434, 422317982, 418652505, 415936083, 413399458, 411558598, 410856903, 411131799, 412283719, 414343894, 416981846, 419592887, 423148543]
1652D23148543N038350M386902M407078N665005P020562P596612P344842Q311093R533435
1670.4D82452422Q911640R373545J0408938R823859R561122J0975718J3493180J2070239
1686.7E67070663J0225892J0750532J0571838J1590421J2598514J2457788J3577819
1701F48843467J1379421R546340R481787Q359313P484436O986261O713867O749153
1717.3G15544045N703211M361868M144728M355550M294097M185379M023552M343330
1733.6G50955760M025162L167212L392875L798962L890454L934622L906906L889322
1749.9G80961275L691673L134609K871751K837301K733111K498388J980901J875401
1766.3H02584410K131879K085984J664519J273036J265645J430154J327097J164496
$$ y = [423148543, 428186893, 432573795, 436980873, 442645878, 449666440, 457263052, 464607894, 472918987, 482452422, 491364062, 500737607, 511146545, 520970404, 530531526, 541507244, 555000424, 567070663, 577296555, 588047087, 598618925, 610209346, 622807860, 635265648, 648843467, 660222888, 669769228, 679251015, 687610328, 695094764, 702081025, 708794892, 715544045, 721247256, 725609124, 729753852, 734109402, 738403499, 742588878, 746612430, 750955760, 754980922, 758148134, 761541009, 765339971, 769230425, 773165047, 777071953, 780961275, 784652948, 787787557, 790659308, 793496609, 796229720, 798728108, 800709009, 802584410, 804716289, 806802273, 808466792, 809739828, 811005473, 812435627, 813762724, 814927220]
1782.6H14927220J279176J346707J268983J294494J270234R69350Q21889Q80182R45568
1800.9H25003803Q55446O88970O66022P94828Q12590N69463M39823N68509P16626O89805
1821.3H31805885O31928O40512O98268O16133K92898K16722L95000M44889M17352N61118
1841.7H36720705O63340L90291Q7858J33931L28183L81589K96116K51353L23892L61442
1862.1H39938700L55780M22120M19975J67489k9445L7611J73270K35856K00450J77980
1882.5H42099786K38418K72751J84775Q3267J25945J69635O5803J0670J15215J62721
1902.9H43528986Q7202O3002J14441R6321K2411P1168J88053J29580l0458q3685l6716
1925.3H44150305K0265j2993o0380N126N3048k8670q6188l7134n1677j65284k31564
$$ y = [814927220, 816206396, 817553103, 818822086, 820116580, 821386814, 822356164, 823178053, 824058235, 825003803, 825859249, 826548219, 827214241, 828009069, 828821659, 829391122, 829830945, 830399454, 831116080, 831805885, 832437813, 833078325, 833776593, 834392726, 834685624, 834902346, 835297346, 835742235, 836159587, 836720705, 837384045, 837774336, 837862194, 837996125, 838324308, 838705897, 839002013, 839253366, 839577258, 839938700, 840294480, 840716600, 841136575, 841304064, 841274619, 841312230, 841485500, 841721356, 841921806, 842099786, 842338204, 842610955, 842795730, 842878997, 843004942, 843174577, 843240380, 843251050, 843366265, 843528986, 843616188, 843679190, 843793631, 843889952, 843912363, 843983531, 844171584, 844301164, 844270706, 844187021, 844150305, 844170570, 844157577, 844097197, 844102323, 844155371, 844126701, 844040513, 844003379, 843951702, 843786418, 843554854]
1947.8H43554854j44898j6392q4817k35260k00093q4102j24216j90854j21116o6758
1968.2H42286348j69992k76685k08378r0778j23560k26259j63377k9802p3492k05696
1988.6H40718329j87516j15097j97470l20017k88785j45018j26839k56419l07619j98365
2009H38575184j33335k36392l20256k51889k00749l04579l60430k50280j75476k57253
2029.4H36084545l03269k02715j33515k22504l35991k89977j74999k10464l41713l13282
2049.8H33556116j74761j85311l00050k71201j37806j29163k41220k64645j44422j03950
2070.2H31603587j91808j94371q3983o7532j57058j70112q0585m8697j38521j83940
2090.5H30286980r2686n364o6936j31726m2260M3213m1365j35660n1201L6419m4585
$$ y = [843554854, 843409956, 843393564, 843308747, 843073487, 842873394, 842789292, 842665076, 842474222, 842353106, 842286348, 842116356, 841839671, 841631293, 841540515, 841416955, 841190696, 841027319, 840997517, 840924025, 840718329, 840530813, 840415716, 840218246, 839898229, 839609444, 839464426, 839337587, 839081168, 838773549, 838575184, 838441849, 838205457, 837885201, 837633312, 837432563, 837127984, 836767554, 836517274, 836341798, 836084545, 835781276, 835578561, 835445046, 835222542, 834886551, 834596574, 834421575, 834211111, 833869398, 833556116, 833381355, 833196044, 832895994, 832624793, 832486987, 832357824, 832116604, 831851959, 831707537, 831603587, 831411779, 831217408, 831133425, 831065893, 830908835, 830738723, 830658138, 830609441, 830470920, 830286980, 830194294, 830188930, 830121994, 829990268, 829948008, 829991221, 829949856, 829814196, 829762995, 829799414, 829754829]
2113H29754829j37984m8042R4951O6936l6061L040J16944R0599k4140L636J30117J18434
2137.5H30133259L2485M2856R0956O0380o080L7134J56581J41740J4544K3663J58965
2159.9H30886483J64986L4451K2590J47641J80185Q3864N0187J43707J57177L0399
2180.3H31901670j3948R0003J57952P9930j013M5895R9838M0829j9967M8101J18375
2202.7H32547665L0338p1108L58J11699O8605l7313j3947Q6784M0770r8110n2690P8678
2227.2H32691729K9504q8513p3492K2471J5378j07467j32859o616M5597p0691j45197
2249.6H32179844m8935L4749l4928r9242l4570J5735k4736o854Q5235J02579J6511
2272.1H32185388n0784m053N7280L9578K9147P5936J33574J67191J35481J24693K00391
$$ y = [829754829, 829616845, 829568803, 829663754, 829730690, 829694629, 829697669, 829814613, 829905212, 829881072, 829884708, 830014825, 830133259, 830165744, 830208600, 830299556, 830359936, 830353856, 830390990, 830547571, 830689311, 830703855, 830727518, 830886483, 831051469, 831085920, 831108510, 831256151, 831436336, 831520200, 831570387, 831714094, 831871271, 831901670, 831887722, 831977725, 832135677, 832215607, 832214594, 832260489, 832360327, 832401156, 832381189, 832429290, 832547665, 832578003, 832506895, 832507253, 832618952, 832687557, 832650244, 832636297, 832723081, 832763851, 832665741, 832613051, 832691729, 832721233, 832632720, 832559228, 832581699, 832597077, 832489610, 832356751, 832350135, 832395732, 832325041, 832179844, 832130909, 832165658, 832130730, 832031488, 831996918, 832012653, 831987917, 831981063, 832066298, 832168877, 832185388, 832134604, 832130551, 832187831, 832227409, 832256556, 832332492, 832466066, 832633257, 832768738, 832893431, 833093822]
2294.5H33093822K03550J26958J38163K29180K75314K75135K92659L24786L22997K81036
2314.9H35563600L12448M80175N91874M67837L22461L34978L71575K86818J60753J63913
2335.3H39056432J97590J68085J70707P9632k90155m34816k742O42836J005233R20176
2355.7H41512978O86884L65853J7047j75357k03907l06845m98175o06418n17428l38912
2376.1H39935720l12567l66688k86579r0956M7981O9440Q4400J54734J77741J09791
2396.5H39523017N7400J05679J36673L9220k9862M3750J41799J02938o020J2993P4625
2418.9H40202212J20j33753j43230K0921J42634O4850n841N0485Q1956P212n1796J3172
2443.4H40248942O2883k6941j13189n8532K0921j9133p6115k3603L6835j4484r6559
$$ y = [833093822, 833297372, 833424330, 833562493, 833791673, 834066987, 834342122, 834634781, 834959567, 835282564, 835563600, 835876048, 836356223, 836948097, 837415934, 837738395, 838073373, 838444948, 838731766, 838892519, 839056432, 839254022, 839422107, 839592814, 839672446, 839382291, 838947475, 838944733, 839587569, 840592802, 841512978, 842199862, 842565715, 842582762, 842407405, 842203498, 841896653, 841398478, 840792060, 840274632, 839935720, 839623153, 839256465, 838969886, 838878930, 838926911, 838996351, 839080751, 839235485, 839413226, 839523017, 839580417, 839686096, 839822769, 839861989, 839832127, 839875877, 840017676, 840120614, 840114594, 840127587, 840202212, 840202332, 840068579, 839925349, 839946270, 840088904, 840153754, 840147913, 840198398, 840280354, 840287566, 840235770, 840248942, 840311825, 840284884, 840171695, 840113163, 840134084, 840114951, 840038836, 840015233, 840052068, 840037584, 839941025]
2465.8H39941025q4341m0471p4745j23262r1672l9995o5207j19567j12712n4479l4273
2488.3H39100301p9095r7275n8830m3451r1613j10328o0856n5492j06216j47402j35064
2510.7H38114679p7129p1823j23501j30236r6023q6487r4831j11222j17779j11162
2531.1H37094486j42336j66297j17362p1644j03414j59860j42217o6995n9367j15513
2551.5H35949481j55151j77563j76847j59382j41621j20819j36852j98901k43187k30610
2571.9H34208548j99795k02238k22385k49446k69413k67744k99096l42369l08454k58386
2592.3H31589222k87771l37065l58462l86357m34995m54783l99113l59058m19856m82499
2612.7H27669263m72903m36724m29809m68194m71354m02927l83794m92394n71967m85241
$$ y = [839941025, 839856684, 839816213, 839741468, 839618206, 839526534, 839486539, 839421332, 839301765, 839189053, 839134574, 839100301, 839021206, 838923931, 838865101, 838821650, 838730037, 838619709, 838558853, 838503361, 838397145, 838249743, 838114679, 838037550, 837965727, 837842226, 837711990, 837615967, 837529480, 837434649, 837323427, 837205648, 837094486, 836952150, 836785853, 836668491, 836596847, 836493433, 836333573, 836191356, 836124361, 836064994, 835949481, 835794330, 835616767, 835439920, 835280538, 835138917, 835018098, 834881246, 834682345, 834439158, 834208548, 834008753, 833806515, 833584130, 833334684, 833065271, 832797527, 832498431, 832156062, 831847608, 831589222, 831301451, 830964386, 830605924, 830219567, 829784572, 829329789, 828930676, 828571618, 828151762, 827669263, 827196360, 826759636, 826329827, 825861633, 825390279, 824987352, 824603558, 824111164, 823539197, 823053956]
2633.1H23053956l90768m36068n01930m66109m15861m38214m94837n24581m83215m37438
2653.5H18464935m61400m74095m44174m38690m74453n04673m67121m15802m56810n17130
2673.9H13810587m71234m23789m95494n87463n70059m77850m61281n26249n59807n35786
2694.3H08701575n14269n31912n64396n59688n31256n62728o17146o03676n76138o14882
2714.6H03025484o72281o64711o33835o37413o36100o09994n91100o14345o61909o46174
2735G96657622n73814n60165o36816o71327n80907n12957n93543o91950o82950o49035
2755.4G90504158o78719p26878p12156o83487p27296p99239q10861p58469p57694q59917
2775.8G82989442r16123q49426q27551r33170r87351r18329r16779j047551j133383
$$ y = [823053956, 822663188, 822227120, 821725190, 821259081, 820843220, 820405006, 819910169, 819385588, 818902373, 818464935, 818003535, 817529440, 817085266, 816646576, 816172123, 815667450, 815200329, 814784527, 814327717, 813810587, 813339353, 812915564, 812420070, 811832607, 811262548, 810784698, 810323417, 809797168, 809237361, 808701575, 808187306, 807655394, 807090998, 806531310, 806000054, 805437326, 804820180, 804216504, 803640366, 803025484, 802353203, 801688492, 801054657, 800417244, 799781144, 799171150, 798580050, 797965705, 797303796, 796657622, 796083808, 795523643, 794886827, 794215500, 793634593, 793121636, 792528093, 791836143, 791153193, 790504158, 789825439, 789098561, 788386405, 787702918, 786975622, 786176383, 785365522, 784607053, 783849359, 782989442, 782073319, 781223893, 780396342, 779463172, 778475821, 777557492, 776640713, 775593162, 774459779]
2794.2G74459779j083791j034677j105785j199901j228571j208365j199842j297593
2810.5G65101254j404047j373112j335562j418709j507163j524270j542985j616955
2826.8G53378451j726151j823544j910508k066016k371371k816200l353894l996253
2843.1G33314514m652917m934132m476846l402471k240956j433253j017094r46999
2859.5G10209846j208126j636028k077878k468049k702058k643108k357125k082050
2875.8F93035424j877964j724422j654446j658678j760542j963675k147019k218247
2892.1F78030431k240002k314329k426803k483845k537548k713919k968669l278494
2908.4F57066822l739536m317641m725158m644156m098236l413558k728880j978218
$$ y = [774459779, 773375988, 772341311, 771235526, 770035625, 768807054, 767598689, 766398847, 765101254, 763697207, 762324095, 760988533, 759569824, 758062661, 756538391, 754995406, 753378451, 751652300, 749828756, 747918248, 745852232, 743480861, 740664661, 737310767, 733314514, 728661597, 723727465, 719250619, 715848148, 713607192, 712173939, 711156845, 710209846, 709001720, 707365692, 705287814, 702819765, 700117707, 697474599, 695117474, 693035424, 691157460, 689433038, 687778592, 686119914, 684359372, 682395697, 680248678, 678030431, 675790429, 673476100, 671049297, 668565452, 666027904, 663313985, 660345316, 657066822, 653327286, 649009645, 644284487, 639640331, 635542095, 632128537, 629399657, 627421439]
2924.7F27421439j247347o75559k33888K80439R33767J522362J934767K258420K467632
2943.1F34662032K297402J715481J075983N94556J91510j32918k25366o1690K05516
2961.4F40322506M04180N03361N94258O79553O79791N82218M96208N51582O34670N40793
2981.8F45989120M36246N02229N08785L59834J52349j10865l66091o73890j006484
3000.2F45791233j152933j217604j319468j340866j284957j339078j571953j809359
3016.5F34755015j889348j869499j889646j995802k094567k082408k058386k129019
3032.8F18746340k271950k352357k276003k281189k469838k603829k623141k617657
3049.1E99250376k629697k652645k672911k737462k765298k644301k514422k514064
$$ y = [627421439, 626174092, 625498533, 625264645, 625545084, 626478851, 628001213, 629935980, 632194400, 634662032, 636959434, 638674915, 639750898, 640345454, 640536964, 640404046, 640178680, 640116990, 640322506, 640726686, 641230047, 641824305, 642503858, 643183649, 643765867, 644262075, 644813657, 645448327, 645989120, 646425366, 646927595, 647436380, 647796214, 647948563, 647837698, 647471607, 646797717, 645791233, 644638300, 643420696, 642101228, 640760362, 639475405, 638136327, 636564374, 634755015, 632865667, 630996168, 629106522, 627110720, 625016153, 622933745, 620875359, 618746340, 616474390, 614122033, 611846030, 609564841, 607095003, 604491174, 601868033, 599250376, 596620679, 593968034, 591295123, 588557661, 585792363, 583148062, 580633640, 578119576]
3065.5E78119576k576530k618611k613664k564847k481937k395630k462149k664268
3081.8E57741940k749205k708852k660096k631723k689302k796293k804935k709269
3098.1E35992265k720475k897382k967835k843916k813459k979993l041625k924979
3114.4E12802601k929747l108800l309130l422797l392160l321052l305345l337384
3130.7D86676186l394365l421366l394962l402233l529906l616661l562689l513038
3147D58840966l477365l465801l598541l770381l785521l714860l685563l711939l760040
3165.4D25870955l770947l735841l701210l706604l719688l705948l667832l651946
3181.7C96210939l657520l616929l564149l562868l586143l565222l485590l426582
$$ y = [578119576, 575543046, 572924435, 570310771, 567745924, 565263987, 562868357, 560406208, 557741940, 554992735, 552283883, 549623787, 546992064, 544302762, 541506469, 538701534, 535992265, 533271790, 530374408, 527406573, 524562657, 521749198, 518769205, 515727580, 512802601, 509872854, 506764054, 503454924, 500032127, 496639967, 493318915, 490013570, 486676186, 483281821, 479860455, 476465493, 473063260, 469533354, 465916693, 462354004, 458840966, 455363601, 451897800, 448299259, 444528878, 440743357, 437028497, 433342934, 429630995, 425870955, 422100008, 418364167, 414662957, 410956353, 407236665, 403530717, 399862885, 396210939, 392553419, 388936490, 385372341, 381809473, 378223330, 374658108, 371172518, 367745936]
3198C67745936l411084l355414l254712l171563l151476l148556l098995l037452l000617
3216.4C39116067k979487k932072k877116k848328k806752k712816k592445k533972
3232.7C16833079k576381k583772k466351k367556k326399k237827k175122k222300
3249B97877371k233296k129853k047211k047807k046138j996815j956910j963645j936168
3267.4B79519528j856565j873583j975357j994223j926988j880169j876146j869231
3283.7B64267266j819700j753599j715839j736968j801789j838982j849294j833543
3300B49917552j764745j671046j651600j772180j923188j955897j865044j754195j725092
3318.4B33834565j726747j639813j567915j629487j702100j672700j567185j437664
$$ y = [367745936, 364334852, 360979438, 357724726, 354553163, 351401687, 348253131, 345154136, 342116684, 339116067, 336136580, 333204508, 330327392, 327479064, 324672312, 321959496, 319367051, 316833079, 314256698, 311672926, 309206575, 306839019, 304512620, 302274793, 300099671, 297877371, 295644075, 293514222, 291467011, 289419204, 287373066, 285376251, 283419341, 281455696, 279519528, 277662963, 275789380, 273814023, 271819800, 269892812, 268012643, 266136497, 264267266, 262447566, 260693967, 258978128, 257241160, 255439371, 253600389, 251751095, 249917552, 248152807, 246481761, 244830161, 243057981, 241134793, 239178896, 237313852, 235559657, 233834565, 232107818, 230468005, 228900090, 227270603, 225568503, 223895803, 222328618, 220890954]
3334.7B20890954j384124j456723j524463j480028j417637j350790j216591j200094
3351B09860504j336813j358494j201377j055270j017109j007214q99851p63566q19280
3369.3B00401530j001403r84415p49365n98207n80356n58868m38377k53171n8233J22234
3389.7A95301369N3793k09495j70544K19583M29377J63138j58205L12L76970N35175
3410.1A96541473M88580L59118L33324N34042P35209P62641Q39010J035407J153827
3428.5B02782631J131087J224697J390159J246393R51588R45136J225337J520664J685709
3446.8B14103401J665294J626208J729101J883805K009675K076432K011865K060250
3463.2B29166031K375603K547830K274543J864210J907244K295554K587870K600178
$$ y = [220890954, 219506830, 218050107, 216525644, 215045616, 213627979, 212277189, 211060598, 209860504, 208523691, 207165197, 205963820, 204908550, 203891441, 202884227, 201984376, 201220810, 200401530, 199400127, 198415712, 197666347, 197068140, 196487784, 195928916, 195490539, 195237368, 195179135, 195301369, 195355162, 195145667, 194975123, 195194706, 195624083, 195787221, 195629016, 195629328, 196006298, 196541473, 197030053, 197389171, 197722495, 198256537, 198991746, 199754387, 200593397, 201628804, 202782631, 203913718, 205138415, 206528574, 207774967, 208726555, 209671691, 210897028, 212417692, 214103401, 215768695, 217394903, 219124004, 221007809, 223017484, 225093916, 227105781, 229166031, 231541634, 234089464, 236364007, 238228217, 240135461, 242431015, 245018885, 247619063]
3479.5B47619063K407998K413809K638072K686143K663195K805769K935767K992928
3495.8B69162744K933801K914458L078699L055960K824336K893120L276229L578633
3512.1B93717980L545016L316075L298342L553987L872573L851325L590822L602117
3528.4C22348237L805578L983289M217028M325241M170150M203081M451930M550487
3544.7C56055021M395634M262328M401684M642725M706383M739612M955709N108685
3561.1C93267781M989504M986436N507886N762786N410730N272419N541950N837053
3577.4D36576545O034881O166339O165475O184786O407172O452471O158828O303758
3593.7D86450255O761372O879330O799996O797552O740689O670892O967843P189274
$$ y = [247619063, 250027061, 252440870, 255078942, 257765085, 260428280, 263234049, 266169816, 269162744, 272096545, 275011003, 278089702, 281145662, 283969998, 286863118, 290139347, 293717980, 297262996, 300579071, 303877413, 307431400, 311303973, 315155298, 318746120, 322348237, 326153815, 330137104, 334354132, 338679373, 342849523, 347052604, 351504534, 356055021, 360450655, 364712983, 369114667, 373757392, 378463775, 383203387, 388159096, 393267781, 398257285, 403243721, 408751607, 414514393, 419925123, 425197542, 430739492, 436576545, 442611426, 448777765, 454943240, 461128026, 467535198, 473987669, 480146497, 486450255, 493211627, 500090957, 506890953, 513688505, 520429194, 527100086, 534067929, 541257203]
3610E41257203P111787P137359P019877P136941P486403P022262O423950O451905P340610
3628.4F04388297P753789O676316O240130O338000O253064O211400O093323N830407
3644.7F55784726N899727O493509O272674M948676M445493M961610M874289M282176
3661F97962880M049897L970683L818929L863156L832996L269493L166438L082871K493143
3679.4G29510486K386689K608121K730131K921998K834976K096474J625777J649260
3695.7G48363912J683176J650333J668274J552701J389027J449227J508713J335740
3712G60601103J040519R02474J029312J150131J063466Q78036P77483Q16942R35375
3730.3G69194841J122892J089335P79569N39422L79086L86238P29560Q61586O19530
$$ y = [541257203, 548368990, 555506349, 562526226, 569663167, 577149570, 584171832, 590595782, 597047687, 604388297, 612142086, 618818402, 625058532, 631396532, 637649596, 643860996, 649954319, 655784726, 661684453, 668177962, 674450636, 679399312, 683844805, 688806415, 693680704, 697962880, 702012777, 705983460, 709802389, 713665545, 717498541, 720768034, 723934472, 727017343, 729510486, 731897175, 734505296, 737235427, 740157425, 742992401, 745088875, 746714652, 748363912, 750047088, 751697421, 753365695, 754918396, 756307423, 757756650, 759265363, 760601103, 761641622, 762544096, 763573408, 764723539, 765787005, 766665041, 767442524, 768259466, 769194841, 770317733, 771407068, 772186637, 772726059, 773105145, 773491383, 774220943, 775082529, 775702059]
3748.7G75702059N49913N09202M52459M43578L78847L48568M36246N66662N33759L78132
3769.1G80299425K93374K77996L72648N25237N24819L37660K06411K07901K33590K99037
3789.5G83578098L59714L90768N01096M90248K94149L05176L13997J87099J85073J49607
3809.9G86755025J85430L64900N17726M13060K03908J13666o5565m8876J67608K41041
3830.3G88847923L01600M00781L46423J33037n3167p7963M17N7221J14023J81318K64167
3852.7G90515780K67625O8009l8147j728R8943K02954J36614P0512J05024J5199o8784
3875.2G91372001l7074J51515K94507J28984k38l8982m2140M77p1466n5850J57297
3897.6G91859031K90334J70827k8908j52707j82570j30832n7161N8353J96815J69933
$$ y = [775702059, 776251972, 776761174, 777213633, 777657211, 778036058, 778384626, 778820872, 779387534, 779921293, 780299425, 780592799, 780870795, 781243443, 781768680, 782293499, 782631159, 782837570, 783045471, 783279061, 783578098, 783937812, 784328580, 784829676, 785319924, 785614073, 785919249, 786233246, 786420345, 786605418, 786755025, 786940455, 787305355, 787823081, 788236141, 788440049, 788553715, 788488150, 788439274, 788606882, 788847923, 789149523, 789550304, 789896727, 790029764, 789976597, 789898634, 789899051, 789956272, 790070295, 790251613, 790515780, 790783405, 790851414, 790813267, 790811539, 790910482, 791113436, 791250050, 791320562, 791425586, 791440785, 791372001, 791334927, 791486442, 791780949, 791909933, 791909695, 791870713, 791828573, 791829050, 791757584, 791701734, 791859031, 792149365, 792320192, 792291284, 792138577, 791956007, 791825175, 791768014, 791826367, 792023182, 792193115]
3918G92193115o616r3758m3512p808k2352M6015J77026J38163l9458o8843K9266N1736
3942.5G92352974K5273P8559R1672j192j5319K9624N0783Q1897Q7082Q7500J18911
3964.9G92987764R4294K3365J3352O1810R3102R8646J14620J45912J55330Q5830P928
3987.3G93881953L9220P9393M4703N8532J55151
3997.5G94258952
$$ y = [792193115, 792186499, 792092741, 792049229, 792041421, 792019069, 792065084, 792242110, 792380273, 792340815, 792271972, 792301238, 792352974, 792378247, 792456806, 792548478, 792547286, 792531967, 792561591, 792612374, 792694271, 792781353, 792868853, 792987764, 793082058, 793105423, 793118775, 793180585, 793273687, 793372333, 793486953, 793632865, 793788195, 793874025, 793881953, 793921173, 794000566, 794045269, 794103801, 794258952]
##END=$$ End of the data block
