##TITLE=$$ Begin of the data block
##JCAMP-DX=5.00 $$ ACD/SpecManager v 10.08
##SPECTROMETER/DATA SYSTEM=Alpha
##DATE=15 Apr 2014 09:00:42
##DATA TYPE=INFRARED SPECTRUM
##DATA CLASS=XYDATA
##ORIGIN=
##OWNER=
##NPOINTS=1765
##FIRSTX=399.75695801
##LASTX=3997.56933594
##MAXX=3997.56933594
##MINX=399.75695801
##MAXY=0.84465253
##MINY=0.19510686
##XFACTOR=1.0000000000
##YFACTOR=1.000000000000000e-9
##FIRSTY=0.58669466
##DELTAX=2.03957629
##XUNITS=1/CM
##YUNITS=ARBITRARY UNITS
##XYDATA=(X++(Y..Y))
$$ plain form
399.8 586694658 584210455 582885563 581335187 578617096 576696694 576545238 576059461 574782610 574424088
418.1 574424088 574567258 573286891 571133077 569872677 569854856 569582582 568319738 566999674 566223919
436.5 566223919 565483034 564612329 564344764 564801395 564829528 563944340 563120723 562873304 562565446 561705470
456.9 561705470 560566366 559779704 559147716 558125615 557153404 556662321 555906951 554455936 553074002
475.2 553074002 552172661 551405966 550484955 549482763 548811913 548568487 548138022 547013342 545487165
493.6 545487165 544195414 543189704 542108595 540843427 539649010 538621187 537352324 535865068
509.9 535865068 534711242 533771992 532455206 530786932 529229760 527843058 526286364 524357617 522488832
528.3 522488832 520994008 519375384 517376304 515679300 514828503 514237225 513157368 511921167 511149228
$$ packed form
399.8E86694658k484203j324892j550376k718091j920402j51456m85777j276851l58522
418.1E74424088J43170j280367k153814j260400j7821k72274j262844j320064p75755
436.5E66223919p40885q70705k67565M56631K8133q85188q23617k47419l07858q59976
456.9E61705470j139104p86662o31988j022101r72211m91083p55370j451015j381934
475.2E53074002r01341p66695r21011j002192o70850k43426m30465j124680j526177
493.6E45487165j291751j005710j081109j265168j194417j027823j268863j487256
509.9E35865068j153826r39250j316786j668274j557172j386702j556694j928747j868785
528.3E22488832j494824j618624j999080j697004q50797n91278j079857j236201p71939
$$ plain form
546.6 511149228 510332823 508758128 507027745 505904555 504822612 502961040 500748038 498831153 496742278
565 496742278 493854672 490548372 487526298 484793484 481963485 479067057 476585746 474404633 471859485
583.3 471859485 468963891 466354698 464044213 461311430 458084792 455210418 452909559 450228333
599.6 450228333 446618259 443028837 440591663 439119428 437889636 436664283 435734004 435601383 436762124
618 436762124 439401895 443016052 446742862 450038075 453207701 456775129 460781425 464838594 468633652
636.3 468633652 471987873 474459916 475701153 476656139 478996038 482502818 485106081 485422671 484307528
654.7 484307528 484966964 489733696 496672124 502591252 506771207 510758698 515014768 517789602 520218432
673.1 520218432 523084342 525889337 528356075 530578434 532646179 534533024 536153197 537473857
$$ packed form
546.6E11149228q16405j574695j730383j123190j081943j861572k213002j916885k088875
565D96742278k887606l306300l022074k732814k829999k896428k481311k181113k545148
583.3D71859485k895594k609193k310485k732783l226638k874374k300859k681226
599.6D50228333l610074l589422k437174j472235j229792j225353r30279j32621J160741
618D36762124K639771L614157L726810L295213L169626L567428M006296M057169L795058
636.3D68633652L354221K472043J241237R54986K339899L506780K603263L16590j115143
654.7D84307528O59436M766732O938428N919128M179955L987491M256070K774834K428830
673.1E20218432K865910K804995K466738K222359K067745J886845J620173J320660
$$ plain form
689.4 537473857 538697779 539889514 540768683 541270435 541872382 542871594 544069231 545348823 546946764
707.7 546946764 548997641 551253378 553412616 555566251 558079243 560741365 563008845 565106392
724 565106392 567616761 570334554 572588980 574338675 576231956 578438818 580261886 581551135 583118916
742.4 583118916 585317254 587470293 589184582 591007471 593349934 595640123 597416937 599374533
758.7 599374533 602031648 604652762 606564522 608388305 610804856 613191664 614577115 615199089 615899205
777.1 615899205 616465509 616062403 614981592 614387035 614569783 615005076 615861535 618247390 622513115
795.4 622513115 627693832 633244336 639686108 646906912 653469861 658654869 663349032 668077886
811.7 668077886 671925187 674176991 675539553 676744342 677014291 675421715 672627747 669662297 666274846
$$ packed form
689.4E37473857J223922J191735Q79169N01752O01947R99212J197637J279592J597941
707.7E46946764K050877K255737K159238K153635K512992K662122K267480K097547
724E65106392K510369K717793K254426J749695J893281K206862J823068J289249J567781
742.4E83118916K198338K153039J714289J822889K342463K290189J776814J957596
758.7E99374533K657115K621114J911760J823783K416551K386808J385451O21974P00116
777.1F15899205N66304m03106j080811n94557J82748M35293Q56459K385855M265725
795.4F22513115N180717N550504O441772P220804O562949N185008M694163M728854
811.7F68077886L847301K251804J362562J204789K69949j592576k793968k965450l387451
$$ plain form
830.1 666274846 661804199 656836092 652498424 648689151 644494593 639972985 636139452 633443713
846.4 633443713 631735027 631691277 634636998 640756667 648914456 658139408 668341279 679335594
862.7 679335594 689910710 698978782 706829131 713998497 719991684 724290013 727487683 730360508
879.1 730360508 732568622 733339429 732928097 732177377 731184721 729611039 727900207 727125704 727663457
897.4 727663457 728919625 730444849 732429624 734830737 736806333 737591565 737294972 736184061 733966649
915.8 733966649 730372190 725930214 721722364 718420148 716165423 715228498 715935111 717874944 719928920
934.1 719928920 721454144 722746134 724075139 725043893 725269973 725046098 724650681 723508537 720889091
952.5 720889091 716980338 712317765 706534386 698819995 689090371 677701175 664521754 649060667
$$ packed form
830.1F66274846m470647m968107m337668l809273m194558m521608l833533k695739
846.4F33443713j708686m3750K945721O119669Q157789R224952J0201871J0994315
862.7F79335594J0575116R068072P850349P169366N993187M298329L197670K872825
879.1G30360508K208114P70807m11332p50720r92656j573682j710832p74503N37753
897.4G27663457J256168J525224J984775K401113J975596P85232k96593j110911k217412
915.8G33966649l594459m441976m207850l302216k254725r36925P06613J939833K053976
934.1G19928920J525224J291990J329005R68754K26080k23875l95417j142144k619446
952.5G20889091l908753m662573n783379p714391r729624j1389196j3179421j5461087
$$ plain form
968.8 649060667 631726861 614208162 598077774 583765805 571170926 560210764 550842524 543117344
985.1 543117344 536616981 530748904 525564432 521071315 517033577 513661325 511268616 509531915
1001.4 509531915 507653296 505054712 501553059 496871978 490651399 483209848 475485116 468090743
1017.7 468090743 460995197 454144210 447817951 442104727 436665326 431345314 426477402 422335386
1034.1 422335386 418744177 415440947 412479311 409963995 407647014 405138463 402398914 399759889
1050.4 399759889 397635728 396404803 396440864 397922158 400340438 402527958 403318822 402130634 398914456
1068.7 398914456 393863946 387455910 380410641 373199999 365830213 358414799 351498127 345504135
1085 345504135 340185463 335080862 330235392 326185942 323421985 322015911 321765453 322362840 323397607
$$ packed form
968.8F49060667j7333806j7518699j6130388j4311969j2594879j0960162r368240p725180
985.1E43117344o500363n868077n184472m493117m037738l372252k392709j736701
1001.4E09531915j878619k598584l501653m681081o220579p441551p724732p394373
1017.7D68090743p095546o850987o326259n713224n439401n320012m867912m142016
1034.1D22335386l591209l303230k961636k515316k316981k508551k739549k639025
1050.4C99759889k124161j230925L6061J481294K418280K187520P90864j188188l216178
1068.7C98914456n050510o408036p045269p210642p369786p415414o916672n993992
1085C45504135n318672n104601m845470m049450k763957j406074k50458N97387J034767
$$ plain form
1103.4 323397607 324399799 325154513 325779647 326333046 326511204 325718582 323250800 318699121 313097417
1121.8 313097417 309280485 309259653 311823249 314328849 315200239 314676493 314491779 316000640 318860114
1140.1 318860114 321973056 324722648 327029705 329023838 330891997 332851827 335143983 338020116
1156.4 338020116 341784269 346816510 353528202 362173259 372591108 384214550 396372378 408471614
1172.7 408471614 420050859 430832565 440755457 449773461 457640499 463995457 468512505 471031934
1189.1 471031934 471673489 470881134 469381511 468100935 467946112 469461113 472647369 477052838 481967121
1207.4 481967121 486586869 490300655 493016571 495097131 496913880 498612016 500252783 501975238
1223.7 501975238 503922343 506087482 508406043 510929048 513717115 516644001 519513607 522305906
$$ packed form
1103.4C23397607J002192P54714O25134N53399J78158p92622k467782m551679n601704
1121.8C13097417l816932k0832K563596K505600Q71390n23746j84714J508861K859474
1140.1C18860114L112942K749592K307057J994133J868159J959830K292156K876133
1156.4C38020116L764153N032241O711692Q645057J0417849J1623442J2157828J2099236
1172.7D08471614J1579245J0781706R922892R018004P867038O354958M517048K519429
1189.1D71031934O41555p92355j499623j280576j54823J515001L186256M405469M914283
1207.4D81967121M619748L713786K715916K080560J816749J698136J640767J722455
1223.7E01975238J947105K165139K318561K523005K788067K926886K869606K792299
$$ plain form
1240.1 522305906 525043607 527528405 529500961 530919850 531944275 532737792 533384442 534082830 535215616
1258.4 535215616 537040830 539590836 542883396 546988606 551875889 557310045 563045144 569045246
1274.7 569045246 575318635 581660569 587869465 594062209 600473702 607091069 613661826 620013177
1291 620013177 626124024 631865263 636973977 641374588 645261943 648750842 651745915 654244363 656433940
1309.4 656433940 658399403 660021603 661277592 662454903 663763225 665116310 666469932 667891741
1325.7 667891741 669338703 670561731 671296418 671537280 671532214 671433747 671183407 670910776 670955718 671360135
1346.1 671360135 671870947 672313213 672624409 672729075 672541678 672085941 671378911 670264363 668664396
1364.5 668664396 666810155 664906561 663089573 661176503 658660531 655375898 650642335 643017828
$$ packed form
1240.1E22305906K737701K484798J972556J418889J024425P93517O46650O98388J132786
1258.4E35215616J825214K550006L292560M105210M887283N434156N735099O000102
1274.7E69045246O273389O341934O208896O192744O411493O617367O570757O351351
1291F20013177O110847N741239N108714M400611L887355L488899K995073K498448K189577
1309.4F56433940J965463J622200J255989J177311J308322J353085J353622J421809
1325.7F67891741J446962J223028P34687K40862n066r8467k50340k72631M4942M04417
1346.1F71360135N10812M42266L11196J04666j87397m55737p07030j114548j599967
1364.5F68664396j854241j903594j816988j913070k515972l284633m733563p624507
$$ plain form
1380.8 643017828 634164155 629825711 632363677 636952519 639326692 639799297 639083385 637413502 634853780
1399.1 634853780 631619930 628058732 624207616 620447636 617077649 614051580 611549377 609774768
1415.5 609774768 608391523 606859922 605516016 604703128 604162514 603755295 603430152 603353679 603831887
1433.8 603831887 604841411 606078386 607491016 609376550 611630678 614184916 617254615 620876253
1450.1 620876253 624995112 629925966 636935294 645552218 652775347 659351885 666752160 674410522
1466.4 674410522 681659937 689585984 698941827 707636178 714246571 719330728 723338544 726549923
1482.8 726549923 728953481 730473280 730821133 729896963 728401542 726490498 723502338 719657362 715845168
1501.1 715845168 712372601 708125055 701249361 694050670 687866867 681958973 676545620 671913028
$$ packed form
1380.8F43017828q853673m338444K537966M588842K374173M72605p15912j669883k559722
1399.1F34853780l233850l561198l851116l759980l369987l026069k502203j774609
1415.5F09774768j383245j531601j343906q12888n40614m07219l25143p6473M78208
1433.8F03831887J009524J236975J412630J885534K254128K554238L069699L621638
1450.1F20876253M118859M930854P009328Q616924P223129O576538P400275P658362
1466.4F74410522P249415P926047R355843Q694351O610393N084157M007816L211379
1482.8G26549923K403558J519799L47853r24170j495421j911044k988160l844976l812194
1501.1G15845168l472567m247546o875694p198691o183803n907894n413353m632592
$$ plain form
1517.4 671913028 668061018 664044380 659828126 655999660 652190089 648714483 645600259 642379463
1533.7 642379463 639700174 637842655 635736942 633257270 631358743 630041540 629408956 629521012 630279958
1552.1 630279958 631498873 633004248 634285569 634088516 632983148 631639421 629898131 627342045
1568.4 627342045 623495400 619261324 614520609 607806921 600550115 593710840 586426318 578767180
1584.7 578767180 570844591 562652588 554317415 546082854 537921965 529908657 522203028 514726520
1601.1 514726520 507340133 500087619 492946714 485718071 478604466 471944928 465001196 457141846
1617.4 457141846 450441599 444727540 438540250 432552814 427206665 422412664 418742746 416014433
1633.7 416014433 413455725 411603510 410936356 411267847 412454516 414521426 417170763 419805259 423389882
$$ packed form
1517.4F71913028l852010m016638m216254l828466l809571l475606l114224l220796
1533.7F42379463k679289j857519k105713k479672j898527j317203o32584J12056P58946
1552.1F30279958J218915J505375J281321j97053j105368j343727j741290k556086
1568.4F27342045l846645m234076m740715o713688p256806o839275p284522p659138
1584.7E78767180p922589q192003q335173q234561q160889q013308p705629p476508
1601.1E14726520p386387p252514p140905p228643p113605o659538o943732p859350
1617.4D57141846o700247n714059o187290n987436n346149m794001l669918k728313
1633.7D16014433k558708j852215o67154L31491J186669K066910K649337K634496L584623
$$ plain form
1652 423389882 428451985 432835221 437229484 442885995 449909210 457519799 464867622 473171592 482728571
1670.4 482728571 491681039 501066566 511461675 521275222 530845106 541820288 555264175 567306697
1686.7 567306697 577548087 588305593 598861516 610409379 622969806 635447264 649097919
1701 649097919 660527945 670075357 679553866 687930942 695438623 702432156 709134758 715859652
1717.3 715859652 721541643 725924611 730119526 734510064 738800883 742956400 746940553 751238227
1733.6 751238227 755261600 758471131 761897147 765712738 769603431 773520112 777398229 781259120
1749.9 781259120 784959972 788133502 791035056 793888211 796627104 799136221 801118314 802953422
1766.3 802953422 805042624 807125568 808793247 810060263 811321080 812749326 814103127 815299869
$$ packed form
1652D23389882N062103M383236M394263N656511P023215P610589P347823Q303970R556979
1670.4D82728571Q952468R385527J0395109R813547R569884J0975182J3443887J2042522
1686.7E67306697J0241390J0757506J0555923J1547863J2560427J2477458J3650655
1701F49097919J1430026R547412R478509Q377076P507681O993533O702602O724894
1717.3G15859652N681991M382968M194915M390538M290819M155517L984153M297674
1733.6G51238227M023373L209531L426016L815591L890693L916681L878117L860891
1749.9G81259120L700852L173530K901554K853155K738893K509117J982093J835108
1766.3H02953422K089202K082944J667679J267016J260817J428246J353801J196742
$$ plain form
1782.6 815299869 816572428 817908049 819170713 820440054 821700096 822676361 823488832 824369371 825343370
1800.9 825343370 826216877 826883376 827520132 828326762 829176545 829776585 830245078 830835223 831547976 832200527
1821.3 832200527 832783878 833414733 834131777 834743381 835025668 835268080 835708141 836171031 836586416 837148249
1841.7 837148249 837788284 838144362 838230431 838384867 838735700 839117587 839386582 839629948 839967072 840332091
1862.1 840332091 840684414 841080725 841477573 841665983 841650069 841673493 841846824 842093885 842293799 842463732
1882.5 842463732 842693269 842962921 843148410 843230844 843349874 843508303 843587399 843630314 843749344 843897402
1902.9 843897402 843982518 844032764 844132304 844242394 844289839 844370782 844546258 844652534 844583988 844465137 844431102
1925.3 844431102 844470084 844464004 844400227 844397128 844446659 844426751 844352245 844336808 844332874 844209909 843985617 843822718
$$ packed form
1782.6H15299869J272559J335621J262664J269341J260042R76265Q12471Q80539R73999
1800.9H25343370Q73507O66499O36756Q06630Q49783O00040M68493N90145P12753O52551
1821.3H32200527N83351O30855P17044O11604K82287K42412M40061M62890M15385N61833
1841.7H37148249O40035L56078Q6069J54436L50833L81887K68995K43366L37124L65019
1862.1H40332091L52323L96311L96848J88410j5914K3424J73331K47061J99914J69933
1882.5H42463732K29537K69652J85489Q2434J19030J58429P9096M2915J19030J48058
1902.9H43897402Q5116N0246R9540J10090M7445Q0943J75476J06276o8546j18851l4035
1925.3H44431102L8982o080o3777l099M9531j9908p4506j5437l934j22965k24292j62899
$$ plain form
1949.8 843822718 843784094 843690932 843450904 843248546 843177974 843061388 842867196 842739165 842669189 842506945
1970.2 842506945 842223227 841997206 841921508 841839790 841631174 841446936 841402829 841338038 841102600 840840578
1990.6 840840578 840682328 840492308 840199649 839933395 839795232 839674056 839432240 839129567 838921785 838786006
2011 838786006 838564336 838264823 838016331 837802052 837489128 837129414 836892843 836743116 836488664 836154342
2031.4 836154342 835935116 835809827 835585356 835238338 834941149 834759533 834541321 834197700 833901465 833740711
2051.8 833740711 833537996 833207369 832921028 832788765 832670450 832431972 832170546 832042992 831954122 831766069
2072.2 831766069 831575036 831492603 831422150 831257224 831085682 831031382 831020474 830886066 830683291 830597222
2092.6 830597222 830604911 830525875 830373406 830319941 830350339 830293417 830158234 830098808 830110013 830056489 829926491
$$ packed form
1949.8H43822718l8624r3162k40028k02358p0572j16586j94192j28031o9976j62244
1970.2H42506945k83718k26021p5698q1718k08616j84238m4107o4791k35438k62022
1990.6H40840578j58250j90020k92659k66254j38163j21176k41816l02673k07782j35779
2011H38786006k21670k99513k48492k14279l12924l59714k36571j49727k54452l34322
2031.4H36154342k19226j25289k24471l47018k97189j81616k18212l43621k96235j60754
2051.8H33740711k02715l30627k86341j32263j18315k38478k61426j27554q8870j88053
2072.2H31766069j91033q2433p0453j64926j71542n4300j0908j34408k02775q6069
2092.6H30597222P689p9036j52469n3465L0398n6922j35183n9426J1205n3524j29998
$$ plain form
2115 829926491 829885483 829988122 830084562 830089450 830108881 830225050 830310941 830264330 830231786 830336511 830434620
2137.5 830434620 830428302 830449045 830577433 830689132 830710053 830765367 830914676 831034899 831061482 831093848 831214905
2159.9 831214905 831350625 831387579 831404269 831543684 831726491 831814170 831884265 832060635 832230210 832237363 832187116
2182.3 832187116 832266152 832438827 832536936 832539380 832583249 832696080 832746923 832713187 832740784 832846522 832859039
2204.8 832859039 832763076 832752705 832889259 833000481 832982302 832956254 833008945 833042920 832989931 832965374 833039403
2227.2 833039403 833062887 832957268 832862556 832863390 832869589 832804918 832756221 832812488 832849681 832738340 832579434
2249.6 832579434 832526743 832534671 832466662 832371593 832363009 832400143 832377374 832324147 832360446 832471550 832537889 832528710
2274.1 832528710 832523465 832537651 832525909 832529783 832616985 832796574 833011925 833155215 833261132 833441317 833646059
$$ packed form
2115H29926491m1008J02639R6440M888J9431J16169Q5891m6611l2544J04725R8109
2137.5H30434620o318K0743J28388J11699K0921N5314J49309J20223K6583L2366J21057
2159.9H31214905J35720L6954J6690J39415J82807Q7679P0095J76370J69575P153n0247
2182.3H32187116P9036J72675R8109K444M3869J12831N0843l3736K7597J05738J2517
2204.8H32859039r5963j0371J36554J11222j8179k6048N2691L3975n2989k4557P4029
2227.2H33039403K3484j05619r4712Q34O199o4671m8697N6267L7193j11341j58906
2249.6H32579434n2691P928o8009r5069q584L7134k2769n3227L6299J11104O6339r179
2274.1H32528710n245J4186j1742L874Q7202J79589K15351J43290J05917J80185K04742
$$ plain form
2296.5 833646059 833807349 833978772 834214568 834473312 834744155 835056782 835379899 835671306 835954547 836321056
2316.9 836321056 836813271 837353349 837810755 838194013 838575065 838895619 839094877 839273155 839514554 839716852
2337.3 839716852 839845657 839983463 840062857 839818597 839407861 839413166 840063691 841045082 841970265 842767775
2357.7 842767775 843243480 843291104 843130410 842878103 842458308 841911793 841292262 840713620 840303242 839959204
2378.1 839959204 839592457 839307189 839216530 839285612 839385033 839463890 839568615 839679539 839753807 839831471 839958429
2400.6 839958429 840093732 840153277 840163827 840233743 840366185 840441227 840434790 840455472 840507805 840485215 840358019
2423 840358019 840245128 840279937 840391517 840433419 840453863 840535104 840615809 840621471 840571582 840548813 840565920 840534389
2447.5 840534389 840449929 840414524 840433002 840396941 840311766 840307295 840352416 840302289 840173900 840077341 840035021
$$ packed form
2296.5H33646059J61290J71423K35796K58744K70843L12627L23117K91407K83241L66509
2316.9H36321056M92215N40078M57406L83258L81052L20554J99258J78278K41399K02298
2337.3H39716852J28805J37806P9394k44260m10736N305O50525R81391R25183P97510
2357.7H42767775M75705M7624j60694k52307m19795n46515o19531n78642m10378l44038
2378.1H39959204l66747k85268r0659O9082R9421P8857J04725J10924P4268P7664J26958
2400.6H39958429J35303N9545J0550O9916J32442P5042o437K0682N2333k2590j27196
2423H40358019j12891L4809J11580M1902K0444Q1241Q0705N662m9889k2769J7107l1531
2447.5H40534389q4460l5405J8478l6061q5175m471M5121n0127j28389r6559m2320
$$ plain form
2469.9 840035021 839980721 839883387 839806616 839794099 839769900 839666903 839537621 839454293 839399040 839306414 839196622
2492.3 839196622 839135170 839099467 839011490 838888943 838815868 838768005 838671505 838523626 838404477 838364005 838304460
2514.8 838304460 838158846 838009715 837911963 837821066 837705076 837597549 837508082 837394297 837252021 837106109
2535.2 837106109 836987615 836899519 836766362 836580098 836452127 836412370 836334646 836165190 835996330 835863590
2555.6 835863590 835738957 835602880 835444927 835295379 835163713 834989727 834756613 834537089 834331930 834074736
2576 834074736 833797991 833558619 833332598 833077908 832779884 832460284 832158327 831848860 831505239 831162870
2596.4 831162870 830828369 830479741 830087543 829660833 829243779 828824103 828387976 827933490 827457905 827017784
2616.8 827017784 826610327 826149762 825670004 825268090 824890018 824412584 823861599 823364675 822934985 822469652
$$ packed form
2469.9H40035021n4300r7334p6771j2517k4199j02997j29282q3328n5253r2626j09792
2492.3H39196622o1452l5703q7977j22547p3075m7863r6500j47879j19149m0472n9545
2514.8H38304460j45614j49131r7752r0897j15990j07527q9467j13785j42276j45912
2535.2H37106109j18494q8096j33157j86264j27971l9757p7724j69456j68860j32740
2555.6H35863590j24633j36077j57953j49548j31666j73986k33114k19524k05159k57194
2576H34074736k76745k39372k26021k54690k98024l19600l01957l09467l43621l42369
2596.4H31162870l34501l48628l92198m26710m17054m19676m36127m54486m75585m40121
2616.8H27017784m07457m60565m79758m01914l78072m77434n50985m96924m29690m65333
$$ plain form
2637.1 822469652 821959853 821493983 821060419 820602596 820122898 819632769 819168568 818730950 818259001 817772150
2657.5 817772150 817335427 816931009 816489220 815978289 815459609 815004766 814565361 814076960 813611686 813190401
2677.9 813190401 812683463 812066019 811489820 811028063 810554326 810001433 809429228 808867872 808336556 807828546
2698.3 807828546 807303309 806769848 806245327 805683494 805069029 804462671 803879380 803251088 802551985 801876545
2718.7 801876545 801284492 800697684 800071180 799442649 798823774 798185408 797519386 796896160 796360493 795819342
2739.1 795819342 795170426 794471979 793861806 793332934 792758346 792117298 791476071 790826797 790118337 789365470
2759.5 789365470 788661599 788004637 787293196 786499798 785671353 784881413 784109473 783250213 782347262 781502426
2779.9 781502426 780657589 779760003 778850675 777939022 776991904 775955856 774847627 773754716 772663951
$$ packed form
2637.1H22469652n09799m65870m33564m57823m79698m90129m64201m37618m71949m86851
2657.5H17772150m36723m04418m41789n10931n18680m54843m39405m88401m65274m21285
2677.9H13190401n06938o17444n76199m61757m73737n52893n72205n61356n31316n08010
2698.3H07828546n25237n33461n24521n61833o14465o06358n83291o28292o99103o75440
2718.7H01876545n92053n86808o26504o28531o18875o38366o66022o23226n35667n41151
2739.1G95819342o48916o98447o10173n28872n74588o41048o41227o49274p08460p52867
2759.5G89365470p03871o56962p11441p93398q28445p89940p71940q59260r02951q44836
2779.9G81502426q44837q97586r09328r11653r47118j036048j108229j092911j090765
$$ plain form
2798.3 772663951 771505833 770305157 769107878 767915726 766691983 765362263 763941824 762563050
2814.6 762563050 761248410 759857774 758359015 756839335 755296826 753663480 751929045 750116765
2830.9 750116765 748196542 746090055 743683338 740868449 737552941 733622789 729016602 724038005
2847.2 724038005 719495893 716093838 713873088 712453723 711444259 710499585 709322155 707730174
2863.5 707730174 705655754 703150392 700423539 697787523 695431232 693351984 691480398 689737320
2879.9 689737320 688066304 686398923 684618711 682659268 680544794 678332448 676060557 673722088
2896.2 673722088 671314538 668861806 666326940 663608968 660639107 657356501 653614342 649299443
2912.5 649299443 644585431 639958978 635888994 632505953 629787087 627786875 626499414 625810564
$$ packed form
2798.3G72663951j158118j200676j197279j192152j223743j329720j420439j378774
2814.6G62563050j314640j390636j498759j519680j542509j633346j734435j812280
2830.9G50116765j920223k106487k406717k814889l315508l930152m606187m978597
2847.2G24038005m542112l402055k220750j419365j009464r44674j177430j591981
2863.5G07730174k074420k505362k726853k636016k356291k079248j871586j743078
2879.9F89737320j671016j667381j780212j959443k114474k212346k271891k338469
2896.2F73722088k407550k452732k534866k717972k969861l282606l742159m314899
2912.5F49299443m714012m626453m069984l383041k718866k000212j287461o88850
$$ plain form
2928.8 625810564 625620008 625948548 626873076 628361583 630288899 632548213 634990811 637249827 638944685
2947.2 638944685 640047133 640710413 640942276 640797615 640551388 640473366 640680313 641094089 641581357 642145813
2967.6 642145813 642796934 643471360 644095242 644631743 645164609 645749688 646295428 646781206 647301972 647843003
2987.9 647843003 648268163 648449540 648320079 647905231 647198021 646205366 645058453 643819630 642503023
3006.3 642503023 641194105 639938176 638605058 637026072 635231495 633363843 631477475 629544556
3022.6 629544556 627534211 625457227 623375952 621308565 619198859 616960406 614609063 612297833
3038.9 612297833 610008001 607574165 604993284 602372229 599765778 597127974 594432473 591736794
3055.3 591736794 589010775 586238205 583561242 581035316 578546286 575998485 573366225 570706964
$$ packed form
2928.8F25810564j90556L28540R24528J488507J927316K259314K442598K259016J694858
2947.2F38944685J102448O63280K31863j44661k46227p8022K06947M13776M87268N64456
2967.6F42145813O51121O74426O23882N36501N32866N85079N45740M85778N20766N41031
2987.9F47843003M25160J81377j29461m14848p07210r92655j146913j238823j316607
3006.3F42503023j308918j255929j333118j578986j794577j867652j886368j932919
3022.6F29544556k010345k076984k081275k067387k109706k238453k351343k311230
3038.9F12297833k289832k433836k580881k621055k606451k637804k695501k695679
3055.3E91736794k726019k772570k676963k525926k489030k547801k632260k659261
$$ plain form
3071.6 570706964 568123341 565647960 563252211 560806751 558185160 555443466 552701414 550042093
3087.9 550042093 547428787 544709504 541879177 539094746 536418974 533720255 530841112 527862072
3104.2 527862072 524978459 522139847 519147396 516088724 513166904 510235906 507120788 503831148
3120.5 503831148 500394106 496969491 493661582 490379274 487059027 483681798 480275929 476905495
3136.8 476905495 473520398 469988585 466343403 462738991 459196299 455693185 452205509 448598325
3153.2 448598325 444842756 441081434 437350422 433607787 429874241 426182002 422499508 418782711
3169.5 418782711 415058553 411330849 407596558 403895229 400230706 396563619 392895699 389290661
3185.8 389290661 385759264 382212669 378615111 375048399 371558428 368111581 364691049 361343801
$$ packed form
3071.6E70706964k583623k475381k395749k445460k621591k741694k742052k659321
3087.9E50042093k613306k719283k830327k784431k675772k698719k879143k979040
3104.2E27862072k883613k838612k992451l058672k921820k930998l115118l289640
3120.5E03831148l437042l424615l307909l282308l320247l377229l405869l370434
3136.8D76905495l385097l531813l645182l604412l542692l503114l487676l607184
3153.2D48598325l755569l761322l731012l742635l733546l692239l682494l716797
3169.5D18782711l724158l727704l734291l701329l664523l667087l667920l605038
3185.8C89290661l531397l546595l597558l566712l489971l446847l420532l347248
$$ plain form
3202.1 361343801 358085215 354880124 351715326 348571777 345431179 342339367 339359492 336427271
3218.4 336427271 333477527 330583960 327752799 324931353 322181106 319586933 317087322 314518452
3234.7 314518452 311921686 309466690 307108015 304746866 302442193 300231576 298048943 295879453
3251.1 295879453 293750972 291671932 289632499 287622124 285628468 283636659 281655997 279709071
3267.4 279709071 277845591 276012063 274089575 272119403 270197511 268306822 266418666 264559180
3283.7 264559180 262729168 260935336 259202302 257462412 255645454 253782183 251912057 250081539
3300 250081539 248339191 246668234 244976535 243172899 241268083 239351019 237511382 235765889 234058663
3318.4 234058663 232370153 230723664 229087785 227412716 225721076 224081039 222534850 221089572
$$ packed form
3202.1C61343801l258586l205091l164798l143549l140598l091812k979875k932221
3218.4C36427271k949744k893567k831161k821446k750247k594173k499611k568870
3234.7C14518452k596766k454996k358675k361149k304673k210617k182633k169490
3251.1B95879453k128481k079040k039433k010375j993656j991809j980662j946926
3267.4B79709071j863480j833528j922488j970172j921892j890689j888156j859486
3283.7B64559180j830012j793832j733034j739890j816958j863271j870126j830518
3300B50081539j742348j670957j691699j803636j904816j917064j839637j745493j707226
3318.4B34058663j688510j646489j635879j675069j691640j640037j546189j445278
$$ plain form
3334.7 221089572 219694480 218235582 216699705 215206325 213774025 212416559 211225033 210045859
3351 210045859 208690464 207289994 206043988 204981312 203989312 203007370 202163488 201450825 200621843
3369.3 200621843 199585572 198580503 197819352 197197437 196598440 196047768 195621967 195364982 195300803
3387.7 195300803 195425496 195489913 195297271 195106864 195257351 195633247 195824370 195791706 195887491 196214288
3408.1 196214288 196656719 197116479 197510332 197906539 198457763 199140966 199836746 200642362 201703489
3426.5 201703489 202935189 204125062 205340281 206712186 207965925 208924636 209916517 211198300 212682515
3444.8 212682515 214280158 215903908 217541292 219279155 221140608 223128930 225217015 227246985
3461.1 227246985 229287013 231636077 234193653 236507669 238428950 240360141 242631450 245203912
$$ packed form
3334.7B21089572j395092j458898j535877j493380j432300j357466j191526j179174
3351B10045859j355395j400470j246006j062676r92000r81942q43882p12663q28982
3369.3B00621843j036271j005069p61151o21915n98997n50672m25801k56985o4179
3387.7A95300803J24693O4417j92642j90407J50487L75896J91123l2664R5785L26797
3408.1A96214288M42431M59760L93853L96207N51224O83203O95780Q05616J061127
3426.5B01703489J231700J189873J215219J371905J253739R58711R91881J281783J484215
3444.8B12682515J597643J623750J637384J737863J861453J988322K088085K029970
3461.1B27246985K040028K349064K557576K314016J921281J931191K271309K572462
$$ plain form
3477.4 245203912 247801155 250193894 252582371 255212992 257931650 260604590 263360769 266264975
3493.8 266264975 269263268 272210568 275137633 278166592 281153530 284033060 287057102 290368915
3510.1 290368915 293878913 297363997 300650865 303921312 307444990 311294705 315172970 318861187
3526.4 318861187 322569132 326419055 330377638 334543258 338821173 342970878 347220987 351760417
3542.7 351760417 356342316 360707968 364970654 369377077 373962045 378627270 383416325 388452381
3559 388452381 393584639 398538858 403494358 409028530 414796501 420158714 425430030 430978060 436787099
3577.4 436787099 442833036 449019819 455164343 461314708 467692524 474175483 480441988 486816376
3593.7 486816376 493573189 500450194 507255614 514030039 520747960 527435660 534454405 541705728
$$ packed form
3477.4B45203912K597243K392739K388477K630621K718658K672940K756179K904206
3493.8B66264975K998293K947300K927065L028959K986938K879530L024042L311813
3510.1B90368915L509998L485084L286868L270447L523678L849715L878265L688217
3526.4C18861187L707945L849923L958583M165620M277915M149705M250109M539430
3542.7C51760417M581899M365652M262686M406423M584968M665225M789055N036056
3559C88452381N132258M954219M955500N534172N767971N362213N271316N548030N809039
3577.4D36787099O045937O186783O144524O150365O377816O482959O266505O374388
3593.7D86816376O756813O877005O805420O774425O717921O687700P018745P251323
$$ plain form
3610 541705728 548855782 555988550 562939525 569997549 577528417 584625900 591025472 597427547 604799032
3628.4 604799032 612652361 619352818 625531554 631828249 638111651 644373715 650496721 656342328
3644.7 656342328 662189305 668598235 674863458 679825783 684300363 689357340 694331348 698617101
3661 698617101 702597201 706476033 710191429 714002907 717872024 721168160 724324644 727450550 730032802
3679.4 730032802 732481360 735082746 737757862 740622818 743413031 745498657 747151196 748849213
3695.7 748849213 750594556 752269983 753908217 755450428 756849110 758266509 759710670 761007369
3712 761007369 762061059 762994170 764055133 765245616 766336799 767211080 767981768 768809319 769719720
3730.3 769719720 770762265 771876812 772809029 773401678 773694456 773944676 774626791 775530696 776132166
$$ packed form
3610E41705728P150054P132768O950975P058024P530868P097483O399572O402075P371485
3628.4F04799032P853329O700457O178736O296695O283402O262064O123006N845607
3644.7F56342328N846977O408930O265223M962325M474580N056977M974008M285753
3661F98617101L980100L878832L715396L811478L869117L296136L156484L125906K582252
3679.4G30032802K448558K601386K675116K864956K790213K085626J652539J698017
3695.7G48849213J745343J675427J638234J542211J398682J417399J444161J296699
3712G61007369J053690R33111J060963J190483J091183Q74281P70688Q27551R10401
3730.3G69719720J042545J114547R32217N92649K92778K50220O82115R03905O01470
$$ plain form
3748.7 776132166 776656330 777216256 777713299 778171957 778604865 779016316 779434919 779948831 780480623 780856013
3769.1 780856013 781113982 781392932 781791151 782345831 782899380 783232093 783427775 783675015 783954144 784247935
3789.5 784247935 784578025 784897923 785309374 785817206 786175430 786463320 786764622 786971629 787182927 787346959
3809.9 787346959 787479222 787739217 788172722 788576782 788809657 788988769 789056599 789098978 789239585 789393187
3830.3 789393187 789625347 790020585 790403664 790556550 790497780 790409684 790434003 790575147 790769577 790909052
3850.7 790909052 790994167 791177988 791298747 791279674 791280270 791429460 791696966 791867435 791950941 792061150 792066693
3873.1 792066693 791997433 791949332 792009652 792213261 792363286 792436481 792476475 792495728 792505026 792415142 792307019
3895.5 792307019 792359471 792581558 792772591 792782247 792670965 792559385 792503238 792481363 792528510 792683661 792814255
$$ packed form
3748.7G76132166N24164N59926M97043M58658M32908M11451M18603N13912N31792L75390
3769.1G80856013K57969K78950L98219N54680N53549L32713J95682K47240K79129K93791
3789.5G84247935L30090L19898M11451N07832L58224K87890L01302K07007K11298J64032
3809.9G87346959J32263K59995M33505M04060K32875J79112O7830M2379J40607J53602
3830.3G89393187K32160L95238L83079J52886n8770q8096K4319J41144J94430J39475
3850.7G90909052Q5115J83821J20759j9073N96J49190K67506J70469Q3506J10209N543
3873.1G92066693o9260m8101O0320K03609J50025P3195L9994J9253R298q9884j08123
3895.5G92307019N2452K22087J91033R656j11282j11580n6147k1875M7147J55151J30594
$$ plain form
3918 792814255 792823613 792780995 792756081 792745411 792736888 792785108 792903364 792990506 793016791 793042302 793055117 793048680
3942.5 793048680 793070316 793139756 793221056 793229580 793155313 793124616 793224275 793370426 793476105 793568492 793654442
3964.9 793654442 793707073 793713987 793720186 793807924 793951631 794061899 794130206 794218719 794332981 794390202 794417262
3987.3 794417262 794532895 794698119 794806361 794863939 794916868
3997.5 794916868
$$ packed form
3918G92814255R358m2618k4914j0670q523M8220J18256Q7142K6285K5511J2815o437
3942.5G93048680K1636O9440Q1300Q524p4267l0697R9659J46151J05679R2387Q5950
3964.9G93654442N2631O914O199Q7738J43707J10268O8307Q8513J14262N7221K7060
3987.3G94417262J15633J65224J08242N7578N2929
3997.5G94916868
##END=$$ End of the data block
