##TITLE=$$ Begin of the data block
##JCAMP-DX=5.00 $$ ACD/SpecManager v 10.08
##SPECTROMETER/DATA SYSTEM=Alpha
##DATE=15 Apr 2014 09:00:42
##DATA TYPE=INFRARED SPECTRUM
##DATA CLASS=XYDATA
##ORIGIN=
##OWNER=
##NPOINTS=1765
##FIRSTX=399.75695801
##LASTX=3997.56933594
##MAXX=3997.56933594
##MINX=399.75695801
##MAXY=0.84486425
##MINY=0.19527186
##XFACTOR=1.0000000000
##YFACTOR=1.000000000000000e-9
##FIRSTY=0.58486104
##DELTAX=2.03957629
##XUNITS=1/CM
##YUNITS=ARBITRARY UNITS
##XYDATA=(X++(Y..Y))
399.8E84861040k815306j129866r54091k357126k075493l53694l53217j214266p77781
$$ 584861040 582045734 580915868 579961777 577604651 575529158 575175464 574822247 573607981 572830200
418.1E72830200o4850p59303j612485j193463k20299m44532j360178j437068q94308
$$ 572830200 572765350 572006047 570393562 569200099 568979800 568535268 567175090 565738022 564843714
436.5E64843714o96003o76453o3896M40776j66357r93967q17358j84298l24666r65119
$$ 564843714 564147711 563471258 563407362 563848138 563681781 562687814 561870456 561686158 561361492 560396373
456.9E60396373j127720o34491l90947p89404r77099n77569o40273j453996j621365
$$ 560396373 559268653 558634162 558243215 557453811 556476712 555899143 555258870 553804874 552183509
475.2E52183509r29713n08547o92904r27985p35998m47869n64158j036883j392424
$$ 552183509 551253796 550745249 550052345 549124360 548388362 547940493 547376335 546339452 544947028
493.6E44947028j282215j158595j374245j466870j109481q16345j023829j281798j162231
$$ 544947028 543664813 542506218 541131973 539665103 538555622 537739277 536715448 535433650 534271419
511.9E34271419r82463j170814j556754j620591j463294j668513k070248j945913j537919
$$ 534271419 533288956 532118142 530561388 528940797 527477503 525808990 523738742 521792829 520254910
530.3E20254910j603901j904011j552165p80999o68526j113713j197994q42034q33691
$$ 520254910 518651009 516746998 515194833 514413834 513745308 512631595 511433601 510591567 509757876
548.6E09757876j361370j579046j228034j258016j958609k228141j829892j961291
$$ 509757876 508396506 506817460 505589426 504331410 502372801 500144660 498314768 496353477
565D96353477k928376l445893k965004k504825k784819l063559k476990j987964k404154
$$ 496353477 493425101 489979208 487014204 484509379 481724560 478661001 476184011 474196047 471791893
583.3D71791893k938747k801478k450466k780229l189087k748013k238184k710819
$$ 471791893 468853146 466051668 463601202 460820973 457631886 454883873 452645689 449934870
599.6D49934870l521085l412992k441674j659274j388908j228570q76904j00255J247525
$$ 449934870 446413785 443000793 440559119 438899845 437510937 436282367 435405463 435305208 436552733
618D36552733K773464L721982L748834L212512L049344L568321M142314M124284L753543
$$ 436552733 439326197 443048179 446797013 450009525 453058869 456627190 460769504 464893788 468647331
636.3D68647331L345162K521187J301139R74655K337635L583252K628685J84237j195997
$$ 468647331 471992493 474513680 475814819 476789474 479127109 482710361 485339046 485523283 484327286
654.7D84327286O90580M742831O836444N883247M236817M053354M340887K829731K367914
$$ 484327286 485017866 489760697 496597141 502480388 506717205 510770559 515111446 517941177 520309091
673.1E20309091K744436K741635K488494K316057K260387K027214J559853J278401
$$ 520309091 523053527 525795162 528283656 530599713 532860100 534887314 536447167 537725568
689.4E37725568J264632J135349Q14795N34356O65128J050472J185298J178146J524567
$$ 537725568 538990200 540125549 540940344 541474700 542139828 543190300 544375598 545553744 547078311
707.7E47078311K089143K292633K145171K189816K516031K554118K268315K218544
$$ 547078311 549167454 551460087 553605258 555795074 558311105 560865223 563133538 565352082
724E65352082K503991K635599K297699J881957J967013K157032J700342J221299J596749
$$ 565352082 567856073 570491672 572789371 574671328 576638341 578795373 580495715 581717014 583313763
742.4E83313763K251566K164781J691699J819491K362788K279162J746178J967609
$$ 583313763 585565329 587730110 589421809 591241300 593604088 595883250 597629428 599597037
758.7E99597037K665639K575636J868844J838684K429068K337158J332342O56605Q22365
$$ 599597037 602262676 604838312 606707156 608545840 610974908 613312066 614644408 615301013 616123378
777.1F16123378O36280m57168j152158n88536J56343L00884Q57473K602160M422128
$$ 616123378 616759658 616302490 615150332 614561796 614718139 615019023 615876496 618478656 622900784
795.4F22900784N127370N446077O424069P201672O513059N139708M651189M757643
$$ 622900784 628028154 633474231 639898300 647099972 653613031 658752739 663403928 668161571
811.7F68161571L916323K264321J391470J269520L05891j567900k821386l078997l514529
$$ 668161571 672077894 674342215 675733685 677003205 677309096 675741196 672919810 669840813 666326284
830.1F66326284m534423m931927m234194l702462m128873m501403l819883k665877
$$ 666326284 661791861 656859934 652625740 648923278 644794405 640293002 636473119 633807242
846.4F33807242j686096p5817K875328O071269Q123040R214938J0231495J0969818
$$ 633807242 632121146 632045329 634920657 640991926 649114966 658329904 668561399 679531217
862.7F79531217J0487854R041906P849097P073462N897820M320800L280103K922416
$$ 679531217 690019071 699060977 706910074 713983536 719881356 724202156 727482259 730404675
879.1G30404675K188742P07925m82440p63417q93891j497984j769483q45968N50389
$$ 730404675 732593417 733301342 732818902 732055485 731161594 729663610 727894127 727048159 727598548
897.4G27598548J303077J566052K001107K366304J926840P54773l22699j115680k208114
$$ 727598548 728901625 730467677 732468784 734835088 736761928 737516701 737194002 736078322 733870208
915.8G33870208l598630m433870m155815l236890k251089j004457O06179J849175K019584
$$ 733870208 730271578 725837708 721681893 718445003 716193914 715189457 715795636 717644811 719664395
934.1G19664395J513839J290142J375497J024901K53380k15590m08352j164972k620936
$$ 719664395 721178234 722468376 723843873 724868774 725122154 724906564 724498212 723333240 720712304
952.5G20712304l917932m700184n789638p709563r741187j1375129j3178646j5473247
$$ 720712304 716794372 712094188 706304550 698594987 688853800 677478671 664300025 648826778
968.8F48826778j7298162j7451704j6081392j4296353j2593568j0991454r414017p730186
$$ 648826778 631528616 614076912 597995520 583699167 571105599 560114145 550700128 542969942
985.1E42969942o495416n853057n157948m519999m095792l415704k427280j764596
$$ 542969942 536474526 530621469 525463521 520943522 516847730 513432026 511004746 509240150
1001.4E09240150j913905k630889l521443m686862o203472p402599p686913p390917
$$ 509240150 507326245 504695356 501173913 496487051 490283579 482880980 475194067 467803150
1017.7D67803150p090240o815911o290704n674898n392850n283385m854918m137814
$$ 467803150 460712910 453896999 447606295 441931397 436538547 431255162 426400244 422262430
1034.1D22262430l551900l249765k944767k482534k204090k407044k766669k697229
$$ 422262430 418710530 415460765 412515998 410033464 407829374 405422330 402655661 399958432
1050.4C99958432k107978j199305L0279J462609K410501K150714P28339j235157l245354
$$ 399958432 397850454 396651149 396681428 398144037 400554538 402705252 403433591 402198434 398953080
1068.7C98953080n053580o397187p045985p208883p361532p392913o876617n990744
$$ 398953080 393899500 387502313 380456328 373247445 365885913 358493000 351616383 345625639
1085C45625639n343318n121052m848242m002661k685308j372695k79099N70566J042813
$$ 345625639 340282321 335161269 330313027 326310366 323625058 322252363 321973264 322543830 323586643
1103.4C23586643J025378P89345O56873N61148J67995q22246k502739m559845n595982
$$ 323586643 324612021 325401366 326058239 326619387 326787382 325965136 323462397 318902552 313306570
1121.8C13306570l843397q2761K514690K486676Q69930n07325j52647J523673K851725
$$ 313306570 309463173 309380412 311895102 314381778 315251708 314744383 314591736 316115409 318967134
1140.1C18967134L137380K800971K328515J983434J834005J930326K327889K923936
$$ 318967134 322104514 324905485 327234000 329217434 331051439 332981765 335309654 338233590
1156.4C38233590L748030M997491O708712Q664459J0417878J1594207J2137413J2091696
$$ 338233590 341981620 346979111 353687823 362352282 372770160 384364367 396501780 408593476
1172.7D08593476J1548847J0732651R897559R044081P911176O365806M510134K518654
$$ 408593476 420142323 430874974 440772533 449816614 457727790 464093596 468603730 471122384
1189.1D71122384O27846q31753j529038j266122j01835J571238L215194M431099M923105
$$ 471122384 471750230 470918477 469389439 468123317 468021482 469592720 472807914 477239013 482162118
1207.4D82162118M572272L658355K708941K108217J847058J702875J611143J689315
$$ 482162118 486734390 490392745 493101686 495209903 497056961 498759836 500370979 502060294
1223.7E02060294J933456K165556K325177K530277K805531K970337K914727K798915
$$ 502060294 503993750 506159306 508484483 511014760 513820291 516790628 519705355 522504270
1240.1E22504270K705932K440452J930297J419961J086593Q33690O31094O80387J131594
$$ 522504270 525210202 527650654 529580951 531000912 532087505 532921195 533552289 534232676 535364270
1258.4E35364270J838744K535939L222466M054844M876137N417645N716324N973518
$$ 535364270 537203014 539738953 542961419 547016263 551892400 557310045 563026369 568999887
1274.7E68999887O234467O319642O205737O179393O399691O632447O593823O372333
$$ 568999887 575234354 581553996 587759733 593939126 600338817 606971264 613565087 619937420
1291F19937420O146669N769134N107343M407764L911733L495276K976358K494752K230704
$$ 619937420 626084089 631853223 636960566 641368330 645280063 648775339 651751697 654246449 656477153
1309.4F56477153K008558J633584J269221J191795J306832J353622J345098J410365
$$ 656477153 658485711 660119295 661388516 662580311 663887143 665240765 666585863 667996228
1325.7F67996228J454115J224994P17402K15351l6120j22070k26915k03192J02281
$$ 667996228 669450343 670675337 671392739 671608090 671571970 671449900 671222985 671019793 671122074
1344.1F71122074M19974M99070M03464K63453J00076j62065m39108p05361j124621
$$ 671122074 671542048 672041118 672444582 672708035 672808111 672646046 672206938 671501577 670376956
1362.4F70376956j582503j825869j929104j859844j903653k478600l276467m745603
$$ 670376956 668794453 666968584 665039480 663179636 661275983 658797383 655520916 650775313
1378.7F50775313p635593q862376m346252K522290M580379K376616M71055p05242j657605
$$ 650775313 643139720 634277344 629931092 632453382 637033761 639410377 639881432 639176190 637518585
1397.1F37518585k566874l230095l545761l845454l766894l376365l022372k511025
$$ 637518585 634951711 631721616 628175855 624330401 620563507 617187142 614164770 611653745
1413.4F11653745j794100j367509j474202j327395q49903n57780l88443k99037n2869
$$ 611653745 609859645 608492136 607017934 605690539 604840636 604282856 603894413 603595376 603542507
1431.8F03542507M91917R95219J213550J422882J912058K263844K532124L033638L611505
$$ 603542507 604034424 605029643 606243193 607666075 609578133 611841977 614374101 617407739 621019244
1450.1F21019244M117549M884064O922185Q576811P239580O591558P412255P687390
$$ 621019244 625136793 630020857 636943042 645519853 652759433 659350991 666763246 674450636
1466.4F74450636P282615P924437R329975Q683383O600082N088091M026592L201425
$$ 674450636 681733251 689657688 698987663 707671046 714271128 719359219 723385811 726587236
1482.8G26587236K370953J485587L16798r13918j461446j924634l029644l827453l761649
$$ 726587236 728958189 730443776 730760574 729846656 728385210 726460576 723430932 719603479 715841830
1501.1G15841830l471434m313946o932020p162094o125451n892217n429566m631042
$$ 715841830 712370396 708056450 701124430 693962336 687836885 681944668 676515102 671884060
1517.4F71884060l838956m014433m193425l766716l749728l458082l119350l234208
$$ 671884060 668045104 664030671 659837246 656070530 652320802 648862720 645743370 642509162
1533.7F42509162k691745j858175k105773k477526j863182j248658n82277J13785P34687
$$ 642509162 639817417 637959242 635853469 633375943 631512761 630264103 629681826 629795611 630530298
1552.1F30530298J214206J516223J272082j93715j087308j327514j727283k560378
$$ 630530298 631744504 633260727 634532809 634339094 633251786 631924272 630196989 627636611
1568.4F27636611l851294m241109m760861o712437p248104o839573p275939p658243
$$ 627636611 623785317 619544208 614783347 608070910 600822806 593983233 586707294 579049051
1584.7E79049051p929921q182526q326232q263410q208036q046567p742465p529139
$$ 579049051 571119130 562936604 554610372 546346962 538138926 530092359 522349894 514820755
1601.1E14820755p430673p262528p127613p218540p116049o686211o988436p874906
$$ 514820755 507390082 500127554 492999941 485781401 478665352 471979141 464990705 457115799
1617.4D57115799o685614n712182o201952n999059n357444m801691l662824k737672
$$ 457115799 450430185 444718003 438516051 432516992 427159548 422357857 418695033 415957361
1633.7D15957361k577781j830667o41555L28511J156568K023489K621472K609998L566056
$$ 415957361 413379580 411548913 410907358 411235869 412392437 414415926 417037398 419647396 423213452
1652D23213452N138338M491955M449635N678058P025123P617950P367164Q285552R496034
$$ 423213452 428351790 432843745 437293380 442971438 449996561 457614511 464981675 473267227 482763261
1670.4D82763261Q918374R421051J0493994R866416R519756J0885119J3434172J2101591
$$ 482763261 491681635 501102686 511596680 521463096 530982852 541867971 555302143 567403734
1686.7E67403734J0261476J0761618J0564983J1531830J2535215J2472152J3642371
$$ 567403734 577665210 588426828 598991811 610523641 623058856 635531008 649173379
1701F49173379J1411667R544432R510636Q409500P499397O957770O681203O757796
$$ 649173379 660585046 670129478 679640114 688049614 695549011 702506781 709187984 715945780
1717.3G15945780N753219M440070M229128M399300M270732M124641L957451M289567
$$ 715945780 721698999 726139069 730368197 734767497 739038229 743162870 747120321 751409888
1733.6G51409888M048705L228188L415167L787577L880084L933251L885448L860712
$$ 751409888 755458593 758686781 762101948 765889525 769769609 773702860 777588308 781449020
1749.9G81449020L726244L191531K880692K823234K724886K503097K001643J865923
$$ 781449020 785175264 788366795 791247487 794070721 796795607 799298704 801300347 803166270
1766.3H03166270K089858K060771J643360J270950J311540J475156J353264J171171
$$ 803166270 805256128 807316899 808960259 810231209 811542749 813017905 814371169 815542340
1782.6H15542340J246929J316071J249611J256645J271725J006782Q17060Q50022R39667
$$ 815542340 816789269 818105340 819354951 820611596 821883321 822890103 823707163 824557185 825496852
1800.9H25496852Q78871P10010O84500Q16167Q10504N61356M55558N83053P15911O81997
$$ 825496852 826375723 827085733 827770233 828586400 829396904 829958260 830413818 830996871 831712782 832394779
1821.3H32394779O14047O27935O82890N86629K93553K66373M53532M54724L80993N35666
$$ 832394779 833008826 833636761 834319651 834906280 835199833 835466206 835919738 836374462 836755455 837291121
1841.7H37291121O61612L98099J06872J53601L35991L78251K90811K68340L49343L51966
$$ 837291121 837952733 838350832 838457704 838611305 838947296 839325547 839616358 839884698 840234041 840586007
1862.1H40586007L20971L83615L92556J84298Q762N6326J80721K25068J70707J81377
$$ 840586007 840906978 841290593 841683149 841867447 841876209 841932535 842113256 842338324 842509031 842690408
1882.5H42690408K66433K57552J28448N7101J59323K12729Q5235J5199J10805J70052
$$ 842690408 842956841 843214393 843342841 843399942 843559265 843771994 843857229 843872428 843983233 844153285
1902.9H44153285J02103L9398P8500R9182M0471P6533J73211J01566m6789o9082m113
$$ 844153285 844255388 844294786 844373286 844472468 844512939 844589472 844762683 844864249 844817460 844748378 844744265
1925.3H44744265L0160l4630p2897J5438M1902m7803o5327j371k6643j47641k30789
$$ 844744265 844774425 844739795 844666898 844682336 844724238 844676435 844611108 844609737 844583094 844435453 844204664
1947.8H44204664j60277k6703p9035k34664k15649q5712j11103j88589j17779n3286
$$ 844204664 844044387 844017684 843938649 843703985 843488336 843402624 843291521 843102932 842985153 842931867
1968.2H42931867j60396k84434k33233j05560j13189k10225j67132m3690p3314k25425
$$ 842931867 842771471 842487037 842253804 842148244 842035055 841824830 841657698 841614008 841540694 841315269
1988.6H41315269k42292j30892j54734k79307k70248j36971j31488k60413k98440j99378
$$ 841315269 841072977 840942085 840787351 840508044 840237796 840100825 839969337 839708924 839410484 839211106
2009H39211106j55270k55704l11851k17855j78814l08871l56615k32458j64330k58744
$$ 839211106 839055836 838800132 838488281 838270426 838091612 837782741 837426126 837193668 837029338 836770594
2029.4H36770594l24249k27809j47283k27750l23236k75075j86801k39372l55184l04759
$$ 836770594 836446345 836218536 836071253 835843503 835520267 835245192 835058391 834819019 834463835 834159076
2049.8H34159076j68979k01642l39568k91884j27673j35720k51651k54035j29759q0705
$$ 834159076 833990097 833788455 833448887 833157003 833029330 832893610 832641959 832387924 832258165 832177460
2070.2H32177460j62244j77621o8427n4955j82033k16543r1255k503q6546j79291j13011
$$ 832177460 832015216 831837595 831769168 831714213 831532180 831315637 831224382 831221879 831135333 830956042 830843031
2092.6H30843031k1517p4506j24454l6001K5987n7399j24633n0366K1577l8088j21653
$$ 830843031 830821514 830747008 830622554 830586553 830612540 830555141 830430508 830380142 830401719 830363631 830241978
2115H30241978n1796Q2135O9380l9280p927J22845Q2910n3525r477J39177J16527O974
$$ 830241978 830190182 830272317 830341697 830302417 830294490 830417335 830500245 830446720 830437243 830576420 830692947 830699921
2139.5H30699921M4286J39177R9838N36K4378J20580J14561M3630P1109J65283J53482
$$ 830699921 830744207 830883384 830983222 830983758 831008136 831128716 831243277 831286907 831358016 831523299 831676781
2161.9H31676781M2260K7060J26303J56760P9751N6624J50681J56462K1100r954J01209
$$ 831676781 831719041 831746101 831872404 832029164 832108915 832165539 832316220 832472682 832493782 832483828 832585037
2184.4H32585037J49965O1631k5749L6120J21773O1333j073N6148R4771J9312n8591
$$ 832585037 832735002 832796633 832770884 832807004 832928777 832990110 832989037 833045185 833139956 833159268 833100677
2206.8H33100677O020J10447O7115m8340k0504R7037M9770r7335o5326O5744M1186
$$ 833100677 833106697 833217144 833284259 833235919 833215415 833312452 833362222 833264887 833199561 833265305 833306491
2229.2H33306491p0989o7353J3709K682r6142j00732K7001O5923p2599j48236m8459
$$ 833306491 833235502 833168149 833181858 833184540 833088398 832987666 833014667 833080590 833007991 832859755 832811296
2251.7H32811296K7060m2319r9242k3484N4956L993n9306M887R7633P9333j132k921
$$ 832811296 832838356 832796037 832696795 832673311 832728267 832732260 832672954 832677841 832775474 832854807 832853675 832850754
2276.1H32850754M2737L3676K5034P5341J50442J82271J30594J03414J74880K11238
$$ 832850754 832893491 832927167 832952201 833027542 833177984 833360255 833490849 833594263 833769143 833980381
2296.5H33980381J58966J40369J99318K60532L14116L56257L38853K79367K47776L25740
$$ 833980381 834139347 834279716 834479034 834739566 835053682 835409939 835748792 836028159 836275935 836601675
2316.9H36601675M72903N45084N01573M31359L75033L23712K39015J34885J53959K13862
$$ 836601675 837074578 837619662 838121235 838552594 838927627 839251339 839490354 839625239 839779198 839993060
2337.3H39993060J86026J73330R5010k48075m04894j5557N95451R89258R74417P55965
$$ 839993060 840179086 840352416 840447426 840199351 839794457 839778900 840374351 841363609 842338026 843093991
2357.7H43093991M22776O1750k02894l08633l88562n26071o11424n40018l70264l25561
$$ 843093991 843516767 843578517 843375623 843066990 842678428 842152357 841540933 841000915 840630651 840305090
2378.1H40305090l59178k75552j11163J5498P9214J34766J81616J51813Q1658O3479
$$ 840305090 839945912 839670360 839559197 839574695 839653909 839788675 839970291 840122104 840203762 840267241
2398.5H40267241J20223J46746N8115j6749M6253J35064P8082k0563K0444P5936m17
$$ 840267241 840387464 840534210 840592325 840575576 840621829 840756893 840834975 840814412 840834856 840910792 840910375
2421H40910375j23083j34349P629J13487O2168K4438N7101L4511l0041k6464L7432
$$ 840910375 840787292 840652943 840660572 840774059 840836227 840860665 840917766 840952277 840922236 840895772 840933204
2443.4H40933204N3286k3603r7454n8055K3127j0193q6545l4392L7193k4915j17719
$$ 840933204 840986490 840962887 840865433 840807378 840830505 840820312 840733767 840699375 840736568 840711653 840593934
2465.8H40593934j24991q4221q0705q7321m0054J2815k3305j33038j49071n0783k7895
$$ 840593934 840468943 840384722 840304017 840216696 840176642 840189457 840166152 840033114 839884043 839833260 839805365
2488.3H39805365r4414j24574r5486m8280n2929q6546o7353n7400j21355j84715j46210
$$ 839805365 839710951 839586377 839490891 839442611 839389682 839303136 839235783 839178383 839057028 838872313 838726103
2510.7H38726103m4286k5868j03832j47223j20938j03891j21236j30117j08420r7514
$$ 838726103 838681817 838655949 838552117 838404894 838283956 838180065 838058829 837928712 837820292 837722778
2531.1H37722778j13308j24514j17779j02699j26898j61529j29044p7903j04785j57237
$$ 837722778 837609470 837484956 837367177 837264478 837137580 836976051 836847007 836769104 836664319 836507082
2551.5H36507082j40369r9599j09852j57892j87278j65880j37865j64092k18034k37405
$$ 836507082 836366713 836267114 836157262 835999370 835812092 835646212 835508347 835344255 835126221 834888816
2571.9H34888816k30372k33531k43187k51174k54333k58565k79248k98917l02136l13401
$$ 834888816 834658444 834424913 834181726 833930552 833676219 833417654 833138406 832839489 832537353 832223952
2592.3H32223952l37839l44575l45886l57925l93272m31180m11391l87609m37200n00560
$$ 832223952 831886113 831541538 831195652 830837727 830444455 830013275 829601884 829214275 828777075 828276515
2612.7H28276515m84347m17173l99769m26292m49717m40478m19617n01394n88537n14626
$$ 828276515 827792168 827374995 826975226 826548934 826099217 825658739 825239122 824737728 824149191 823634565
2633.1H23634565m27246m51148m91082m66526m24683m40359m79400m85123m66167m64201
$$ 823634565 823207319 822756171 822265089 821798563 821373880 820933521 820454121 819968998 819502831 819038630
2653.5H19038630m87149m76301m24862m12404m68910n14984m69089m09424m62830n39422
$$ 819038630 818551481 818075180 817650318 817237914 816769004 816254020 815784931 815375507 814912677 814373255
2673.9H14373255m80056l99530m78387n97417n63979m69089m78804n38826n39839n07951
$$ 814373255 813893199 813493669 813015282 812417865 811853886 811384797 810905993 810367167 809827328 809319377
2694.3H09319377n11944n46575n66781n49733n36084n75781o34611o22630n70357o16312
$$ 809319377 808807433 808260858 807694077 807144344 806608260 806032479 805397868 804775238 804204881 803588569
2714.6H03588569o84500o34789n91219o31868o46055o33121o39081o34670o31273n99324
$$ 803588569 802904069 802269280 801678061 801046193 800400138 799767017 799127936 798493266 797861993 797262669
2735G97262669n33104n48840o54399o92249o02543n31375n89252o72519o82771o76513
$$ 797262669 796729565 796180725 795526326 794834077 794231534 793700159 793110907 792438388 791755617 791079104
2755.4G91079104p09176p34031o93381o59943p04527p70986p99358p74741p79807q78215
$$ 791079104 790369928 789635897 788942516 788282573 787578046 786807060 786007702 785232961 784453154 783574939
2775.8G83574939r26912q63910q42809r10819r40323r04798r44674j070083j129984
$$ 783574939 782648027 781784117 780941308 780030489 779090166 778185368 777240694 776170611 775040627
2794.2G75040627j070679j033067j122475j211464j202405j172662j207769j312196
$$ 775040627 773969948 772936881 771814406 770602942 769400537 768227875 767020106 765707910
2810.5G65707910j386702j373768j378238j439929j481116j505196j555204j648903
$$ 765707910 764321208 762947440 761569202 760129273 758648157 757142961 755587757 753938854
2826.8G53938854j729906j786113j910209k105475k380192k804995l347456l961742
$$ 753938854 752208948 750422835 748512626 746407151 744026959 741221964 737874508 733912766
2843.1G33912766m623413m967570m504562l395378k260864j449108r97722r28998j198769
$$ 733912766 729289353 724321783 719817221 716421843 714160979 712711871 711714149 710785151 709586382
2861.5G09586382j613259k057374k484977k716482k602696k324581k105534j900912
$$ 709586382 707973123 705915749 703430772 700714290 698111594 695787013 693681479 691780567
2877.8F91780567j705825j614809j661539j808942j981198k126992k185404k234161
$$ 691780567 690074742 688459933 686798394 684989452 683008254 680881262 678695858 676461697
2894.1F76461697k370239k459109k453207k510548k706587k973080l292382l731370
$$ 676461697 674091458 671632349 669179142 666668594 663962007 660988927 657696545 653965175
2910.4F53965175m275739m687309m616857m073679l397286k730489k028227j292586
$$ 653965175 649689436 645002127 640385270 636311591 632914305 630183816 628155589 626863003
2926.8F26863003o48976j77145K99395Q96751J471162J927793K289176K451003K247691
$$ 626863003 626214027 626036882 626336277 627233028 628704190 630631983 632921159 635372162 637619853
2945.1F37619853J717091J110434O27637K02298j63436k53677n1916K24471M09603
$$ 637619853 639336944 640447378 641075015 641277313 641113877 640860200 640808284 641032755 641442358
2963.5F41442358N13256N98848O44505O55651O26803N42283N48243O31809N62787M59135
$$ 641442358 641955614 642554462 643198967 643854618 644481421 645023704 645571947 646203756 646766543 647225678
2983.9F47225678N17666N48959M19200J69813j44005m13715p01368j003862j147687
$$ 647225678 647743344 648292303 648711503 648881316 648737311 648323596 647622228 646618366 645470679
3002.2F45470679j219928j313806j318216j267076j352250j581312j774490j856982
$$ 645470679 644250751 642936945 641618729 640351653 638999403 637418091 635643601 633786619
3018.5F33786619j889170j928508k017081k110183k100944k047778k066373k197028
$$ 633786619 631897449 629968941 627951860 625841677 623740733 621692955 619626582 617429554
3034.9F17429554k352237k358198k307773k410889k596795k677441k623379k603710
$$ 617429554 615077317 612719119 610411346 608000457 605403662 602726221 600102842 597499132
3051.2E97499132k672016k684892k698540k761007k693176k515018k448201k546728
$$ 597499132 594827116 592142224 589443684 586682677 583989501 581474483 579026282 576479554
3067.5E76479554k656221k648413k588571k511143k411783k451479k592445k665579
$$ 576479554 573823333 571174920 568586349 566075206 563663423 561211944 558619499 555953920
3083.8E55953920k707005k699434k656162k710045k792716k754390k679586k757311
$$ 555953920 553246915 550547481 547891319 545181274 542388558 539634168 536954582 534197271
3100.1E34197271k939046k977907k858460k831876k989114l054142k914965k906382
$$ 534197271 531258225 528280318 525421858 522589982 519600868 516546726 513631761 510725379
3116.4E10725379l127694l361464l446579l359437l280550l296614l351032l426105
$$ 510725379 507597685 504236221 500789642 497430205 494149655 490853041 487502009 484075904
3132.8D84075904l445417l377080l347039l480911l635794l632784l558010l476024
$$ 484075904 480630487 477253407 473906368 470425457 466789663 463156879 459598869 456122845
3149.1D56122845l441691l571838l753185l796339l762186l732443l705233l711820
$$ 456122845 452681154 449109316 445356131 441559792 437797606 434065163 430359930 426648110
3165.4D26648110l725976l712922l708959l739059l762394l739953l688872l658920
$$ 426648110 422922134 419209212 415500253 411761194 407998800 404258847 400569975 396911055
3181.7C96911055l645390l621370l594697l582626l574550l538341l485292l431797
$$ 396911055 393265665 389644295 386049598 382466972 378892422 375354081 371868789 368436992
3198C68436992l392070l348500l286391l237009l214270l180683l103793l020674k977460
$$ 368436992 365044922 361696422 358410031 355173022 351958752 348778069 345674276 342653602 339676142
3216.4C39676142k960891k920598k872526k846599k797067k703935k606153k547175
$$ 339676142 336715251 333794653 330922127 328075528 325278461 322574526 319968373 317421198
3232.7C17421198k577692k603412k516210k407968k329916k260536k221227k204835
$$ 317421198 314843506 312240094 309723884 307315916 304986000 302725464 300504237 298299402
3249B98299402k166748k107531k061754k053082k059549k048225j998752j924336j876533
$$ 298299402 296132654 294025123 291963369 289910287 287850738 285802513 283803761 281879425 280002892
3267.4B80002892j832277j833140j921684j994491j971304j902491j862168j849115
$$ 280002892 278170615 276337475 274415791 272421300 270449996 268547505 266685337 264836222
3283.7B64836222j860261j836300j745462j726777j800865j849472j875341j861841
$$ 264836222 262975961 261139661 259394199 257667422 255866557 254017085 252141744 250279903
3300B50279903j765832j667023j664579j774638j922071j945138j802832j711950j755580
$$ 250279903 248514071 246847048 245182469 243407831 241485760 239540622 237737790 236025840 234270260
3318.4B34270260j757294j651824j574486j624570j699447j662150j569927j491532
$$ 234270260 232512966 230861142 229286656 227662086 225962639 224300489 222730562 221239030
3334.7B21239030j407504j407996j509785j510874j406714j319766j259133j293347
$$ 221239030 219831526 218423530 216913745 215402871 213996157 212676391 211417258 210123911
3351B10123911j369476j338735j187608j010775r78768j031503r04143p50318q54165
$$ 210123911 208754435 207415700 206228092 205217317 204238549 203207046 202302903 201552585 200698420
3369.3B00698420j025378r60857p41228o26296n88596n38558m41000k65538l6449J52186
$$ 200698420 199673042 198712185 197970957 197344661 196756065 196217507 195776507 195510969 195474520 195626706
3389.7A95626706N0187k31951j73077K33635M35680J71423j19165L4675L44634M67942
$$ 195626706 195676893 195444942 195271865 195505500 195941180 196112603 195993438 196028113 196372747 196840689
3410.1A96840689M74095M34712M18424N24148O84500P70018Q48412J006067J161546
$$ 196840689 197314784 197749496 198167920 198692068 199376568 200146586 200994998 202001065 203162611
3428.5B03162611J163795J213104J366779J245573R65044R91881J277774J527101J635403
$$ 203162611 204326406 205539510 206906289 208151862 209116906 210108787 211386561 212913662 214549065
3446.8B14549065J589730J590952J721308J856357J989916K125770K092838K064153
$$ 214549065 216138795 217729747 219451055 221307412 223297328 225423098 227515936 229580089
3463.2B29580089K345741K560988K302841J910224J938418K234787K508521K598509
$$ 229580089 231925830 234486818 236789659 238699883 240638301 242873088 245381609 247980118
3479.5B47980118K423584K396703K626181K712249K657175K713800K874970L012896
$$ 247980118 250403702 252800405 255426586 258138835 260796010 263509810 266384780 269397676
3495.8B69397676K994090K979875L083676L038585K858460K951533L269076L473431
$$ 269397676 272391766 275371641 278455317 281493902 284352362 287303895 290572971 294046402
3512.1B94046402L446221L306359L362716L639757L895074L812939L600180L671974
$$ 294046402 297492623 300798982 304161698 307801455 311696529 315509468 319109648 322781622
3528.4C22781622L861010L978998M155785M251152M152447M278749M569620M600704
$$ 322781622 326642632 330621630 334777415 339028567 343181014 347459763 352029383 356630087
3544.7C56630087M354268M217714M397691M671365M749387M787028M970401N068452
$$ 356630087 360984355 365202069 369599760 374271125 379020512 383807540 388777941 393846393
3561.1C93846393M958093M975349N523711N779773N396813N307168N599707N840719
$$ 393846393 398804486 403779835 409303546 415083319 420480132 425787300 431387007 437227726
3577.4D37227726O011784O170303O179869O138950O352604O496370O253302O346106
$$ 437227726 443239510 449409813 455589682 461728632 468081236 474577606 480830908 487177014
3593.7D87177014O759853O917685O868839O840527O731928O637215O996930P279217
$$ 487177014 493936867 500854552 507723391 514563918 521295846 527933061 534929991 542209208
3610E42209208P138312P098913O995738P146418P556557P086814O411493O410479P340849
$$ 542209208 549347520 556446433 563442171 570588589 578145146 585231960 591643453 598053932 605394781
3628.4F05394781P803738O685793O215871O341040O304383O285071O135643N813002
$$ 605394781 613198519 619884312 626100183 632441223 638745606 645030677 651166320 656979322
3644.7F56979322N800128O367505O230831M979968M511237N069197M984319M321277
$$ 656979322 662779450 669146955 675377786 680357754 684868991 689938188 694922507 699243784
3661F99243784M031837L928840L744185L777087L798365L281475L203928L176451K599418
$$ 699243784 703275621 707204461 710948646 714725733 718524098 721805573 725009501 728185952 730785370
3679.4G30785370K435803K571106K650380K858103K789616K102316J692831J711011
$$ 730785370 733221173 735792279 738442659 741300762 744090378 746192694 747885525 749596536
3695.7G49596536J703859J630306J633465J565516J418710J417398J458943J321912
$$ 749596536 751300395 752930701 754564166 756129682 757548392 758965790 760424733 761746645
3712G61746645J047015R18389J039385J174808J111269R08434P80046P91371Q49545
$$ 761746645 762793660 763712049 764751434 765926242 767037511 767945945 768725991 769517362 770366907
3730.3G70366907R96232J084566R35853O45637L31700K54870O59108Q65936N88358
$$ 770366907 771363139 772447705 773383558 774029195 774360895 774615765 775274873 776140809 776729167
3748.7G76729167N21600N41627M54605M03344M55678N51283N34416N14924M73321L55839
$$ 776729167 777250767 777792394 778246999 778650343 779106021 779657304 780191720 780706644 781179965 781535804
3769.1G81535804L01361L13700L89158N37813N54502L32654J62363J89125K69532L52621
$$ 781535804 781837165 782150865 782540023 783077836 783632338 783964992 784127355 784316480 784586012 784938633
3789.5G84938633L94285L67999M31955M53472K68877K70188L40521K21312J71602J32918
$$ 784938633 785332918 785700917 786132872 786586344 786855221 787125409 787465930 787687242 787858844 787991762
3809.9G87991762J79589L30150M29750L53992K07424J38819J9133M2319J68443J83463
$$ 787991762 788171351 788501501 788931251 789285243 789492667 789631486 789650619 789692938 789861381 790044844
3830.3G90044844K50995L78311L40700J12057n0366j5557Q3566J41680J44899O5088
$$ 790044844 790295839 790674150 791014850 791126907 791076541 791060984 791144550 791286230 791431129 791496217
3850.7G91496217O7830K63572K11895K563o4552O0677J96815J21713P3552J65701Q7082
$$ 791496217 791564047 791827619 792039514 792042077 791977525 792038202 792235017 792356730 792430282 792595983 792683065
3873.1G92683065o0320n6386J21176K61069J42872L3557J3173r54q106p5936p0870
$$ 792683065 792622745 792566359 792687535 792948604 793091476 793125033 793138206 793137252 793129146 793053210 792982340
3895.5G92982340J03474K20298J48893M9710m4107j39952j74999r7275Q4281K03073
$$ 792982340 793085814 793306112 793455005 793504715 793460608 793320656 793145657 793048382 793132663 793335736
3915.9G93335736J34408K0325j6331L993K1637j4067J1563J07944J01567M1008K9444
$$ 793335736 793470144 793490469 793474138 793478131 793499768 793485701 793497264 793605208 793706775 793747783 793777227
3938.4G93777227o914k8431M1604J16169Q0765m3989q7380l3617K2411R4176J54853
$$ 793777227 793770313 793741882 793783486 793899655 793980420 793936431 793849051 793815434 793837845 793932021 794086874
3960.8G94086874J40666Q8156O1869N1201N0008Q1718J06871Q6606P7486J04427J24037
$$ 794086874 794227540 794315696 794377565 794428766 794478774 794560492 794667363 794753969 794831455 794935882 795059919
3983.2G95059919J05083O7056O1512N2154J8656N7101J59621
$$ 795059919 795165002 795232058 795293570 795345724 795364380 795421481 795581102
3997.5G95581102
$$ 795581102
##END=$$ End of the data block
