##TITLE=$$ Begin of the data block
##JCAMP-DX=5.00 $$ ACD/SpecManager v 10.08
##SPECTROMETER/DATA SYSTEM=Alpha
##DATE=15 Apr 2014 09:00:42
##DATA TYPE=INFRARED SPECTRUM
##DATA CLASS=XYDATA
##ORIGIN=
##OWNER=
##NPOINTS=1765
##FIRSTX=399.75695801
##LASTX=3997.56933594
##MAXX=3997.56933594
##MINX=399.75695801
##MAXY=0.84539270
##MINY=0.19544803
##XFACTOR=1.0000000000
##YFACTOR=1.000000000000000e-9
##FIRSTY=0.58329087
##DELTAX=2.03957629
##XUNITS=1/CM
##YUNITS=ARBITRARY UNITS
##XYDATA=(X++(Y..Y))
$$ plain form
399.8 583290875 580874145 580150425 579304874 577168941 574931562 573865950 573247492 572439611 572011292
418.1 572011292 571733594 570742428 569254577 568205476 568122447 567971587 566841781 565453231 564524353
436.5 564524353 563769162 562875569 562214851 562272429 562394798 561739862 561047137 561023772 560872793 559899032
456.9 559899032 558720469 558204353 557881236 556872904 555513740 554689765 554022849 552812338 551486254
475.2 551486254 550525427 549780905 548945189 548139930 547665775 547325134 546669960 545565963 544294775
493.6 544294775 543074012 541817904 540498853 539256454 538222969 537277460 536093175 534727275 533657134
511.9 533657134 532866597 531716049 530059755 528462172 527120113 525500774 523302972 521202862 519677579
530.3 519677579 518135726 516175449 514515221 513703525 513057947 511988521 510993779 510398269 509516120
$$ packed form
399.8E83290875k416730p23720q45551k135933k237379j065612o18458q07881m28319
418.1E72011292k77698r91166j487851j049101q3029j50860j129806j388550r28878
436.5E64524353p55191q93593o60718N7578J22369o54936o92725k3365j50979r73761
456.9E59899032j178563n16116l23117j008332j359164q23975o66916j210511j326084
475.2E51486254r60827p44522q35716q05259m74155l40641o55174j103997j271188
493.6E44294775j220763j256108j319051j242399j033485r45509j184285j365900j070141
511.9E33657134p90537j150548j656294j597583j342059j619339k197802k100110j525283
530.3E19677579j541853j960277j660228q11696o45578j069426r94742n95510q82149
$$ plain form
548.6 509516120 507928073 506231129 505007327 503866136 502134144 500043750 498154342 496183395
565 496183395 493461370 490157425 487064242 484372318 481592804 478658915 476043165 473692894 471113354
583.3 471113354 468345612 465938300 463707805 460900873 457655400 454834312 452512324 449760109
599.6 449760109 446219921 442814708 440485716 439023405 437788755 436521202 435498774 435370386 436648607
618 436648607 439336091 442880124 446584642 449942142 453122497 456664711 460661709 464712530 468528003
636.3 468528003 471944094 474485636 475785911 476835221 479308605 482900649 485428095 485548973 484344125
654.7 484344125 485098362 489930779 496804416 502702594 506924033 510870636 515093267 517943859 520358980
673.1 520358980 523129523 525939822 528515041 530834794 533001840 534934998 536479712 537779212
$$ packed form
548.6E09516120j588047j696944j223802j141191j731992k090394j889408j970947
565D96183395k722025l303945l093183k691924k779514k933889k615750k350271k579540
583.3D71113354k767742k407312k230495k806932l245473k821088k321988k752215
599.6D49760109l540188l405213k328992j462311j234650j267553j022428j28388J278221
618D36648607K687484L544033L704518L357500L180355L542214L996998M050821L815473
636.3D68528003L416091K541542J300275J049310K473384L592044K527446J20878j204848
654.7D84344125P54237M832417O873637N898178M221439L946603M222631K850592K415121
673.1E20358980K770543K810299K575219K319753K167046J933158J544714J299500
$$ plain form
689.4 537779212 539103687 540380418 541280746 541741848 542289853 543313146 544586778 545866668 547363162
707.7 547363162 549343646 551619709 553847492 556093037 558590531 561102390 563307583 565508068
724 565508068 568146586 570882738 573082805 574886441 576916397 579119086 580800831 582013667 583639443
742.4 583639443 585910976 587996840 589562118 591348350 593767047 596135974 597936511 599835575
758.7 599835575 602442563 605107069 607059062 608843327 611191988 613531530 614892781 615522206 616280019
777.1 616280019 616902292 616542578 615598440 615187943 615384340 615660787 616444349 618917584 623246253
795.4 623246253 628391504 633902669 640310287 647464871 653984904 659121871 663680375 668252647
811.7 668252647 672049105 674370646 675830007 677058220 677305400 675738513 672951400 669868350 666326106
$$ packed form
689.4E37779212J324475J276731R00328M61102N48005J023293J273632J279890J496494
707.7E47363162J980484K276063K227783K245545K497494K511859K205193K200485
724E65508068K638518K736152K200067J803636K029956K202689J681745J212836J625776
742.4E83639443K271533K085864J565278J786232K418697K368927J800537J899064
758.7E99835575K606988K664506J951993J784265K348661K339542J361251O29425P57813
777.1F16280019O22273l59714r44138m10497J96397K76447P83562K473235M328669
795.4F23246253N145251N511165O407618P154584O520033N136967M558504M572272
811.7F68252647L796458K321541J459361J228213K47180j566887k787113l083050l542244
$$ plain form
830.1 666326106 661832929 657003045 652852595 649171114 645045042 640592813 636805654 634114027
846.4 634114027 632442415 632460296 635415554 641490579 649545252 658677459 668879569 679836392
862.7 679836392 690263629 699216306 707047760 714230835 720227361 724498093 727684379 730588078
879.1 730588078 732788742 733491123 733009636 732277334 731405556 729922593 728186488 727341533 727839649
897.4 727839649 729097903 730654001 732638001 734967232 736853182 737601757 737335801 736290812 734114766
915.8 734114766 730504811 726058662 721917629 718661368 716335654 715276778 715872765 717694163 719628215
934.1 719628215 721055925 722326636 723730028 724797964 725078881 724843502 724413574 723267496 720661342
952.5 720661342 716722488 711991251 706198692 698523819 688789606 677379906 664221704 648822606
$$ packed form
830.1F66326106m493177m829884m150450l681481m126072m452229l787159k691627
846.4F34114027j671612J7881K955258O075025Q054673R132207J0202110J0956823
862.7F79836392J0427237Q952677P831454P183075N996526M270732L186286K903699
879.1G30588078K200664P02381m81487p32302q71778j482963j736105q44955M98116
897.4G27839649J258254J556098J984000K329231J885950P48575k65956j044989k176046
915.8G34114766l609955m446149m141033l256261k325714j058876N95987J821398J934052
934.1G19628215J427710J270711J403392J067936K80917k35379m29928j146078k606154
952.5G20661342l938854m731237n792559p674873r734213j1409700j3158202j5399098
$$ plain form
968.8 648822606 631594956 614200890 598157227 583899558 571321070 560287714 550834179 543100476
985.1 543100476 536608398 530731738 525520921 520945311 516790807 513338387 510890484 509047210
1001.4 509047210 507032037 504358172 500825405 496077269 489806712 482421547 474823833 467571795
1017.7 467571795 460593939 453799874 447503239 441879421 436588526 431384265 426596403 422535717
1034.1 422535717 418995738 415698826 412740916 410271317 408051163 405627340 402924955 400337011
1050.4 400337011 398271054 397055984 397074521 398524255 400884211 402968973 403671861 402462035 399230421
1068.7 399230421 394131541 387702376 380679518 373487115 366133183 358770251 351918668 345970869
1085 345970869 340703160 335628390 330767602 326716751 324003577 322660625 322441876 323037654 324068993
$$ packed form
968.8F48822606j7227650j7394066j6043663j4257669j2578488j1033356r453535p733703
985.1E43100476o492078n876660n210817m575610m154504l452420k447903j843274
1001.4E09047210k015173k673865l532767m748136o270557p385165p597714p252038
1017.7D67571795o977856o794065o296635n623818n290895n204261m787862m060686
1034.1D22535717l539979l296912k957910k469599k220154k423823k702385k587944
1050.4D00337011k065957j215070J8537J449734K359956K084762P02888j209826l231614
1068.7C99230421n098880o429165p022858p192403p353932p362932o851583n947799
1085C45970869n267709n074770m860788m050851k713174j342952k18749N95778J031339
$$ plain form
1103.4 324068993 325091213 325870365 326489180 327001303 327144891 326327652 323821545 319233239 313596487
1121.8 313596487 309747249 309690654 312187195 314651400 315566182 315117180 315005749 316566020 319413483
1140.1 319413483 322485238 325202614 327480465 329475433 331377447 333355129 335656047 338548005
1156.4 338548005 342302263 347310334 354019493 362669230 373089880 384710640 396858633 408954293
1172.7 408954293 420521438 431284964 441189587 450171828 457986593 464296132 468810290 471367002
1189.1 471367002 472031504 471228242 469734013 468505830 468415409 469974488 473197013 477634817 482531369
1207.4 482531369 487078249 490738541 493443072 495527029 497349352 499023974 500613630 502306819
1223.7 502306819 504259527 506425142 508727610 511234939 514005840 516944945 519875288 522707641
$$ packed form
1103.4C24068993J022220P79152O18815N12123J43588q17239k506107m588306n636752
1121.8C13596487l849238n6595K496541K464205R14782m49002j11431J560271K847463
1140.1C19413483L071755K717376K277851J994968J902014J977682K300918K891958
1156.4C38548005L754258N008071O709159Q649737J0420650J1620760J2147993J2095660
1172.7D08954293J1567145J0763526R904623Q982241P814765O309539M514158K556712
1189.1D71367002O64502q03262j494229j228183r0421J559079L222525M437804M896552
1207.4D82531369M546880L660292K704531K083957J822323J674622J589656J693189
1223.7E02306819J952708K165615K302468K507329K770901K939105K930343K832353
$$ plain form
1240.1 522707641 525432706 527905941 529887557 531339765 532416105 533236384 533882856 534595907 535755277
1258.4 535755277 537580252 540073812 543261290 547279060 552118719 557515800 563210070 569154084
1274.7 569154084 575360179 581630051 587774396 593953073 600409448 607080698 613676250 620021760
1291 620021760 626126468 631876171 637006462 641446590 645376682 648897469 651906371 654422402 656660438
1309.4 656660438 658680737 660329640 661608815 662828624 664154291 665484428 666809738 668223381
1325.7 668223381 669686258 670923829 671652138 671886027 671882331 671770871 671510041 671248972 671305776 671741068
1346.1 671741068 672293782 672725081 673009157 673138678 672980368 672505438 671772480 670669675 669105709
1364.5 669105709 667273521 665360987 663520336 661588073 659070849 655793309 651049554 643401742
$$ packed form
1240.1E22707641K725065K473235J981616J452208J076340Q20279O46472P13051J159370
1258.4E35755277J824975K493560L187478M017770M839659N397081N694270N944014
1274.7E69154084O206095O269872O144345O178677O456375O671250O595552O345510
1291F20021760O104708N749703N130291M440128L930092L520787L008902K516031K238036
1309.4F56660438K020299J648903J279175J219809J325667J330137J325310J413643
1325.7F68223381J462877J237571P28309K33889l696j11460k60830k61069N6804M35292
1346.1F71741068N52714M31299K84076J29521j58310m74930p32958j102805j563966
1364.5F69105709j832188j912534j840651j932263k517224l277540m743755p647812
$$ plain form
1380.8 643401742 634536684 630182683 632688582 637278438 639672935 640146077 639429033 637750566 635173559
1399.1 635173559 631931782 628364921 624507427 620742679 617386937 614391804 611903012 610132217
1415.5 610132217 608781099 607314348 605984926 605131924 604586244 604210794 603919864 603883982 604391456
1433.8 604391456 605400741 606626868 608031332 609900773 612133920 614660621 617699146 621301353
1450.1 621301353 625396132 630279481 637234986 645823121 653033018 659600735 667010427 674704492
1466.4 674704492 681980312 689889967 699214816 707903445 714508355 719588101 723620713 726869881
1482.8 726869881 729267001 730697215 730927825 729972005 728492200 726558387 723551452 719755888 715998709
1501.1 715998709 712502658 708141625 701190412 694065213 687987745 682131052 676705301 672071874
$$ packed form
1380.8F43401742q865058m354001K505899M589856K394497M73142p17044j678467k577007
1399.1F35173559l241777l566861l857494l764748l355742k995133k488792j770795
1415.5F10132217j351118j466751j329422q53002n45680l75450k90930l5882N07474
1433.8F04391456J009285J226127J404464J869441K233147K526701L038525L602207
1450.1F21301353M094779M883349O955505Q588135P209897O567717P409692P694065
1466.4F74704492P275820P909655R324849Q688629O604910N079746M032612L249168
1482.8G26869881K397120J430214K30610r55820j479805j933813l006935l795564l757179
1501.1G15998709l496051m361033o951213p125199o077468n856693n425751m633427
$$ plain form
1517.4 672071874 668240726 664234102 660076559 656341970 652599990 649168193 646090746 642898440
1533.7 642898440 640238822 638374448 636258721 633830845 632008851 630765975 630189240 630315423 631047130
1552.1 631047130 632225156 633682489 634933591 634820461 633796692 632466912 630720019 628162146
1568.4 628162146 624319255 620060802 615282774 608590961 601388335 594578505 587296307 579591870
1584.7 579591870 571596980 563385546 555083930 546818674 538550198 530459046 522684634 515094697
1601.1 515094697 507627964 500390768 493294388 486055970 478908479 472220987 465225160 457317799
1617.4 457317799 450607330 444889247 438687384 432664454 427264869 422433347 418742836 415968508
1633.7 415968508 413358152 411525518 410919100 411289155 412472516 414530396 417211890 419882894 423495024
$$ packed form
1517.4F72071874l831148m006624m157543l734589l741980l431797l077447l192306
1533.7F42898440k659618j864374k115727k427876j821994j242876n76735J26183P31707
1552.1F31047130J178026J457333J251102j13130j023769j329780j746893k557873
1568.4F28162146l842891m258453m778028o691813p202626o809830p282198p704437
1584.7E79591870p994890q211434q301616q265256q268476q091152p774412p589937
1601.1E15094697p466733p237196p096380p238418p147491o687492o995827p907361
1617.4D57317799o710469n718083o201863o022930n399585m831522l690511k774328
1633.7D15968508k610356j832634o06418L70055J183361K057880K681494K671004L612130
$$ plain form
1652 423495024 428637117 433105141 437553942 443266124 450338632 457983315 465369195 473699749 483243108
1670.4 483243108 492166489 501562715 512013793 521849096 531371176 542274296 555703640 567771494
1686.7 567771494 578016341 588781655 599345207 610873699 623410761 635873318 649514437
1701 649514437 660964847 670574248 680147290 688574195 696060538 703031540 709740996 716480136
1717.3 716480136 722191572 726606667 730816543 735218048 739517927 743667662 747623265 751898170
1733.6 751898170 755945385 759180605 762627423 766470432 770363688 774253607 778118014 782015145
1749.9 782015145 785763681 788946152 791828096 794657528 797366619 799834728 801802695 803653836
1766.3 803653836 805743217 807795227 809465408 810798764 812112272 813554883 814895630 816076458
$$ packed form
1652D23495024N142093M468024M448801N712182P072508P644683P385880Q330554R543359
1670.4D83243108Q923381R396226J0451078R835303R522080J0903120J3429344J2067854
1686.7E67771494J0244847J0765314J0563552J1528492J2537062J2462557J3641119
1701F49514437J1450410R609401R573042Q426905P486343O971002O709456O739140
1717.3G16480136N711436M415095M209876M401505M299879M149735L955603M274905
1733.6G51898170M047215L235220L446818L843009L893256L889919L864407L897131
1749.9G82015145L748536L182471K881944K829432K709091K468109J967967J851141
1766.3H03653836K089381K052010J670181J333356J313508J442611J340747J180828
$$ plain form
1782.6 816076458 817353606 818672121 819883645 821122825 822410643 823419034 824216843 825062931 826020777
1800.9 826020777 826911151 827623427 828299463 829106212 829941928 830527186 830975354 831558049 832281172 832960367
1821.3 832960367 833574235 834203064 834861159 835412502 835723281 836032569 836495161 836945117 837328732 837857366
1841.7 837857366 838501811 838889658 838991821 839138985 839473188 839852333 840141058 840408206 840758801 841123104
1862.1 841123104 841461003 841842234 842222095 842405140 842413247 842476189 842682600 842927396 843090236 843234420
1882.5 843234420 843461573 843717158 843881488 843975544 844123840 844289601 844357491 844400406 844521284 844655991
1902.9 844655991 844743371 844813585 844914377 845014513 845065415 845155358 845315516 845392704 845332325 845262349 845276058
1925.3 845276058 845324993 845297813 845238566 845270693 845325291 845272481 845166445 845137000 845116377 844970345 844749451
$$ packed form
1782.6H16076458J277148J318515J211524J239180J287818J008391P97809Q46088R57846
1800.9H26020777Q90374P12276O76036Q06749Q35716N85258M48168N82695P23123O79195
1821.3H32960367O13868O28829O58095N51343L10779L09288M62592M49956L83615N28634
1841.7H37857366O44445L87847J02163J47164L34203L79145K88725K67148L50595L64303
1862.1H41123104L37899L81231L79861J83045Q107O2942K06411K44796J62840J44184
1882.5H43234420K27153K55585J64330R4056J48296J65761O7890M2915J20878J34707
1902.9H44655991Q7380P0214J00792J00136N0902Q9943J60158P7188o0379o9976J3709
1925.3H45276058M8935k7180n9247L2127N4598n2810j06036k9445k0623j46032k20894
$$ plain form
1947.8 844749451 844612718 844592631 844495714 844236314 844012260 843921781 843790114 843587279 843470812 843431056
1968.2 843431056 843290210 843010962 842789590 842712879 842605233 842375576 842193425 842143655 842065454 841842413
1988.6 841842413 841620445 841497958 841315448 841015995 840767324 840647697 840497911 840220392 839927018 839741051
2009 839741051 839579999 839305639 838990629 838769019 838572443 838260055 837925792 837715030 837553740 837298870
2029.4 837298870 836986005 836749554 836585760 836354673 836024642 835745096 835556149 835311890 834952533 834628761
2049.8 834628761 834445059 834264815 833956718 833675206 833554089 833434761 833185792 832921565 832788169 832687736
2070.2 832687736 832492948 832287252 832185984 832120180 831977367 831829548 831779838 831758320 831634223 831447363
2090.5 831447363 831346214 831320047 831217945 831066608 831045568 831135929 831123054 830977559 830891609 830909789 830877244
$$ packed form
1947.8H44749451j36733k0087r6917k59400k24054r0479j31667k02835j16467l9756
1968.2H43431056j40846k79248k21372p6711j07646k29657j82151m9770p8201k23041
1988.6H41842413k21968j22487j82510k99453k48671j19627j49786k77519k93374j85967
2009H39741051j61052k74360l15010k21610j96576l12388l34263k10762j61290k54870
2029.4H37298870l12865k36451j63794k31087l30031k79546j88947k44259l59357l23772
2049.8H34628761j83702j80244l08097k81512j21117j19328k48969k64227j33396j00433
2070.2H32687736j94788k05696j01268o5804j42813j47819m9710k1518j24097j86860
2090.5H31447363j01149k6167j02102j51337k1040R0361j2875j45495q5950J8180l2545
$$ plain form
2113 830877244 830750108 830694377 830776155 830856204 830856025 830880582 830983222 831035972 830997109 831008554 831138790 831250489
2137.5 831250489 831263661 831292212 831400633 831485689 831493318 831548631 831719160 831866503 831898808 831933558 832077265
2159.9 832077265 832215250 832222223 832232416 832384109 832559884 832628131 832687497 832848012 832986653 832997620 832998991
2182.3 832998991 833123505 833296418 833367884 833368182 833426416 833533287 833566427 833542109 833606958 833733857 833757937
2204.8 833757937 833694756 833711743 833817244 833850145 833779156 833774567 833879292 833906829 833810210 833801925 833922505
2227.2 833922505 833943784 833828390 833747685 833760142 833769500 833687603 833608627 833642185 833655477 833527267 833378971
2249.6 833378971 833355963 833411515 833368540 833234191 833202541 833278775 833292723 833244145 833260357 833333910 833374143
2272.1 833374143 833374083 833415389 833498120 833540201 833563387 833646774 833804071 833974242 834089875 834211826 834408581
$$ packed form
2113H30877244j27136n5731Q1778Q0049j79K4557J02640N2750l8863J1445J30236J11699
2137.5H31250489J3172K8551J08421Q5056P629N5313J70529J47343L2305L4750J43707
2159.9H32077265J37985O973J0193J51693J75775O8247N9366J60515J38641J0967J371
2182.3H32998991J24514J72913P1466K98N8234J06871L3140k4318O4849J26899K4080
2204.8H33757937o3181J6987J05501L2901p0989m589J04725K7537r6619q285J20580
2227.2H33922505K1279j15394q0705J2457R358q1897p8976L3558J3292j28210j48296
2249.6H33378971k3008N5552m2975j34349l1650P6234J3948m8578J6212P3553M0233
2272.1H33374143o0M1306Q2731M2081K3186Q3387J57297J70171J15633J21951J96755
$$ plain form
2294.5 834408581 834578454 834666908 834798396 835047424 835345030 835641921 835947752 836272836 836586714 836849689
2314.9 836849689 837152421 837625206 838202477 838671803 838996589 839315057 839681506 840015113 840249002 840435028
2335.3 840435028 840603948 840755284 840931594 841022789 840725362 840267718 840270698 840944231 841986656 842957377
2355.7 842957377 843661487 843980074 844012499 843949437 843771935 843340814 842700422 842059910 841579974 841244459
2376.1 841244459 840917587 840562284 840275526 840155542 840192020 840283632 840374172 840490818 840629280 840739965
2396.5 840739965 840822995 840938151 841061950 841094434 841074705 841147006 841301799 841385067 841389358 841422200 841465831
2418.9 841465831 841433346 841294169 841153979 841176093 841309845 841387808 841422617 841488421 841547310 841535270 841481566
2441.3 841481566 841478467 841518819 841489792 841385186 841335118 841362178 841335595 841244102 841235459 841293871 841262341 841144621
$$ packed form
2294.5H34408581J69873Q8454J31488K49028K97606K96891L05831L25084L13878K62975
2314.9H36849689L02732M72785N77271M69326L24786L18468L66449L33607K33889J86026
2335.3H40435028J68920J51336J76310R1195k97427m57644K980O73533J042425R70721
2355.7H42957377P04110L18587L2425o3062j77502m31121o40392o40512m79936l35515
2376.1H41244459l26872l55303k86758j19984L6478R1612R0540J16646J38462J10685
2396.5H40739965Q3030J15156J23799L2484j9729P2301J54793Q3268M291L2842M3631
2418.9H41465831l2485j39177j40190K2114J33752P7963L4809O5804N8889j2040n3704
2441.3H41481566l099M0352k9027j04606n0068K7060k6583r1493q643N8412l1530j17720
$$ plain form
2465.8 841144621 841052473 840998650 840918541 840808690 840733111 840717256 840681612 840566516 840447605 840394199 840340495
2488.3 840340495 840225577 840121746 840079129 840041697 839957118 839846194 839769840 839708388 839595079 839444399
2508.7 839444399 839330435 839270890 839189470 839035451 838879526 838787913 838718295 838622272 838527322 838458359 838356972
2531.1 838356972 838192403 838034093 837916613 837792516 837641716 837493479 837371647 837296546 837228298 837122023
2551.5 837122023 836999297 836863458 836700737 836513877 836338222 836211681 836091697 835905731 835657835 835417747
2571.9 835417747 835222185 835031509 834796607 834523678 834242046 833952963 833638310 833308458 833002329 832707345
2592.3 832707345 832392275 832077026 831765831 831427038 831021011 830564618 830130398 829717696 829280078 828813493
2612.7 828813493 828354001 827928483 827493727 827009022 826532543 826117873 825710177 825238526 824724674 824240625
$$ packed form
2465.8H41144621r2148n3823q0109j09851p5579j5855l5644j15096j18911n3406n3704
2488.3H40340495j14918j03831m2617l7432q4579j10924p6354o1452j13309j50680
2508.7H39444399j13964n9545q1420j54019j55925r1613o9618r6023r4950o8963j01387
2531.1H38356972j64569j58310j17480j24097j50800j48237j21832p5101o8248j06275
2551.5H37122023j22726j35839j62721j86860j75655j26541j19984j85966k47896k40088
2571.9H35417747j95562j90676k34902k72929k81632k89083l14653l29852l06129k94984
2592.3H32707345l15070l15249l11195l38793m06027m56393m34220m12702m37618m66585
2612.7H28813493m59492m25518m34756m84705m76479m14670m07696m71651n13852m84049
$$ plain form
2633.1 824240625 823795319 823335230 822869956 822451234 822036803 821561277 821030736 820487380 819985330 819519758
2653.5 819519758 819034517 818551898 818137586 817763984 817327678 816822231 816365361 815957427 815479636 814935982
2673.9 814935982 814457893 814066708 813610673 813032866 812468827 812001109 811526775 810971618 810392797 809826970
2694.3 809826970 809274256 808731139 808194518 807669461 807130814 806555033 805946052 805331171 804747462 804146767
2714.6 804146767 803478658 802829087 802237868 801628113 800983608 800350547 799728751 799080372 798420668 797809601
2735 797809601 797236919 796642363 796010554 795383692 794821322 794292033 793687642 793005347 792331398 791673422
2755.4 791673422 790971458 790216863 789473772 788775384 788072407 787308753 786507010 785744846 785002708 784169674
2775.8 784169674 783264637 782389998 781527698 780618846 779683530 778779745 777865946 776812911 775671780
$$ packed form
2633.1H24240625m45306m60089m65274m18722m14431m75526n30541n43356n02050m65572
2653.5H19519758m85241m82619m14312l73602m36306n05447m56870m07934m77791n43654
2673.9H14935982m78089l91185m56035n77807n64039m67718m74334n55157n78821n65827
2694.3H09826970n52714n43117n36621n25057n38647n75781o08981o14881n83709o00695
2714.6H04146767o68109o49571n91219o09755o44505o33061o21796o48379o59704o11067
2735G97809601n72682n94556o31809o26862n62370n29289o04391o82295o73949o57976
2755.4G91673422p01964p54595p43091o98388p02977p63654q01743p62164p42138q33034
2775.8G84169674r05037q74639q62300r08852r35316r03785r13799j053035j141131
$$ plain form
2794.2 775671780 774596453 773543656 772392631 771153688 769916952 768722117 767514348 766218007
2810.5 766218007 764862061 763524294 762159348 760708690 759211302 757696331 756154060 754526794
2826.8 754526794 752803802 751021206 749110222 746994674 744594753 741771281 738418043 734446466
2843.1 734446466 729831457 724883795 720366716 716961086 714705408 713235497 712218642 711314261
2859.5 711314261 710151553 708534122 706459343 704009235 701344907 698727548 696336210 694180608
2875.8 694180608 692272782 690570354 688929021 687255144 685471952 683505595 681383550 679190636
2892.1 679190636 676954627 674632847 672198832 669701934 667162418 664478421 661536455 658262730
2908.4 658262730 654532075 650209904 645444691 640787363 636730313 633354366 630625129 628624082
$$ packed form
2794.2G75671780j075327j052797j151025j238943j236736j194835j207769j296341
2810.5G66218007j355946j337767j364946j450658j497388j514971j542271j627266
2826.8G54526794j722992j782596j910984k115548k399921k823472l353238l971577
2843.1G34446466m615009m947662m517079l405630k255678j469911j016855r04381
2859.5G11314261j162708j617431k074779k450108k664328k617359k391338k155602
2875.8F94180608j907826j702428j641333j673877j783192j966357k122045k192914
2892.1F79190636k236009k321780k434015k496898k539516k683997k941966l273725
2908.4F58262730l730655m322171m765213m657328m057050l375947k729237k001047
$$ plain form
2924.7 628624082 627374172 626738548 626572192 626896083 627816737 629302442 631216168 633475184 635942876
2943.1 635942876 638244510 639979303 641069412 641666532 641843617 641690075 641471207 641434610 641651392
2961.4 641651392 642051756 642571986 643194318 643851876 644492209 645098031 645650208 646217525 646838367 647399604
2981.8 647399604 647884071 648391247 648887992 649269402 649431586 649293125 648891985 648210168 647225976 646081150
3002.2 646081150 644856572 643552661 642233193 640949607 639610171 638059974 636279821 634384632
3018.5 634384632 632485449 630583048 628580987 626485765 624427974 622395873 620275080 618014932
3034.9 618014932 615666270 613358557 611078978 608667195 606083274 603430569 600804150 598175466
3051.2 598175466 595485926 592791438 590093672 587357640 584667802 582091749 579582572 577027082
$$ packed form
2924.7F28624082j249910o35624j66356L23891R20654J485705J913726K259016K467692
2943.1F35942876K301634J734793J090109N97120J77085j53542k18868l6597K16782
2961.4F41651392M00364N20230O22332O57558O40333O05822N52177N67317O20842N61237
2981.8F47399604M84467N07176M96745L81410J62184j38461m01140o81817r84192j144826
3002.2F46081150j224578j303911j319468j283586j339436j550197j780153j895189
3018.5F34384632j899183j902401k002061k095222k057791k032101k120793k260148
3034.9F18014932k348662k307713k279579k411783k583921k652705k626419k628684
3051.2E98175466k689540k694488k697766k736032k689838k576053k509177k555490
$$ plain form
3067.5 577027082 574402452 571803749 569274843 566811025 564387262 561879158 559248686 556594789
3083.8 556594789 553894639 551149249 548445821 545728266 542954564 540193737 537484586 534743607
3100.1 534743607 531833768 528839886 525948226 523087680 520086765 517046988 514144599 511240721
3116.4 511240721 508122683 504776716 501319885 497933656 494652718 491358459 488016546 484632045
3132.8 484632045 481209010 477806896 474418044 470918059 467293203 463680744 460132986 456640154
3149.1 456640154 453169376 449563503 445770741 441968590 438239664 434534818 430835843 427131057
3165.4 427131057 423409730 419672579 415935397 412196428 408446133 404710054 401016265 397333384
3181.7 397333384 393638492 389979482 386403054 382883698 379357129 375849068 372388452 368931115
$$ packed form
3067.5E77027082k624630k598703k528906k463818k423763k508104k630472k653897
3083.8E56594789k700150k745390k703428k717555k773702k760827k709151k740979
3100.1E34743607k909839k993882k891660k860546l000915l039777k902389k903878
3116.4E11240721l118038l345967l456831l386229l280938l294259l341913l384501
3132.8D84632045l423035l402114l388852l499985l624856l612459l547758l492832
3149.1D56640154l470778l605873l792762l802151l728926l704846l698975l704786
3165.4D27131057l721327l737151l737182l738969l750295l736079l693789l682881
3181.7C97333384l694892l659010l576428l519356l526569l508061l460616l457337
$$ plain form
3198 368931115 365490109 362120777 358826429 355572611 352360696 349213868 346104145 343042046 340058059
3216.4 340058059 337087363 334106117 331181884 328347832 325570315 322843045 320219815 317676604
3232.7 317676604 315104783 312511414 309976816 307524860 305185914 302968532 300780684 298536092
3249 298536092 296318978 294232100 292211860 290179104 288140595 286099941 284056485 282054693 280154020
3267.4 280154020 278346002 276501000 274547368 272565246 270621985 268707275 266813993 264949709
3283.7 264949709 263091236 261259496 259516150 257805735 256016970 254151702 252291411 250495613
3300 250495613 248793364 247172236 245480448 243584350 241601169 239685714 237836123 236055315 234357476
3318.4 234357476 232678607 231016830 229387432 227707371 225988388 224364191 222830549 221336976
$$ packed form
3198C68931115l441006l369332l294348l253818l211915l146828l109723l062099k983987
3216.4C40058059k970696k981246k924233k834052k777517k727270k623230k543211
3232.7C17676604k571821k593369k534598k451956k338946k217382k187848k244592
3249B98536092k217114k086878k020240k032756k038509k040654k043456k001792j900673
3267.4B80154020j808018j845002j953632j982122j943261j914710j893282j864284
3283.7B64949709j858473j831740j743346j710415j788765j865268j860291j795798
3300B50495613j702249j621128j691788j896098j983181j915455j849591j780808j697839
3318.4B34357476j678869j661777j629398j680061j718983j624197j533642j493573
$$ plain form
3334.7 221336976 219932392 218532547 217025831 215508848 214046165 212695375 211533606 210343361
3351 210343361 208958283 207571998 206361949 205322027 204339460 203340128 202462211 201744601 200920463
3369.3 200920463 199863777 198839039 198075041 197459802 196899250 196413159 196007490 195710585 195616707
3387.7 195616707 195768520 195872366 195659325 195448026 195691437 196170121 196321785 196171105 196201831 196555495
3408.1 196555495 197045594 197536424 197974116 198413178 198984638 199675217 200397357 201210424 202222422
3426.5 202222422 203413352 204576105 205754310 207133114 208431348 209400728 210358053 211631984 213174433
3444.8 213174433 214808673 216416553 218027607 219725862 221576154 223593384 225700572 227736920
3461.1 227736920 229778200 232121423 234684929 237000406 238892362 240805224 243082598 245649666
$$ packed form
3334.7B21336976j404584j399845j506716j516983j462683j350790j161769j190245
3351B10343361j385078j386285j210049j039922r82567r99332q77917p17610q24138
3369.3B00920463j056686j024738p63998o15239n60552m86091m05669k96905r3878
3387.7A95616707J51813J03846k13041k11299K43411M78684J51664j50680L0726L53664
3408.1A96555495M90099M90830M37692M39062N71460O90579P22140Q13067J011998
3426.5B02222422J190930J162753J178205J378804J298234R69380R57325J273931J542449
3444.8B13174433J634240J607880J611054J698255J850292K017230K107188K036348
3461.1B27736920K041280K343223K563506K315477J891956J912862K277374K567068
$$ plain form
3477.4 245649666 248229951 250630021 253079861 255753130 258394361 260956556 263711572 266662776
3493.8 266662776 269664109 272637427 275654197 278771818 281777918 284586281 287538081 290861130
3510.1 290861130 294393092 297846884 301129311 304463685 308050662 311925143 315785825 319416076
3526.4 319416076 323077589 326948762 330975592 335173905 339435071 343582213 347857296 352419406
3542.7 352419406 357009739 361358017 365570813 369963676 374650240 379431546 384234786 389229447
3559 389229447 394301504 399218917 404190421 409721702 415491492 420905530 426219165 431807339 437655389
3577.4 437655389 443683386 449867964 456070870 462240458 468621343 475174516 481507480 487893373
3593.7 487893373 494653344 501581848 508480072 515331984 522085130 528775513 535759747 542962611
$$ packed form
3477.4B45649666K580285K400070K449840K673269K641231K562195K755016K951204
3493.8B66662776L001333K973318L016770L117621L006100K808363K951800L323049
3510.1B90861130L531962L453792L282427L334374L586977L874481L860682L630251
3526.4C19416076L661513L871173M026830M198313M261166M147142M275083M562110
3542.7C52419406M590333M348278M212796M392863M686564M781306M803240M994661
3559C89229447N072057M917413M971504N531281N769790N414038N313635N588174N848050
3577.4D37655389O027997O184578O202906O169588O380885O553173O332964O385893
3593.7D87893373O759971O928504O898224O851912O753146O690383O984234P202864
$$ plain form
3610 542962611 550103605 557272911 564288378 571415961 579001367 586136639 592535019 598907709 606268048
3628.4 606268048 614114225 620822728 627058983 633422196 639748693 646045029 652165890 657948434
3644.7 657948434 663738251 670157611 676473618 681484282 685973406 690988541 695934713 700287461
3661 700287461 704361796 708272398 711975396 715760171 719589710 722821414 725918591 729070783 731718540
3679.4 731718540 734201670 736807466 739453912 742261648 744986117 747053862 748785913 750593722
3695.7 750593722 752370656 754006147 755626857 757202089 758602142 759939849 761327267 762664437
3712 762664437 763775468 764756024 765833080 766969442 767985880 768861890 769680202 770497024 771370769
3730.3 771370769 772379696 773430705 774351120 775008678 775359929 775601149 776179612 777015567 777619004
$$ packed form
3610E42962611P140994P169306P015467P127583P585406P135272O398380O372690P360339
3628.4F06268048P846177O708503O236255O363213O326497O296336O120861N782544
3644.7F57948434N789817O419360O316007N010664M489124N015135M946172M352748
3661G00287461M074335L910602L702998L784775L829539L231704L097177L152192K647757
3679.4G31718540K483130K605796K646446K807736K724469K067745J732051J807809
3695.7G50593722J776934J635491J620710J575232J400053J337707J387418J337170
3712G62664437J111031R80556J077056J136362J016438Q76010Q18312Q16822Q73745
3730.3G71370769J008927J051009R20415O57558L51251K41220N78463Q35955O03437
$$ plain form
3748.7 777619004 778154016 778771639 779325724 779786885 780223370 780688047 781165361 781693041 782178044 782537341
3769.1 782537341 782874107 783193886 783553720 784073889 784622610 784963429 785148263 785350621 785609603 785923362
3789.5 785923362 786267042 786597848 787019610 787509620 787829101 788105607 788411975 788594007 788793862 789039791
3809.9 789039791 789285421 789570034 789927542 790241778 790431559 790623009 790731430 790805399 790976703 791186035
3830.3 791186035 791460812 791790843 792000353 792057335 792056799 792027354 792066872 792235553 792438388 792535543 792599618
3852.7 792599618 792821586 792978108 792978108 793015540 793218195 793498814 793633997 793644488 793713868 793748438 793684483
3875.2 793684483 793608189 793639600 793824852 793995738 794123709 794193804 794165969 794131398 794104636 794090152 794168890
3897.6 794168890 794335485 794450283 794468105 794413626 794293284 794204473 794205070 794267595 794384480 794489086 794481039
$$ packed form
3748.7G77619004N35012O17623N54085M61161M36485M64677M77314N27680M85003L59297
3769.1G82537341L36766L19779L59834N20169N48721L40819J84834K02358K58982L13759
3789.5G85923362L43680L30806M21762M90010L19481K76506L06368J82032J99855K45929
3809.9G89039791K45630K84613L57508L14236J89781J91450J08421P3969J71304K09332
3830.3G91186035K74777L30031K09510N6982n36k9445L9518J68681K02835R7155O4075
3852.7G92599618K21968J56522%L7432K02655K80619J35183J0491O9380L4570o3955
3875.2G93684483p6294L1411J85252J70886J27971P0095k7835l4571k6762j4484P8738
3897.6G94168890J66595J14798J7822n4479j20342q8811N97O2525J16885J04606q047
$$ plain form
3920 794481039 794409156 794394433 794412911 794419765 794481158 794601977 794685483 794688404 794694960 794751167 794787705 794804990
3944.5 794804990 794917464 795088887 795147300 795072615 794968545 794945359 795037031 795171201 795275927 795348823
3964.9 795348823 795422077 795464098 795475364 795556068 795719564 795859158 795956135 796059966 796147704 796181560 796185315
3987.3 796185315 796246707 796363056 796446502 796514511 796616912
3997.5 796616912
$$ packed form
3920G94481039p1883j4723J8478O854O1393J20819Q3506K921O556N6207L6538J7285
3944.5G94804990J12474J71423N8413p4685j04070k3186R1672J34170J04726P2896
3964.9G95348823P3254M2021J1266Q0704J63496J39594R6977J03831Q7738L3856L755
3987.3G96185315O1392J16349Q3446O8009J02401
3997.5G96616912
##END=$$ End of the data block
