##TITLE=Thixogum S $$ Begin of the data block
##JCAMP-DX=5.00 $$ ACD/SpecManager v 10.08
##SPECTROMETER/DATA SYSTEM=Alpha
##DATE=19 Feb 2015 09:45:16
##DATA TYPE=INFRARED SPECTRUM
##DATA CLASS=XYDATA
##ORIGIN=
##OWNER=
##NPOINTS=1765
##FIRSTX=399.76428223
##LASTX=3997.64306641
##MAXX=3997.64306641
##MINX=399.76428223
##MAXY=0.80917072
##MINY=0.56784511
##XFACTOR=1.0000000000
##YFACTOR=1.000000000000000e-9
##FIRSTY=0.67894387
##DELTAX=2.03961372
##XUNITS=1/CM
##YUNITS=ARBITRARY UNITS
##XYDATA=(X++(Y..Y))
$$ plain form
399.8 678943872 675424695 670848012 673351109 678660691 677397072 671759069 671473026 676614702 677997351
418.1 677997351 672537565 670748234 676136196 680130541 676319122 671431303 673848510 679025471
434.4 679025471 677378953 671073437 670194268 675583780 677214265 671656013 668185711 672155678 676165640
452.8 676165640 672908783 667653382 669627547 675106108 674257576 668163598 666629553 671804249 674481869
471.2 674481869 669844151 666238546 670207798 675323725 673363745 667898715 668434858 674135983 675188243
489.5 675188243 669641614 666780949 671265483 675185919 671612918 666209877 667837799 673154891
505.8 673154891 672680557 666905642 665322006 670306623 673045635 668445587 664221346 667404354 672519088
524.2 672519088 671002448 665468752 665446520 671190500 673387885 668640971 665192723 668876171 673377752
$$ packed form
399.8F78943872l519177m576683K503097N309582j263619n638003k86043N141676J382649
418.1F77997351n459786j789331N387962L994345l811419m887819K417207N176961
434.4F79025471j646518o305516q79169N389512J630485n558252l470302L969967M009962
452.8F76165640l256857n255401J974165N478561q48532o093978j534045N174696K677620
471.2F74481869m637718l605605L969252N115927j959980n465030N36143N701125J052260
489.5F75188243n546629k860665M484534L920436l573001n403041J627922N317092
505.8F73154891m74334n774915j583636M984617K739012m600048m224241L183008N114734
524.2F72519088j516640n533696k2232N743980K197385m746914l448248L683448M501581
$$ plain form
542.5 673377752 671065927 665808201 666508198 672159135 673595190 669044435 667056024 671835601 676222026
560.9 676222026 673789322 669454396 671285629 676959157 677504182 672557592 670862854 675541103 678763509
579.3 678763509 675077558 670608461 672667205 677472472 676575363 671053052 669756889 674404740 676861703
597.6 676861703 672888160 669228494 672306061 677423596 676605761 671875238 671837687 677284837 679879069
616 679879069 676050425 673160315 676984370 682111919 680967331 676313341 676652074 682080984 684093416
634.3 684093416 679783702 676786005 680499911 685137212 683358729 678484857 679019094 684438050 686037123
652.7 686037123 681660235 679224968 683513403 688067436 685872376 680434823 680555582 688379407 690328002
671 690328002 685901284 684000015 688615978 693161607 690966606 686533511 687950969 693328381 694017887
$$ packed form
542.5F73377752k311825n257726O99997N650937J436055m550755j988411M779577M386425
560.9F76222026k432704m334926J831233N673528N45025m946590j694738M678249L222406
579.3F78763509l685951m469097K058744M805267q97109n522311j296163M647851K456963
597.6F76861703l973543l659666L077567N117535q17835m730523l7551N447150K594232
616F79879069l828644k890110L824055N127549j144588m653990L38733N428910K012432
634.3F84093416m309714k997697L713906M637301j778483m873872N34237N418956J599073
652.7F86037123m376888k435267M288435M554033k195060n437553J20759P823825J948595
671F90328002m426718j901269M615963M545629k195001m433095J417458N377412O89506
$$ plain form
689.4 694017887 689082801 686801672 690898240 694469035 691551626 687045813 688566625 693958640
705.7 693958640 694814622 690365195 688784182 693570495 697745502 695539594 692008138 694758236 701090574
724.1 701090574 702561915 698784828 697961271 703265429 707509637 705171108 701528728 703988075 709883273
742.4 709883273 710839689 706687927 705731690 710933089 714964509 712362707 708581507 710868597 716209710
760.8 716209710 716314733 711287141 709364772 713262916 715834141 712049782 707384467 708877027 713606596
779.1 713606596 713618815 709071338 707846940 712495565 715995133 713293493 709591329 711654782 716597378
797.5 716597378 716657817 712098300 710834622 715353608 718723118 716223419 713126838 716041028 722238302
815.8 722238302 724250972 722148657 723353744 730085790 735223830 733780801 730914652 733256459
$$ packed form
689.4F94017887m935086k281129M096568L570795k917409m505813J520812N392015
705.7F93958640Q55982m449427j581013M786313M175007k205908l531456K750098O332338
724.1G01090574J471341l777087q23557N304158M244208k338529l642380K459347N895198
742.4G09883273R56416m151762r56237N201399M031420k601802l781200K287090N341113
760.8G16209710J05023n027592j922369L898144K571225l784359m665315J492560M729569
779.1G13606596J2219m547477j224398M648625L499568k701640l702164K063453M942596
797.5G16597378O0439m559517j263678M518986L369510k499699l096581K914190O197274
815.8G22238302K012670k102315J205087O732046N138040j443029k866149K341807
$$ plain form
832.2 733256459 738113940 738191664 733963132 733181357 738206625 742177606 740253925 737289846 739513695
850.5 739513695 744059384 743673980 738694847 736436903 739165962 740502775 736120582 730901659 730903983
868.9 730903983 733505607 731843770 726172745 723439753 725918472 727610230 724246800 720298707
885.2 720298707 721537650 725547910 725712836 721983314 720760226 724205673 726541877 723490417 719230711
903.5 719230711 719390452 721926510 720823884 716226697 714328766 717183053 719160497 715982318 711473703
921.9 711473703 710996628 712597668 710326731 704036832 699573219 699195445 698069513 692463160 685968876
940.3 685968876 683594346 683657408 680702686 674377561 669832110 669263005 668430388 663757563 658258557
958.6 658258557 656654954 657787621 656596839 652363598 649744213 651035249 652400017 650158763
$$ packed form
832.2G33256459M857481P7724m228532p81775N025268L970981j923681k964079K223849
850.5G39513695M545689l85404m979133k257944K729059J336813m382193n218923K324
868.9G30903983K601624j661837n671025k732992K478719J691758l363430l948093
885.2G20298707J238943M010260J64926l729522j223088L445447K336204l051460m259706
903.5G19230711J59741K536058j102626m597187j897931K854287J977444l178179m508615
921.9G11473703m77075J601040k270937o289899m463613l77774j125932n606353o494284
940.3F85968876k374530O3062k954722o325125m545451n69105q32617m672825n499006
958.6F58258557j603603J132667j190782m233241k619385J291036J364768k241254
$$ plain form
974.9 650158763 646801651 646815479 649275422 649346590 646056414 643681288 644591570 645313680 642289460
993.3 642289460 637748659 636059344 636705041 635364950 631133318 627977967 628256202 628917336 626514554
1011.6 626514554 622834086 621940911 623563230 623621106 620943606 619075000 620376229 622175455 621127784
1030 621127784 618676007 618702114 621205568 622332990 620658159 619373500 620956957 623082995 622434914
1048.4 622434914 620173991 620060861 622336805 623380542 621657431 620163739 621446073 623423994
1064.7 623423994 622844696 620614767 620293200 622359157 623528063 622186840 621086955 622830093 625586271
1083 625586271 626101553 624942780 625503778 628496706 630802274 630599916 630339265 632659912 636010170
1101.4 636010170 637131810 636348724 636987805 639881372 642072320 641736567 641149580 642973065 645871758
$$ packed form
974.9F50158763l357112J3828K459943P1168l290176k375126R10282P22110l024220
993.3F42289460m540801j689315O45697j340091m231632l155351K78235O61134k402782
1011.6F26514554l680468q93175J622319N7876k677500j868606J301229J799226j047671
1030F21127784k451777K6107K503454J127422j674831j284659J583457K126038o48081
1048.4F22434914k260923j13130K275944J043737j723111j493692J282334J977921
1064.7F23423994n79298k229929l21567K065957J168906j341223j099885J743138K756178
1083F25586271N15282j158773N60998K992928K305568k02358k60651K320647L350258
1101.4F36010170J121640p83086O39081K893567K190948l35753n86987J823485K898693
$$ plain form
1119.8 645871758 646638155 645420909 645433009 647715986 649573267 649061322 648156345 649476826 651918054
1138.1 651918054 652398765 650887847 650465846 652333438 653929174 653220594 652094424 653265774 655828476
1156.5 655828476 656765163 655881763 656096339 658702314 661298275 661753237 661738396 664000094 667872250
1174.8 667872250 670375526 671099544 672855794 677035570 681253910 683145165 684082329 686760545 690665781
1193.2 690665781 692878366 692895472 693510115 696272790 699011505 699461877 698972464 700246453 702859163
1211.5 702859163 703895092 702678978 701842070 703011990 704200923 703174233 701181710 700918555 702132821
1229.9 702132821 702091753 700132608 698815584 699775398 701141357 700689316 699396670 699704409 701427042
1248.2 701427042 701994300 700620294 699563444 700461805 701734424 701257110 699862301 699900389 701305330
$$ packed form
1119.8F45871758P66397j217246J2100K282977J857281n11945r04977J320481K441228
1138.1F51918054M80711j510918m22001J867592J595736p08580j126170J171350K562702
1156.5F55828476R36687q83400K14576K605975K595961M54962j4841K261698L872156
1174.8F67872250K503276P24018J756250M179776M218340J891255R37164K678216L905236
1193.2F90665781K212585J7106O14643K762675K738715M50372m89413J273989K612710
1211.5G02859163J035929j216114q36908J169920J188933j026690j992523k63155J214266
1229.9G02132821m1068j959145j317024R59814J365959m52041j292646L07739J722633
1248.2G01427042N67258j374006j056850Q98361J272619m77314j394809L8088J404941
$$ plain form
1266.6 701305330 701676250 700166702 698870540 699431837 700388849 699614704 697837770 697479665 698711753
1285 698711753 699247301 698117077 697232842 698218942 699752867 699718177 698624790 698731422 700288892
1303.3 700288892 701108575 700147688 699185789 699935794 701355338 701406240 700461507 700653672 702215672
1321.7 702215672 703063130 702139556 701052070 701507092 702546656 702170074 700615704 700072765 701276839
1340 701276839 702100754 701130807 699842215 699973345 700725496 700109065 698264182 697181463 697346270
1358.4 697346270 697087884 695436478 693733811 693415821 693822384 693197370 691569209 690969646 691886187
1376.7 691886187 692334652 691011131 689147115 688952982 690520108 691302478 690176070 689066887 689312935
1395.1 689312935 689409316 687953472 686014116 685160160 685288846 684667706 682913482 681706548 681771815
$$ packed form
1266.6G01305330L70920j509548j296162N61297R57012p74145j776934l58105J232088
1285F98711753N35548j130224q84235R86100J533925l4690j093387J06632J557470
1303.3G00288892Q19683r60887r61899P50005J419544N0902r44733J92165J562000
1321.7G02215672Q47458r23574j087486M55022J039564l76582j554370n42939J204074
1340G01276839Q23915r69947j288592J31130P52151o16431j844883j082719J64807
1358.4F97346270k58386j651406j702667l17990M06563o25014j628161n99563R16541
1376.7F91886187M48465j323521j864016j94133J567126P82370j126408j109183K46048
1395.1F89312935R6381j455844j939356q53956J28686o21140j754224j206934O5267
$$ plain form
1413.5 681771815 681691468 680621803 679839909 680328965 681435347 681947470 681442320 681514204 682913601
1431.8 682913601 684108973 684528470 685012043 686143994 687726796 688502431 688010931 687854588 688838780
1450.2 688838780 689457357 688642919 687995434 689887226 692141473 693097115 693623781 694805980 696568370
1468.5 696568370 698425472 700231552 702038884 704663992 707947135 710606754 712121427 713388503
1484.9 713388503 715692878 718981445 721515238 722512841 723758042 726644754 729313076 730006397 729662299
1503.2 729662299 730296731 733145058 734938145 735002339 735284209 736390650 737415791 737391949 737479746
1521.6 737479746 738709986 740068614 740473330 739770889 739430130 740558505 741283774 740298390 739403367
1539.9 739403367 740437567 741731584 741706133 740606308 739926159 740181327 740014732 738420725 736992002
$$ packed form
1413.5F81771815q0347j069665p81894M89056J106382N12123n05150P1884J399397
1431.8F82913601J195372M19497M83573J131951J582802P75635m91500j56343R84192
1450.2F88838780O18577q14438o47485J891792K254247R55642N26666J182199J762390
1468.5F96568370J857102J806080J807332K625108L283143K659619J514673J267076
1484.9G13388503K304375L288567K533793R97603J245201K886712K668322O93321l44098
1503.2G29662299O34432K848327J793087O4194K81870J106441J025141k3842Q7797
1521.6G37479746J230240J358628M04716p02441l40759J128375P25269r85384q95023
1539.9G39403367J034200J294017k5451j099825o80149K55168j66595j594007j428723
$$ plain form
1558.3 736992002 737829745 738161743 736690640 734124899 731915355 730806172 729154646 725842357 721747160
1576.6 721747160 718476117 715411186 711188018 705897450 700933278 697046816 693321168 688866735
1593 688866735 684397578 681132674 678841352 676339328 673412919 671127260 670134783 669626713 668384612
1611.3 668384612 666516602 665693700 666639388 666789651 665680885 665261567 665954411 666695237 666611195
1629.7 666611195 665577590 665172398 667118013 669092953 669214606 669023514 669543982 671281993 672878683
1648 672878683 672610164 673361301 677606523 679931283 679941058 680184901 682083368 684617341 685637295
1666.4 685637295 686172664 688039303 690357804 692435205 694122910 695207059 696399629 698518276
1682.7 698518276 701795220 704133153 705899596 708312094 710109472 711090684 712085903 714235425 718077123
$$ packed form
1558.3G36992002Q37743L31998j471103k565741k209544j109183j651526l312289m095197
1576.6G21747160l271043l064931m223168n290568m964172l886462l725648m454433
1593F88866735m469157l264904k291322k502024k926409k285659r92477n08070j242101
1611.3F68384612j868010q22902R45688J50263j108766m19318O92844P40826q4042
1629.7F66611195j033605m05192J945615J974940J21653j91092N20468J738011J596690
1648F72878683k68519P51137M245222K324760R775K43843J898467K533973J019954
1666.4F85637295N35369J866639K318501K077401J687705J084149J192570K118647
1682.7F98518276L276944K337933J766443K412498J797378R81212R95219K149522L841698
$$ plain form
1701.1 718077123 720396280 721234262 722739518 724693716 725935817 725908339 725575626 727071285 729583979
1719.4 729583979 730555594 730449378 730700433 731663823 732443869 732356608 732844114 734804869 736522079
1737.8 736522079 737666011 738429129 739433765 741215408 743172586 744852424 746639967 748800516
1754.1 748800516 751333416 753459275 754669189 756244183 758486629 760244012 760939538 761252880 762836814
1772.4 762836814 765269101 766629577 766932964 767429471 768790066 770258188 770806968 770618796 771068037
1790.8 771068037 772836626 774241865 774374127 774457395 775581539 777022362 777522862 777399182 777895808
1809.2 777895808 779290557 780369878 780455530 780509830 781415880 782458663 782632947 782288134 782562017
1827.5 782562017 783842087 785084963 785282433 785214841 785957694 786967695 787095129 786695302 787149549
$$ packed form
1701.1G18077123K319157Q37982J505256J954198J242101k7478l32713J495659K512694
1719.4G29583979R71615j06216K51055R63390P80046q7261M87506J960755J717210
1737.8G36522079J143932P63118J004636J781643J957178J679838J787543K160549
1754.1G48800516K532900K125859J209914J574994K242446J757383O95526L13342J583934
1772.4G62836814K432287J360476L03387M96507J360595J468122N48780j88172M49241
1790.8G71068037J768589J405239J32262Q3268J124144J440823N00500j23680M96626
1809.2G77895808J394749J079321Q5652N4300R06050J042783J74284l44813K73883
1827.5G82562017J280070J242876J97470o7592P42853J010001J27434l99827M54247
$$ plain form
1845.9 787149549 788473189 789496720 789557636 789368093 789944410 790931225 791247189 790893078 790892899 791614413
1866.3 791614413 792372704 792542279 792563796 793182433 794137239 794448733 794044495 794007540 794866681 795672655
1886.7 795672655 795558453 795206368 795647979 796582639 796949089 796564639 796482503 797281563 798090756 797993064
1907.1 797993064 797515333 797777355 798587739 798798621 798224926 797978640 798648417 799462795 799502432 799041867
1927.5 799041867 799124539 799823046 800114632 799620569 799242198 799649775 800259173 800191402 799680650 799718380
1947.9 799718380 800419748 800751686 800208509 799725473 800168872 800917923 800882399 800214231 800017774 800627947
1968.3 800627947 801041186 800599217 800098598 800460577 801222324 801281095 800670803 800453961 800982296 801357269
1988.7 801357269 800912678 800372660 800694704 801459491 801580667 800996006 800720870 801191509 801544487 801075459
$$ packed form
1845.9G87149549J323640J023531O0916j89543N76317R86815L15964l54111j79P21514
1866.3G91614413P58291J69575K1517O18637R54806L11494m04238l6955Q59141Q05974
1886.7G95672655j14202l52085M41611R34660L66450l84450q2136P99060Q09193r7692
1907.1G97993064m77731K62022Q10384K10882n73695k46286O69777Q14378L9637m60565
1927.5G99041867Q2672O98507K91586m94063l78371M07577O09398o7771n10752L7730
1947.9G99718380P01368L31938n43177m83036M43399P49051l5524o68168j96457O10173
1968.3H00627947M13239m41969n00619L61979P61747N8771o10292k16842N28335L74973
1988.7H01357269m44591n40018L22044P64787J21176n84661k75136M70639L52978m69028
$$ plain form
2009 801075459 800431669 800551534 801147282 801157773 800387442 799745679 799596190 799419940 799143851 799091339
2029.4 799091339 799495280 800180733 800329387 799689710 799162626 799405456 799789906 799440503 798702836 798619986
2049.8 798619986 799230874 799478769 798913419 798388839 798635483 799072862 798814774 798141778 798049092 798621535
2070.2 798621535 798889339 798360884 797795355 797981739 798471272 798321605 797649503 797459066 797984362 798307300
2090.6 798307300 797854781 797294796 797425032 797887802 797773838 797132015 796902120 797379494 797745168 797365487
2111 797365487 796780229 796829164 797300279 797289073 796705484 796441853 796921492 797395766 797133267 796588957
2131.4 796588957 796637475 797153234 797241807 796718478 796432197 796891093 797438562 797300339 796800137 796823502
2151.8 796823502 797378898 797594786 797185183 796945691 797455430 798099041 798036397 797556043 797601640 798262239
$$ packed form
2009H01075459o43790J19865N95748J0491p70331o41763j49489j76250k76089n2512
2029.4G99091339M03941O85453J48654o39677n27084K42830L84450l49403p37667q2850
2049.8G98619986O10888K47895n65350n24580K46644M37379k58088o72996r2686N72443
2070.2G98621535K67804n28455n65529J86384M89533j49667o72102j90437N25296L22938
2090.6G98307300m52519n59985J30236M62770j13964o41823k29895M77374L65674l79681
2111G97365487n85258M8935M71115j1206n83589k63631M79639M74274k62499n44310
2131.4G96588957M8518N15759Q8573n23329k86281M58896N47469j38223n00202K3365
2151.8G96823502N55396K15888m09603k39492N09739O43611o2644m80354M5597O60599
$$ plain form
2172.2 798262239 798671246 798430264 798222423 798701108 799432576 799578249 799236834 799281597 799933314 800409079
2192.6 800409079 800249875 800079644 800583482 801382065 801617742 801322103 801343322 801971018 802473187 802334130
2213 802334130 802121878 802531183 803257644 803493142 803186476 803115487 803648412 804153144 804050684 803804100
2233.4 803804100 804159820 804903090 805197656 804915607 804800093 805251479 805722356 805653274 805395782 805656612
2253.8 805656612 806353986 806712866 806464612 806281447 806690454 807214022 807182252 806865513 807045162 807712197
2274.2 807712197 808069468 807823002 807616055 807955384 808414221 808341265 807920277 807903171 808413863 808735132
2294.6 808735132 808437645 808047235 808166206 808469653 808266342 807677627 807460845 807798803 808022380 807661116
2315 807661116 807079136 806832433 806850314 806585908 806012332 805771291 806116521 806431413 806154549 805625558
$$ packed form
2172.2G98262239M09007k40982k07841M78685P31468J45673l41415M4763O51717M75765
2192.6H00409079j59204j70231N03838P98583K35677k95639K1219O27696N02169j39057
2213H02334130k12252M09305P26461K35498l06666p0989N32925N04732j02460k46584
2233.4H03804100L55720P43270K94566k82049j15514M51386M70877o9082k57492K60830
2253.8H05656612O97374L58880k48254j83165M09007N23568l1770l16739J79649O67035
2274.2H07712197L57271k46466k06947L39329M58837p2956m20988j7106N10692L21269
2294.6H08735132k97487l90410J18971L03447k03311n88715k16782L37958K23577l61264
2315H07661116n81980k46703J7881k64406n73576k41041L45230L14892k76864n28991
$$ plain form
2335.4 805625558 805467069 805608869 805499852 805257559 805685520 806589782 806918502 806263268 805109799
2353.7 805109799 804362118 804146945 803828418 803357363 803493083 804421425 805350065 805712879 805873513 806430161
2374.1 806430161 807233989 807681084 807753444 808009863 808658600 809170723 809036732 808564007 808410943 808588862
2394.5 808588862 808526814 808052659 807706416 807865739 808104873 807860434 807294607 806994140 807024896 806872547
2414.9 806872547 806343436 805928528 806000233 806158066 805852473 805247009 804930985 804974854 804835081 804259896
2435.3 804259896 803749263 803765774 803943932 803640962 802938640 802500546 802509904 802399158 801832676 801261425
2455.7 801261425 801164508 801285982 801022947 800338626 799816310 799722791 799594581 799056768 798471749 798329175
2476.1 798329175 798428237 798176169 797505081 796967685 796847820 796721399 796187222 795560300 795370281 795484185
$$ packed form
2335.4H05625558j58489J41800j09017k42293M27961R04262L28720o55234j153469
2353.7H05109799p47681k15173l18527m71055J35720R28342R28640L62814J60634N56648
2374.1H06430161Q03828M47095P2360K56419O48737N12123j33991m72725j53064J77919
2394.5H08588862o2048m74155l46243J59323K39134k44439n65827l00467L0756j52349
2414.9H06872547n29111m14908P1705J57833l05593o05464l16024M3869j39773n75185
2435.3H04259896n10633J6511J78158l02970p02322m38094R358j10746n66482n71251
2455.7H01261425r6917J21474k63035o84321n22316r3519j28210n37813n85019j42574
2476.1G98329175R9062k52068o71088n37396j19865j26421n34177o26922j90019J13904
$$ plain form
2496.5 795484185 795282960 794631779 794079244 793946207 793841422 793366671 792789638 792605877 792723656 792560697
2516.9 792560697 791938961 791379452 791258514 791216910 790787458 790183008 789959610 790097713 790003777 789435804
2537.3 789435804 788870096 788719416 788695514 788335025 787775934 787544191 787678540 787617147 787084043 786518276
2557.7 786518276 786357105 786354363 786004722 785393000 785086453 785193980 785170972 784666479 784042001 783784270
2578.1 783784270 783724010 783355296 782713413 782324374 782325506 782220721 781647325 780913293 780503035 780329466
2598.5 780329466 779909909 779182255 778658271 778580368 778446317 777782917 776890218 776340067 776079118 775585651
2618.9 775585651 774756312 774086177 773873806 773678482 772975862 771994174 771315753 770950079 770397663 769488931
2639.3 769488931 768678367 768335104 768094718 767389834 766350985 765579224 765174687 764642835 763769448
$$ packed form
2496.5G95484185k01225o51181n52535j33037j04785m74751n77033j83761J17779j62959
2516.9G92560697o21736n59509j20938m1604m29452o04450k23398J38103r3936n67973
2537.3G89435804n65708j50680k3902l60489n59091k31743J34349o1393n33104n65767
2557.7G86518276j61171k742l49641o11722l06547J07527k3008n04493o24478k57731
2578.1G83784270o0260l68714o41883l89039J132j04785n73396p34032m10258j73569
2598.5G80329466m19557p27654n23984p7903j34051o63400q92699n50151k60949m93467
2618.9G75585651q29339o70135k12371j95324p02620r81688o78421l65674n52416r08732
2639.3G69488931q10564l43263k40386p04884j038849p71761m04537n31852q73387
$$ plain form
2657.6 763769448 762956083 762555897 762281060 761604488 760595739 759832144 759495199 759101391 758310437
2676 758310437 757496297 757120371 756940126 756377220 755441010 754716337 754425943 754086971 753350377 752590358
2696.4 752590358 752282917 752238512 751878798 751100421 750413060 750143468 749935031 749372780 748698115 748404622
2716.8 748404622 748401105 748125255 747432232 746824384 746603668 746398151 745846450 745192289 744917452 744971275
2737.2 744971275 744766414 744096637 743459821 743250072 743150890 742668629 741957486 741557658 741491616 741233647
2757.6 741233647 740541995 739816308 739471138 739274144 738738477 737979949 737539113 737448454 737131119 736305654
2778 736305654 735405684 734891593 734593749 734052300 733269870 732667506 732359648 731935322 731098413 730141878
2798.4 730141878 729480624 729010582 728297532 727330387 726583004 726185203 725656748 724659860 723507226
$$ packed form
2657.6G63769448q13365m00186k74837o76572j008749p63595l36945l93808p90954
2676G58310437q14140l75926j80245n62906r36210p24673k90394l38972p36594p60019
2696.4G52590358l07441m4405l59714p78377o87361k69592k08437n62251o74665k93493
2716.8G48404622l517k75850o93023o07848k20716k05517n51701o54161k74837N3823
2737.2G44971275k04861o69777o36816k09749r9182m82261p11143l99828o6042k57969
2757.6G41233647o91652p25687l45170j96994n35667p58528m40836r0659l17335q25465
2778G36305654q99970n14091k97844n41449p82430o02364l07858m24326q36909r56535
2798.4G30141878o61254m70042p13050r67145p47383l97801n28455r96888j152634
$$ plain form
2816.7 723507226 722697437 722155988 721359670 720198512 719152331 718501568 717864156 716808200 715543449
2835.1 715543449 714562058 713753045 712559938 710980535 709594548 708635032 707654715 706265330 704708159
2853.4 704708159 703453124 702571690 701595545 700206459 698797584 697784305 696899176 695712745 694355130
2871.8 694355130 693217635 692314029 691377044 690319538 689428270 688988686 688738883 688182473 687357187
2890.1 687357187 686767459 686579347 686357737 685783625 685196280 685017228 685028911 684720933 684094846 683653235
2910.5 683653235 683559775 683327556 682596445 681724966 681259274 681174457 680995166 680629611 680528224 680808663
2930.9 680808663 681106687 681267500 681572795 682370782 683589101 684747338 685584307 686385751 687499166
2949.3 687499166 688778102 689786434 690567017 691582978 692882419 694007874 694666505 695131302 695781708
$$ packed form
2816.7G23507226q09789n41449p96318j161158j046181o50763o37412j055956j264751
2835.1G15543449r81391q09013j193107j579403j385987r59516r80317j389385j557171
2853.4G04708159j255035q81434r76145j389086j408875j013279q85129j186431j357615
2871.8F94355130j137495r03606r36985j057506q91268m39584k49803n56410q25286
2890.1F87357187n89728j88112k21610n74112n87345j79052J1683l07978o26087m41611
2910.5F83653235r3460k32219p31111q71479m65692q4817j79291l65555j01387K80439
2930.9F80808663K98024J60813L05295P97987J218319J158237Q36969Q01444J113415
2949.3F87499166J278936J008332P80583J015961J299441J125455O58631M64797O50406
$$ plain form
2967.6 695781708 696508527 697002947 697362006 697959483 698874950 699710667 700122714 700391114 700972199 701754034
2988 701754034 702342272 702679396 703000546 703431189 703671873 703444839 703079581 702962220 702960372 702794194
3008.4 702794194 702505112 702286184 702096224 701657951 700816393 699842393 699159861 698696315 697986543 697040975
3028.8 697040975 696332514 695989490 695522785 694563508 693547070 692946970 692488432 691667438 690516233
3047.2 690516233 689548969 688935578 688269258 687261462 686074853 685064495 684357643 683711708 682932854
3065.5 682932854 682111084 681368470 680638492 679769635 678896248 678279877 677749753 676961720 675932050
3083.9 675932050 674908817 674127340 673491359 672555685 671318412 670330524 669796646 669259965 668331563
3102.2 668331563 667326212 666720808 666307867 665539086 664523482 663849354 663513601 662966251 661923707
$$ packed form
2967.6F95781708P26819M94420L59059N97477R15467Q35717M12047K68400N81085P81835
2988G01754034N88238L37124L21150M30643K40684k27034l65258j17361j848j66178
3008.4G02794194k89082k18928j89960m38273q41558r74000o82532m63546p09772r45568
3028.8F97040975p08461l43024m66705r59277j016438o00100m58538q20994j151205
3047.2F90516233r67264o13391o66320j007796j186609j010358p06852o45935p78854
3065.5F82932854q21770p42614p29978q68857q73387o16371n30124p88033j029670
3083.9F75932050j023233p81477o35981r35674j237273r87888n33878n36681r28402
3102.2F68331563j005351o05404m12941p68781j015604o74128l35753n47350j042544
$$ plain form
3120.6 661923707 660682857 659759343 659178078 658488691 657491505 656492770 655806065 655336678 654728770
3139 654728770 653834641 652976096 652341545 651650488 650843084 650183678 649625719 648893237 647964835 647037446
3159.4 647037446 646309018 645777702 645157814 644267738 643345356 642673731 642133892 641425550 640600860 639955342
3179.8 639955342 639470994 638868093 638034105 637170255 636518776 635972798 635256648 634410620 633726358 633246422
3200.1 633246422 632676542 631858706 630991459 630334795 629861772 629291177 628551185 627903342 627473831 627018750
3220.5 627018750 626290381 625424087 624746263 624320388 623943746 623456776 622850239 622255921 621699810 621017218
3240.9 621017218 620316088 619893193 619609118 619068086 618305445 617734730 617482483 617172778 616541207 615812898
3261.3 615812898 615298390 615016162 614777446 614457607 614068031 613693357 613295257 612690032 611943364 611358762
$$ packed form
3120.6F61923707j240850r23514n81265o89387r97186r98735o86705m69387o07908
3139F54728770q94129q58545o34551o91057q07404o59406n57959p32482r28402r27389
3159.4F47037446p28428n31316o19888q90076r22382o71625n39839p08342q24690o45518
3179.8F39955342m84348o02901q33988q63850o51479n45978p16150q46028o84262m79936
3200.1F33246422n69880q17836q67247o56664m73023n70595p39992o47843m29511m55081
3220.5F27018750p28369q66294o77824m25875l76642m86970o06537n94318n56111o82592
3240.9F21017218p01130m22895k84075n41032p62641n70715k52247l09705o31571p28309
3261.3F15812898n14508k82228k38716l19839l89576l74674l98100o05225p46668n84602
$$ plain form
3281.7 611358762 611021578 610703588 610252798 609880030 609723270 609455347 608799219 607928455 607236028 606961071
3302.1 606961071 606871247 606483996 605709970 604888499 604215384 603524923 602699339 601947963 601420820 600950718
3322.5 600950718 600317597 599528670 598809123 598211348 597494185 596648037 595977902 595463693 594778836 593835711
3342.9 593835711 592838585 592101812 591641784 590959013 589800894 588617504 587789237 587164760 586448789
3361.3 586448789 585645318 585055470 584676445 584034622 582898974 581697583 580862224 580240965 579538703
3379.6 579538703 578752160 578066647 577567518 577151835 576742470 576257408 575611234 575011909 574697077 574433863
3400 574433863 573866010 573122680 572511673 571995080 571498930 571089864 570678890 570136964 569619715 569352746
3420.4 569352746 569252670 569114685 568904817 568708837 568621397 568700969 568804741 568637192 568224132 567936540
$$ packed form
3281.7F11358762l37184l17990m50790l72768j56760k67923o56128q70764o92427k74957
3302.1F06961071q9824l87251p74026q21471o73115o90461q25584p51376n27143m70102
3322.5F00950718o33121p88927p19547n97775p17163q46148o70135n14209o84857r43125
3342.9E93835711r97126p36773m60028o82771j158119j183390q28267o24477p15971
3361.3E86448789q03471n89848l79025o41823j135648j201391q35359o21259p02262
3379.6E79538703p86543o85513m99129m15683m09365m85062o46174n99325l14832k63214
3400E74433863n67853p43330o11007n16593m96150m09066m10974n41926n17249k66969
3420.4E69352746j00076j37985k09868j95980q7440P9572J03772j67549m13060k87592
$$ plain form
3440.8 567936540 567861259 567845106 567899406 567975938 568063557 568214655 568363905 568612576 569063544 569465578
3461.2 569465578 569692373 570040882 570619285 571040034 571085989 571083367 571313560 571783125 572318435 572641730
3481.6 572641730 572802305 573103428 573597670 574087799 574464142 574894607 575543940 576158106 576534927 576936960
3502 576936960 577359855 577627361 578029752 578687072 579362333 579966843 580510378 580938518 581319749 581943810
3522.4 581943810 582731426 583376169 584000409 584692955 585394919 586258829 587125957 587602556 587965190 588729084
3542.8 588729084 589851320 590780854 591292739 591945708 592952967 593817413 594413042 595079422 595778108
3561.1 595778108 596171200 596813142 598551035 600458920 601560354 602349043 603250742 604292035 605533123
3579.5 605533123 606756806 607611239 608578384 610345364 612104893 613164008 614227355 615693629 617335081
$$ packed form
3440.8E67936540p5281j6153N4300P6532Q7619J51098J49250K48671M50968M02034
3461.2E69465578K26795L48509N78403M20749M5955k622K30193M69565N35310L23295
3481.6E72641730J60575L01123M94242M90129L76343M30465O49333O14166L76821M02033
3502E76936960M22895K67506M02391O57320O75261O04510N43535M28140L81231O24061
3522.4E81943810P87616O44743O24240O92546P01964Q63910Q67128M76599L62634P63894
3542.8E88729084J122236R29534N11885O52969J007259Q64446N95629O66380O98686
3561.1E95778108L93092O41942J737893J907885J101434P88689R01699J041293J241088
3579.5F05533123J223683Q54433R67145J766980J759529J059115J063347J466274J641452
$$ plain form
3597.9 617335081 619055569 620594323 621612191 622569382 624180019 626063585 627689004 629087389
3614.2 629087389 630340517 632282794 634938478 636732519 637373090 638149440 640657008 643752813 645585418
3632.5 645585418 647199929 649059534 650867403 652573228 653963506 654955447 656302452 659143627
3648.8 659143627 662345886 664160132 665855289 668469310 670901418 672655463 674155891 675345838
3665.2 675345838 676300108 677782834 679571390 681038320 683264852 685848653 687617719 689057887
3681.5 689057887 690216541 691029787 692153513 693855345 695476234 696775734 697788715 698566377 699489057
3699.8 699489057 700760007 701787651 702169836 702335000 703020632 704405427 705585361 706196249 706606150
3718.2 706606150 706989944 707280695 707533479 707879841 708165228 708254337 708400488 709102154 710410118 711381614
$$ packed form
3597.9F17335081J720488J538754J017868R57191J610637J883566J625419J398385
3614.2F29087389J253128J942277K655684J794041O40571P76350K507568L095805J832605
3632.5F45585418J614511J859605J807869J705825J390278R91941J347005K841175
3648.8F59143627L202259J814246J695157K614021K432108J754045J500428J189947
3665.2F75345838R54270J482726J788556J466930K226532K583801J769066J440168
3681.5F89057887J158654Q13246J123726J701832J620889J299500J012981P77662R22680
3699.8F99489057J270950J027644L82185J65164O85632J384795J179934O10888M09901
3718.2G06606150L83794K90751K52784L46362K85387Q9109J46151P01666J307964R71496
$$ plain form
3738.6 711381614 711484611 711394966 711891651 712544084 713074207 714073896 715265036 716004252 716533720 717159152
3759 717159152 717683434 717932940 718135834 718522727 719116032 719745278 720218539 720522046 720786810 721055150
3779.4 721055150 721255660 721535087 721996129 722426414 722685277 722818851 722912490 722954273 722783864 722644448
3799.8 722644448 722932398 723404706 723900914 724469483 724802017 724804878 724704981 724603772 724492848 724685907
3820.2 724685907 725307345 725850940 726104915 726217449 726322412 726383984 726308048 726184845 726247489 726640940
3840.6 726640940 727221727 727720976 727846086 727431774 726742446 726620853 727418482 728105903 728332222 728279948
3861 728279948 728184283 728174508 728210628 728340268 728535891 728743076 728954434 729056954 729070425 729116440 729290783
3883.4 729290783 729564250 729677200 729601920 729591429 729653001 729549110 729237556 728926957 728907108 729317486
$$ packed form
3738.6G11381614J02997q9645M96685O52433N30123R99689J191140P39216N29468O25432
3759G17159152N24282K49506K02894L86893N93305O29246M73261L03507K64764K68340
3779.4G21055150K00510K79427M61042M30285K58863J33574R3639M1783j70409j39416
3799.8G22644448K87950M72308M96208N68569L32534K861r9897j01209j10924J93059
3820.2G24685907O21438N43595K53975J12534J04963O1572p5936j23203O2644L93451
3840.6G26640940N80787M99249J25110m14312o89328j21593P97629O87421K26319n2274
3861G28279948r5665r775L6120J29640J95623K07185K11358J02520J3471M6015J74343
3883.4G29290783K73467J12950p5280j0491O1572j03891l11554l10599j9849M10378
$$ plain form
3903.8 729317486 729892850 730208755 730213523 730096877 729964137 729877353 729901731 729966760 729990065 730010331 729991436
3926.2 729991436 729805648 729610264 729708910 729964495 730044842 729936659 729829967 729850590 729861319 729681611
3946.6 729681611 729498267 729567468 729738414 729780912 729737520 729757190 729842782 729841709 729720294 729603529 729551613
3969.1 729551613 729541421 729545772 729558706 729581714 729616761 729659855 729630649 729493201 729383945 729392231 729427278
3991.5 729427278 729436278 729510665 729625046
3997.6 729625046
$$ packed form
3903.8G29317486N75364L15905M768j16646j32740q6784K4378O5029K3305K0266j8895
3926.2G29991436j85788j95384R8646K55585Q0347j08183j06692K0623J0729j79708
3946.6G29681611j83344O9201J70946M2498m3392J9670Q5592j073j21415j16765n1916
3969.1G29551613j0192M351J2934K3008L5047M3094k9206j37448j09256Q286L5047
3991.5G29427278R000P4387J14381
3997.6G29625046
##END=$$ End of the data block
