##TITLE=Terra diatomacea $$ Begin of the data block
##JCAMP-DX=5.00 $$ ACD/DocManager Library v 5.00
##DATE=20 Feb 2017 07:53:26
##DATA TYPE=INFRARED SPECTRUM
##DATA CLASS=XYDATA
##ORIGIN=Marcelo Quint
##OWNER=
##NPOINTS=1765
##FIRSTX=399.77209473
##LASTX=3997.72216797
##MAXX=3997.72216797
##MINX=399.77209473
##MAXY=1.01978838
##MINY=0.53022581
##XFACTOR=1.0000000000
##YFACTOR=0.0000318684
##FIRSTY=0.88646173
##DELTAX=2.03965425
##XUNITS=1/CM
##YUNITS=ARBITRARY UNITS
##XYDATA=(X++(Y..Y))
399.8B7816JJ2Rmk4n1p9j07j30j47j52j46j53j68j89k15k43k69k86k94k90k77k61k51
448.7B4102k51k69l06l56m10m56m83m80m42l72k80j77p9QP6J28J64J89K11K29K45K57
493.6B1248K60K55K41K19J97J75J60J50J49J56J71J95K27K65L07L47L82M09M24TM14
536.4B6775L93L65L33K99K64K33K04J76J53J32J14J01R0Q0P3O7O2N7N4N0M6M3L9L5
585.4C0238L0K5J9Rmk7n7r7j40j82k14k29k18j80j19m1M4J23J86K28K46K44K25J98
634.3C0307J70J42J19J01Q5P3O4N6M9M1L6L0K5K1J8J7J8TJ9K0J8J6J3ROLJjTlTnTp
703.7C1470rj0j1j3j5Tj6j7j8Tj9k0k2k5k7k9l4l7m0m5m8n2n6n9o1o6p1q1r5j14j40
766.9C0187j70k05k41k79l14l44l64l69l55l17k53j61m9P8K05L21M15M78N03M96M58
$$ y = [27816, 27817, 27829, 27838, 27834, 27810, 27759, 27680, 27573, 27443, 27296, 27144, 26998, 26845, 26677, 26488, 26273, 26030, 25761, 25475, 25181, 24891, 24614, 24353, 24102, 23851, 23582, 23276, 22920, 22510, 22054, 21571, 21091, 20649, 20277, 19997, 19820, 19741, 19749, 19825, 19953, 20117, 20306, 20517, 20746, 20991, 21248, 21508, 21763, 22004, 22223, 22420, 22595, 22755, 22905, 23054, 23210, 23381, 23576, 23803, 24068, 24375, 24722, 25104, 25513, 25937, 26361, 26775, 27168, 27533, 27866, 28165, 28429, 28662, 28866, 29042, 29195, 29327, 29441, 29542, 29632, 29712, 29785, 29852, 29914, 29971, 30025, 30075, 30121, 30164, 30203, 30238, 30268, 30293, 30312, 30321, 30317, 30290, 30233, 30136, 29996, 29814, 29600, 29371, 29153, 28973, 28854, 28813, 28857, 28980, 29166, 29394, 29640, 29884, 30109, 30307, 30477, 30619, 30738, 30839, 30924, 30997, 31061, 31117, 31166, 31207, 31243, 31273, 31298, 31319, 31337, 31354, 31372, 31390, 31409, 31429, 31447, 31463, 31476, 31485, 31491, 31494, 31495, 31494, 31493, 31490, 31487, 31482, 31477, 31470, 31461, 31451, 31440, 31427, 31412, 31397, 31381, 31364, 31346, 31328, 31309, 31289, 31267, 31242, 31215, 31186, 31152, 31115, 31075, 31030, 30982, 30930, 30874, 30815, 30754, 30688, 30617, 30536, 30441, 30327, 30187, 30017, 29812, 29571, 29292, 28978, 28634, 28270, 27901, 27546, 27229, 26976, 26815, 26766, 26844, 27049, 27370, 27785, 28263, 28766, 29262, 29720]
809.7B9720M04L39K76K20J74J40J17J01R0P9P2O2N4M6L8K9K1J3Nlj1j8k4l0l6m1m5
864.8C1792m9n3n4n5n6n7n6n8o0o2o4o8p0p2p3Tp4p5Tp8p9q1q3q6q7q8r0r2r3r4r7
928B9540r9j01j03j05j08j09j11j13Tj12Uj09Tj08j07j09j11j14j18j21j26j30j33
977B6847j35j38j39j41j40j41Tj42j44j47j51j56j61j66j71j74j78j80j83j85j88j90
1021.9B3356j92j94j93j92j89j86j83Tj84j89j98k10k24k40k57k73k90l03l14l20l19
1064.7A8523l11k93k69k39k07j73j42j10q0m7j4K3O3J01J37J67J88K02K06K04J96J86
1109.6A8311J72J59J46J33J20J10J00R3Q8Q3Q0P7P6P3P1P0O9UP1P4P5P9Q2Q6R0R6J02
1166.7B0924J11J20J30J41J50J56J55J47J31J05P5M3J4oj5j1MK6N3P9J00J17J27J33
$$ y = [29720, 30124, 30463, 30739, 30959, 31133, 31273, 31390, 31491, 31581, 31660, 31732, 31794, 31848, 31894, 31932, 31961, 31982, 31995, 32000, 31997, 31986, 31968, 31944, 31914, 31878, 31837, 31792, 31743, 31690, 31636, 31581, 31525, 31468, 31412, 31354, 31294, 31232, 31168, 31100, 31030, 30958, 30885, 30812, 30738, 30663, 30588, 30510, 30431, 30350, 30267, 30181, 30094, 30006, 29916, 29824, 29731, 29637, 29540, 29441, 29340, 29237, 29132, 29024, 28915, 28804, 28691, 28578, 28466, 28354, 28242, 28133, 28024, 27916, 27809, 27700, 27589, 27475, 27357, 27236, 27110, 26980, 26847, 26712, 26574, 26435, 26294, 26154, 26013, 25872, 25730, 25586, 25439, 25288, 25132, 24971, 24805, 24634, 24460, 24282, 24102, 23919, 23734, 23546, 23356, 23164, 22970, 22777, 22585, 22396, 22210, 22027, 21844, 21660, 21471, 21273, 21063, 20839, 20599, 20342, 20069, 19779, 19476, 19162, 18842, 18523, 18212, 17919, 17650, 17411, 17204, 17031, 16889, 16779, 16699, 16652, 16638, 16661, 16724, 16825, 16962, 17129, 17317, 17519, 17725, 17929, 18125, 18311, 18483, 18642, 18788, 18921, 19041, 19151, 19251, 19344, 19432, 19515, 19595, 19672, 19748, 19821, 19892, 19962, 20031, 20100, 20169, 20240, 20314, 20389, 20468, 20550, 20636, 20726, 20822, 20924, 21035, 21155, 21285, 21426, 21576, 21732, 21887, 22034, 22165, 22270, 22345, 22388, 22402, 22396, 22381, 22370, 22374, 22400, 22453, 22532, 22632, 22749, 22876, 23009]
1215.6B3009J34J32J31J27J23J19J15J09J05J00R6R3R1Q9UR1TR4R5R6R7R9R8R9TR8
1270.7B5808R9R7R6R4R2Q9Q6Q2P9P6P3O9O6O2N8N4N0M7M5M3TM5M6M8N0M9M8M5M2L9
1331.9B7720L6L5L6L7M1TM2L9L6L2K9K6K3K1K3K4TJ8Rkqj2j1mPK5M2N4N9N7N3M7M2
1399.2B8641L6L0K7K3K1J5J0NORJ1J3J4J5J6UK0K4K5K3J8R%oj0o%RJ8K5K7K8L0L1L3
1472.6B9222L5L6L7L4K8K1J6TJ3ROTMJ%jKOJ0J3TJ2J6K2K6K4J9J2Nlj0oLJ5K4K7K2
1548.1B9735J5LnqlNJ4K1K2J7J1Mkorj0j2k0l0m0m9n7o3o8p0p5q0q7r3r9j03j05r9
1615.4B8654r1q1p1o0m7l3k0mJ2K7L9N2O0O6P4Q5R6J10J20J25TJ18J05R2P7O5N4M7
1672.5B9796M3UM1L9TL6L0K2J4J0J2J9K5L0L3TL0K4J9J6J8K0K3K2J6QLklkLQJ3J4TJ2
$$ y = [23009, 23143, 23275, 23406, 23533, 23656, 23775, 23890, 23999, 24104, 24204, 24300, 24393, 24484, 24573, 24662, 24751, 24842, 24933, 25027, 25122, 25218, 25315, 25414, 25512, 25611, 25710, 25808, 25907, 26004, 26100, 26194, 26286, 26375, 26461, 26543, 26622, 26698, 26771, 26840, 26906, 26968, 27026, 27080, 27130, 27177, 27222, 27265, 27308, 27353, 27399, 27447, 27497, 27546, 27594, 27639, 27681, 27720, 27756, 27791, 27827, 27864, 27905, 27946, 27988, 28027, 28063, 28095, 28124, 28150, 28173, 28194, 28217, 28241, 28265, 28283, 28292, 28290, 28282, 28270, 28259, 28255, 28262, 28287, 28329, 28383, 28442, 28499, 28552, 28599, 28641, 28677, 28707, 28734, 28757, 28778, 28793, 28803, 28808, 28814, 28823, 28834, 28847, 28861, 28876, 28892, 28908, 28924, 28944, 28968, 28993, 29016, 29034, 29043, 29043, 29037, 29027, 29021, 29021, 29030, 29048, 29073, 29100, 29128, 29158, 29189, 29222, 29257, 29293, 29330, 29364, 29392, 29413, 29429, 29445, 29458, 29467, 29473, 29479, 29483, 29484, 29484, 29483, 29485, 29491, 29501, 29514, 29527, 29539, 29555, 29577, 29603, 29627, 29646, 29658, 29663, 29660, 29650, 29644, 29647, 29662, 29686, 29713, 29735, 29750, 29753, 29748, 29740, 29737, 29742, 29756, 29777, 29799, 29816, 29827, 29831, 29829, 29823, 29814, 29804, 29792, 29772, 29742, 29702, 29653, 29596, 29533, 29465, 29395, 29320, 29240, 29153, 29060, 28961, 28858, 28753, 28654, 28563, 28482, 28411, 28351, 28304, 28271, 28251, 28247, 28259, 28286, 28325, 28377, 28437, 28503, 28577, 28662, 28758, 28868, 28988, 29113, 29238, 29356, 29461, 29553, 29630, 29695, 29749, 29796, 29839, 29882, 29925, 29966, 30005, 30044, 30080, 30110, 30132, 30146, 30156, 30168, 30187, 30212, 30242, 30275, 30308, 30338, 30362, 30381, 30397, 30415, 30435, 30458, 30480, 30496, 30504, 30507, 30505, 30502, 30500, 30503, 30511, 30524, 30538, 30552, 30564]
1748C0564J4J6J7TJ4J0MJmTjPJ3J8TJ7J3PLkm%MRJ3J4J5UJ3J1QOKjmTkJLOPTMK%TK
1845.9C0884MOTKmj1j8k3k5k3j8j2nk%JjkTljKPRJ1J3J2TJ1RQPVRJ0J2TJ1ROMJjk%
1941.8C0946JLMNMKJjkmlTkTjTkTmTnUlkjJT%J%TkmnpTonjMQJ2J5J4TJ2J0QOYNTMN
2064.1C1038NTMNMNTMNTONTONMNMNMS0LMVLMULMLTMLsMTNMTLMLKLKLKTLKXLKJKUJK
2229.3C1323JTKJKTJX%TJT%JTKJKVJ%TjUklTmToprTj1Tj2Tj3j1j2Tj3j2TrnjNPQOJ
2349.7C1185oj2j4j5j0lNJ5K3K8L2TL0K9K5K1J6J2PNKJ%TjJ%TJ%Uj%j%UJV%JT%Uj%
2451.7C1412%S3J%J%Xj%Xj%Tj%WJ%j%Tj%sj%Tj%Vj%jV%j%Uj%Tj%jW%j%Tj%TjUkjTk
2647.5C1384jY%ZjUkjTkjWkjT%jT%Tj%jUkTjV%j%jTkWjT%jUkWjkjkTlTmTnVonUmTk
$$ y = [30564, 30578, 30594, 30611, 30628, 30642, 30652, 30656, 30657, 30653, 30649, 30648, 30655, 30668, 30686, 30704, 30721, 30734, 30741, 30744, 30742, 30738, 30738, 30742, 30751, 30764, 30778, 30793, 30808, 30823, 30836, 30847, 30855, 30861, 30863, 30862, 30858, 30854, 30852, 30853, 30856, 30862, 30869, 30876, 30880, 30882, 30882, 30882, 30884, 30888, 30894, 30900, 30902, 30898, 30887, 30869, 30846, 30821, 30798, 30780, 30768, 30763, 30761, 30761, 30762, 30761, 30759, 30757, 30754, 30753, 30755, 30762, 30771, 30782, 30795, 30807, 30819, 30830, 30839, 30847, 30854, 30861, 30868, 30875, 30884, 30894, 30906, 30918, 30929, 30938, 30944, 30948, 30949, 30948, 30946, 30946, 30947, 30950, 30954, 30959, 30963, 30965, 30966, 30965, 30963, 30959, 30956, 30953, 30951, 30949, 30948, 30947, 30945, 30943, 30939, 30935, 30930, 30925, 30920, 30917, 30915, 30914, 30915, 30916, 30916, 30917, 30917, 30917, 30915, 30911, 30906, 30899, 30892, 30886, 30881, 30880, 30884, 30892, 30904, 30919, 30933, 30947, 30959, 30969, 30977, 30983, 30989, 30995, 31001, 31007, 31013, 31019, 31024, 31029, 31033, 31038, 31043, 31048, 31052, 31057, 31061, 31066, 31071, 31075, 31080, 31085, 31091, 31096, 31101, 31107, 31112, 31116, 31121, 31125, 31130, 31134, 31138, 31142, 31146, 31150, 31154, 31158, 31162, 31166, 31170, 31173, 31177, 31181, 31185, 31189, 31192, 31196, 31200, 31204, 31207, 31211, 31214, 31217, 31221, 31224, 31227, 31230, 31233, 31236, 31239, 31242, 31245, 31248, 31252, 31256, 31261, 31265, 31269, 31272, 31276, 31279, 31281, 31284, 31286, 31289, 31291, 31293, 31296, 31298, 31300, 31302, 31304, 31306, 31308, 31311, 31313, 31314, 31316, 31318, 31320, 31321, 31323, 31324, 31325, 31327, 31328, 31330, 31332, 31333, 31334, 31335, 31336, 31337, 31338, 31338, 31338, 31339, 31340, 31340, 31341, 31342, 31344, 31345, 31347, 31349, 31351, 31353, 31354, 31354, 31354, 31353, 31352, 31351, 31349, 31346, 31343, 31339, 31335, 31329, 31322, 31313, 31304, 31293, 31282, 31270, 31258, 31245, 31234, 31222, 31210, 31197, 31185, 31173, 31164, 31159, 31158, 31163, 31170, 31178, 31184, 31185, 31179, 31167, 31153, 31138, 31128, 31125, 31130, 31145, 31168, 31196, 31228, 31260, 31290, 31319, 31344, 31365, 31381, 31393, 31400, 31405, 31407, 31408, 31408, 31408, 31407, 31408, 31408, 31408, 31409, 31409, 31409, 31409, 31408, 31408, 31407, 31407, 31407, 31407, 31408, 31409, 31410, 31411, 31411, 31412, 31413, 31413, 31413, 31413, 31412, 31412, 31412, 31412, 31412, 31412, 31412, 31412, 31412, 31412, 31412, 31412, 31412, 31412, 31412, 31413, 31413, 31414, 31414, 31414, 31414, 31414, 31414, 31414, 31413, 31413, 31413, 31413, 31413, 31413, 31413, 31412, 31412, 31412, 31411, 31411, 31411, 31411, 31411, 31411, 31412, 31412, 31411, 31411, 31411, 31410, 31410, 31410, 31410, 31410, 31410, 31410, 31410, 31410, 31410, 31409, 31409, 31409, 31408, 31408, 31408, 31408, 31408, 31407, 31407, 31406, 31405, 31404, 31403, 31403, 31402, 31402, 31402, 31402, 31401, 31401, 31401, 31400, 31400, 31399, 31398, 31397, 31396, 31395, 31395, 31394, 31394, 31394, 31393, 31393, 31393, 31392, 31391, 31390, 31388, 31387, 31386, 31384, 31383, 31382, 31381, 31380, 31379, 31378, 31377, 31377, 31377, 31377, 31377, 31377, 31377, 31377, 31377, 31376, 31375, 31374, 31372, 31371, 31370, 31368, 31367, 31366, 31365, 31364, 31363, 31361, 31360, 31359, 31359, 31358, 31357, 31357, 31357, 31356, 31356, 31355, 31354, 31353, 31351, 31349, 31348, 31347, 31346, 31345, 31345, 31344, 31344, 31343, 31342, 31340, 31338, 31336, 31334, 31332, 31331, 31330, 31330, 31329, 31328, 31327, 31325, 31323, 31321, 31319, 31317, 31316, 31314, 31313, 31311, 31309, 31306, 31303, 31299, 31295, 31290, 31285, 31280, 31275, 31269, 31264, 31259, 31254, 31250, 31246, 31244]
2824.9C1244kjkoj1j9k6l2l5l3k7j6nOJ4J9TJ7J2OLjlmTopqpqpqpUqj0j5k0k6l3l6
2910.6C0893l6l1k2j0MJ6K6L1L2L1K7K2J9J5J3J0PM%jlTkjKMOPRQTONLK%Tj%jTklTk
3002.3C1088kj%UkmnpqpTnmlklkmnTqYpToVnmnTprj0j2Tj4j3j2j1j0rqpTopqj0j2j5
3120.6C0700j6Tj7j5j4j3Tj2j3Tj5Uj6Tj8j9Tk1Tk2k1k2Tk1k3k2k4Uk5k6Tk8Tk9l0
3196.1B9966l0l1l0l1l0Vl1l0l1l0l1l0l1Tl2l3Tl4l3l4l2Tl0Tk9k8k7k6k4k2k0j9
3265.4B8961j9k0k1k4k5k7k8k7Wk9l0l2l4l6l9m1m5m9n1n5n6n8n9o0o1o2o4o6o8p0
3332.7B7597p1p3p5p7q0q3q6q9r1r4Ur3r4Tr5Tr6r7r6r5r1q6q0p4o8o2n7n5n3n2n1
3398B5006n0n1Tn0m8m6m4m2l9l5k9k4j9j4romlk%KOJ0J6K0K5L0L3L7L9TM1M2M1M0L9
$$ y = [31244, 31242, 31241, 31239, 31233, 31222, 31203, 31177, 31145, 31110, 31077, 31050, 31034, 31029, 31035, 31049, 31068, 31087, 31104, 31116, 31122, 31125, 31124, 31121, 31117, 31113, 31107, 31100, 31092, 31085, 31077, 31070, 31062, 31055, 31048, 31041, 31033, 31023, 31008, 30988, 30962, 30929, 30893, 30857, 30826, 30804, 30794, 30798, 30814, 30840, 30871, 30903, 30934, 30961, 30983, 31002, 31017, 31030, 31040, 31047, 31051, 31051, 31050, 31047, 31044, 31042, 31041, 31043, 31047, 31053, 31060, 31069, 31077, 31085, 31091, 31096, 31099, 31101, 31101, 31101, 31100, 31100, 31099, 31098, 31096, 31093, 31090, 31088, 31086, 31085, 31085, 31085, 31085, 31083, 31079, 31074, 31067, 31059, 31052, 31045, 31040, 31036, 31033, 31031, 31028, 31026, 31022, 31017, 31012, 31004, 30996, 30988, 30980, 30972, 30964, 30956, 30949, 30942, 30936, 30930, 30924, 30918, 30913, 30909, 30904, 30899, 30892, 30883, 30873, 30861, 30849, 30835, 30822, 30810, 30799, 30789, 30780, 30772, 30765, 30758, 30752, 30745, 30737, 30727, 30715, 30700, 30684, 30668, 30651, 30636, 30622, 30609, 30596, 30584, 30571, 30558, 30543, 30528, 30513, 30497, 30481, 30463, 30444, 30425, 30404, 30383, 30361, 30340, 30318, 30296, 30275, 30252, 30230, 30206, 30182, 30158, 30133, 30107, 30081, 30053, 30025, 29996, 29966, 29936, 29905, 29875, 29844, 29814, 29784, 29754, 29724, 29693, 29663, 29632, 29602, 29571, 29541, 29510, 29479, 29447, 29414, 29381, 29347, 29314, 29280, 29248, 29216, 29186, 29156, 29127, 29099, 29072, 29046, 29022, 29000, 28980, 28961, 28942, 28922, 28901, 28877, 28852, 28825, 28797, 28770, 28743, 28716, 28689, 28662, 28633, 28603, 28571, 28537, 28501, 28462, 28421, 28376, 28327, 28276, 28221, 28165, 28107, 28048, 27988, 27927, 27865, 27801, 27735, 27667, 27597, 27526, 27453, 27378, 27301, 27221, 27138, 27052, 26963, 26872, 26778, 26684, 26590, 26497, 26403, 26309, 26214, 26119, 26023, 25926, 25830, 25735, 25644, 25558, 25478, 25404, 25336, 25274, 25217, 25162, 25109, 25057, 25006, 24956, 24905, 24854, 24804, 24756, 24710, 24666, 24624, 24585, 24550, 24521, 24497, 24478, 24464, 24455, 24449, 24445, 24442, 24440, 24440, 24442, 24448, 24458, 24474, 24494, 24519, 24549, 24582, 24619, 24658, 24697, 24738, 24780, 24821, 24861, 24900]
3471.4B4900L8L9TM0M1M3M4M5M7M6M7TM6M7M8TN1N3N6N7N8N7UN6N8O0O3O5O8TO6O5
3538.7B6620O3O1TO2TO3O0TN7N6N5N8O2P1P9Q4Q7TQ4Q2P7P5P4P8Q5R0R4R5R4R2Q6P9
3604B8993P4P3P5P7UP6P4P0O6TO8P1P3O7N8M5L2K1J3TK2L7N0N9N7M8L1J0j0k2k4j6
3671.3C0501nQK0K9L3TK9K6TK8L0K6K0J5PJlolMJ1J4J2Mkpj2j6Tj4j1pTqTn%RJ7K3
3752.9C0796K8L0K9K3J7J1PMTNUOPTMjpj5k1k3k1j4nLPTMlrj2j1mJNMJmoTml%LKjo
3848.7C0849rplJLMNMLKJLNPOTNTLjnprTn%RJ5J7TJ2OJmoTlJMNTMKJjU%JLMNTLKJj
3965C0957jU%JVKJV%JT
3997.6C0966
$$ y = [24900, 24938, 24977, 25016, 25056, 25097, 25140, 25184, 25229, 25276, 25322, 25369, 25416, 25462, 25509, 25557, 25605, 25656, 25709, 25765, 25822, 25880, 25937, 25994, 26051, 26107, 26165, 26225, 26288, 26353, 26421, 26489, 26555, 26620, 26683, 26744, 26805, 26867, 26929, 26992, 27052, 27112, 27169, 27225, 27280, 27338, 27400, 27471, 27550, 27634, 27721, 27808, 27892, 27974, 28051, 28126, 28200, 28278, 28363, 28453, 28547, 28642, 28736, 28828, 28914, 28993, 29067, 29140, 29215, 29292, 29369, 29446, 29522, 29596, 29666, 29732, 29798, 29866, 29937, 30010, 30077, 30135, 30180, 30212, 30233, 30246, 30259, 30281, 30318, 30368, 30427, 30484, 30532, 30563, 30573, 30563, 30541, 30517, 30501, 30496, 30504, 30524, 30553, 30586, 30619, 30648, 30674, 30700, 30728, 30758, 30784, 30804, 30819, 30826, 30827, 30824, 30818, 30815, 30819, 30830, 30844, 30856, 30860, 30858, 30851, 30839, 30823, 30807, 30793, 30782, 30775, 30768, 30760, 30752, 30747, 30747, 30756, 30773, 30796, 30824, 30854, 30883, 30906, 30923, 30934, 30941, 30945, 30949, 30954, 30959, 30964, 30970, 30977, 30984, 30988, 30987, 30980, 30965, 30944, 30921, 30900, 30886, 30881, 30884, 30891, 30898, 30902, 30899, 30890, 30878, 30867, 30863, 30864, 30869, 30873, 30874, 30870, 30864, 30858, 30854, 30851, 30851, 30854, 30856, 30855, 30849, 30840, 30833, 30830, 30831, 30834, 30838, 30843, 30847, 30850, 30852, 30853, 30856, 30861, 30868, 30874, 30880, 30885, 30890, 30893, 30892, 30887, 30880, 30871, 30862, 30857, 30857, 30866, 30881, 30898, 30915, 30927, 30933, 30934, 30930, 30924, 30918, 30915, 30916, 30920, 30925, 30930, 30934, 30936, 30937, 30936, 30935, 30934, 30934, 30935, 30938, 30942, 30947, 30952, 30955, 30957, 30958, 30957, 30956, 30955, 30954, 30954, 30955, 30956, 30957, 30958, 30960, 30961, 30962, 30963, 30964, 30964, 30965, 30966]
##END=$$ End of the data block
