##TITLE=Tecido DI 15-2121150-9 - Add 002 $$ Begin of the data block
##JCAMP-DX=5.00 $$ ACD/SpecManager v 10.08
##SPECTROMETER/DATA SYSTEM=Alpha
##DATE=21 Dec 2015 10:01:40
##DATA TYPE=INFRARED SPECTRUM
##DATA CLASS=XYDATA
##ORIGIN=
##OWNER=
##NPOINTS=1667
##FIRSTX=599.57470703
##LASTX=3997.16503906
##MAXX=3997.16503906
##MINX=599.57470703
##MAXY=0.98735875
##MINY=0.83486748
##XFACTOR=1.0000000000
##YFACTOR=1.000000000000000e-9
##FIRSTY=0.87568635
##DELTAX=2.03937006
##XUNITS=1/CM
##YUNITS=ARBITRARY UNITS
##XYDATA=(X++(Y..Y))
599.6H75686347L71993M76241j70469o72102l30269L89814O20604J2159m57227j78993
$$ 875686347 876058340 876534581 876364112 875692010 875361741 875751555 876372159 876384318 875927091 875748098
620H75748098k73466q95858p69854l16441m57406n45501j04905L16680J8358o89447
$$ 875748098 875474632 874578774 873808920 873492479 873035073 872489572 872384667 872701347 872719705 872030258
640.4H72030258q84354o62625p11918q45730n85139l63230m43042m39644m76539n51641
$$ 872030258 871145904 870483279 869771361 868925631 868340492 867977262 867534220 867094576 866618037 866066396
660.8H66066396l46303j0252l3200p74085q21769j85788J18196Q5890J49668L01241
$$ 866066396 865720093 865709841 865676641 864902556 864080787 863894999 864013195 864099085 864248753 864549994
681.1H64549994K75434K65359J85013Q5414L13997O10471O69002M46022L15726O08205
$$ 864549994 864825428 865090787 865275800 865361214 865675211 866285682 866954684 867400706 867716432 868324637
701.5H68324637P27535M85480M72664O71924O17921M02689M11630M77492M40240M63903
$$ 868324637 869052172 869537652 870010316 870682240 871300161 871702850 872114480 872591972 873032212 873496115
721.9H73496115N93007O90996O17087M67480L67522K58267J20580L30806P36475P56859
$$ 873496115 874089122 874780118 875397205 875864685 876232207 876490474 876611054 876941860 877678335 878435194
742.3H78435194N43714K08139k324K33054M58419L80457L46303N17785N83232L13043
$$ 878435194 878978908 879187047 879184723 879417777 879876196 880256653 880602956 881120741 881703973 882017016
762.7H82017016J1862L6955J68383K94804M68076L83198J58906K27570L69609K77042
$$ 882017016 882028878 882065833 882234216 882529020 882997096 883380294 883539200 883766770 884136379 884413421
783.1H84413421J54078N8949j8358J58548L32773J53899m8280l9398R1791K23994L09467
$$ 884413421 884567499 884626448 884608090 884766638 885099411 885253310 885205030 885165632 885257423 885481417 885790884
805.6H85790884L11018L4451k15709n0068R2626k35618o55710o77824o25193p09057
$$ 885790884 886101902 886136353 885920644 885870576 885963202 885727584 885071874 884394050 883768857 883059800
825.9H83059800o81520q70168j401186j670301j523733j443029j581668j688600j748085
$$ 883059800 882378280 881508112 880106926 878436625 876912892 875469863 873888195 872199595 870451510
844.3H70451510j846075j985252k066851j958012j785457j755417j791119j755655
$$ 870451510 868605435 866620183 864553332 862595320 860809863 859054446 857263327 855507672
860.6H55507672j647592j524031j441300j371443j349509j266897j148283j194835
$$ 855507672 853860080 852336049 850894749 849523306 848173797 846906900 845758617 844563782
876.9H44563782j242816j180053j031816r12964r06647q85546p98166o29007m01915
$$ 844563782 843320966 842140913 841109097 840196133 839289486 838403940 837605774 836976767 836574852
895.3H36574852k90811m18126n31495l77118q9825R7514J47819J00851K1696J53125
$$ 836574852 836284041 835865915 835334420 834957302 834867477 834964991 835112810 835213661 835235357 835388482
915.7H35388482M01914M48704M33444M61162M37319M20391M06325M76301O82175P44641
$$ 835388482 835790396 836239100 836672544 837133706 837571025 837991416 838397741 838874042 839556217 840300858
936.1H40300858N76913M86672N82815O61790O85871P25209Q41737Q78930O57678N88715
$$ 840300858 840877771 841364443 841947258 842609048 843294919 844020128 844861865 845740795 846398473 846987188
956.5H46987188Q31485Q39948O64175P15315P21991O72937P94649Q06987O81281O77884
$$ 846987188 847818673 848658621 849322796 850038111 850760102 851433039 852227688 853034675 853715956 854393840
976.9H54393840P30872P02620P04526P27952P11918P69079Q11219O98447N89967O57081
$$ 854393840 855124712 855827332 856531858 857259810 857971728 858740807 859552026 860250473 860840440 861497521
997.3H61497521Q15332R12786Q73327P51674O94037O87957O76512O41883O25670P78019
$$ 861497521 862312853 863225639 864098966 864850640 865544677 866232634 866909146 867551029 868176699 868954718
1017.6H68954718R45628R54389R71496R82702R78470J018942R74655R73820J089394
$$ 868954718 869900346 870854735 871826231 872808933 873787403 874806345 875781000 876754820 877844214
1036H77844214J077176R86933J023472J136601J100540R86993J049996J148045J105249
$$ 877844214 878921390 879908323 880931795 882068396 883168936 884155929 885205925 886353970 887459219
1054.4H87459219J029133J046360J150191J267790J274229J108288J033664J206100
$$ 887459219 888488352 889534712 890684903 891952693 893226922 894335210 895368874 896574974
1070.7H96574974J331389J280546J207173J166761J146913J109063J085699J146555
$$ 896574974 897906363 899186909 900394082 901560843 902707756 903816819 904902518 906049073
1087I06049073J243174J257181J099825R60112J148581J350820J141906R83298J161098
$$ 906049073 907292247 908549428 909649253 910609365 911757946 913108766 914250672 915233970 916395068
1105.3I16395068J248419J141370J005649R20296R54449J008809J012266J065731J108288
$$ 916395068 917643487 918784857 919790506 920710802 921665251 922674060 923686326 924752057 925860345
1123.7I25860345J045823R63092R32813R54628R59396R01461Q40425Q18789Q36015
$$ 925860345 926906168 927869260 928802073 929756701 930716097 931617558 932457983 933276772 934112787
1142.1I34112787Q17180P68959Q34585Q97944R04619R60648R20117Q18312P57933P22468
$$ 934112787 934929967 935698926 936533511 937431455 938336074 939296722 940216839 941035151 941793084 942515552
1162.4I42515552Q12292Q49068Q15511R84550J132488J050412R56297R30548Q53658
$$ 942515552 943327844 944176912 944992423 945976973 947109461 948159873 949116170 950046718 950900376
1180.8I50900376P79629Q56638R81450J065492J175344J185000R94265P96378Q46207
$$ 950900376 951680005 952536643 953518093 954583585 955758929 956943929 957938194 958734572 959580779
1199.2I59580779J021862R93610Q86142Q58664Q42154R08256R47893P86662O69837
$$ 959580779 960602641 961596251 962482393 963341057 964183211 965091467 966039360 966826022 967495859
1217.5I67495859P17282P02321O43075O09696N64814M41253K69651K85983M27485M85480
$$ 967495859 968213141 968915462 969558537 970168233 970733047 971174300 971443951 971729934 972157419 972642899
1237.9I72642899L95953J88530Q3208J65343K30491K00451J73747J54317J02341O0677
$$ 972642899 973038852 973227382 973310590 973475933 973706424 973906875 974080622 974234939 974337280 974397957
1258.3I74397957N9426P153l6300P9275J86741J40429M9591k4259o1930l1113L1769
$$ 974397957 974457383 974464536 974428236 974507511 974694252 974834681 974884272 974860013 974798083 974766970 974798739
1280.7I74798739M7743K5332J0431j4007l7611k6881K1875Q0049Q3089R298n2750n0664
$$ 974798739 974846482 974871814 974882245 974868238 974830627 974803746 974825621 974905670 974988759 974998057 974945307 974894643
1305.2I74894643J073M7147j3351j16885j56939j02878q404J6808q165m7982j29283
$$ 974894643 974895716 974942863 974929512 974812627 974655688 974552810 974544406 974561214 974553049 974505067 974375784
1327.6I74375784k20060k28405k26080k96474l28600k55585j84357j73271j61350k23040
$$ 974375784 974155724 973927319 973701239 973404765 973076165 972820580 972636223 972462952 972301602 972078562
1348I72078562l56138l60966k75910k95043l99053m45187m09901k57790j10626j67072
$$ 972078562 971722424 971361458 971085548 970790505 970391452 969946265 969536364 969278574 969167948 969000876
1368.4I69000876k75075l23833l18169j67608j1504M0531r54j00314j60158o7651N6207
$$ 969000876 968725801 968401968 968083799 967916191 967904687 967945218 967944264 967843950 967683792 967616141 967672348
1390.9I67672348J1981m4764J0729Q5771K13504K36690K29657K93612K38836J47105
$$ 967672348 967684329 967639565 967650294 967736065 967949569 968186259 968415916 968709528 968948364 969095469
1411.3I69095469J67310K59161L33369L35395K14994J85728L57985M46022L39329L05712
$$ 969095469 969262779 969521940 969855309 970190704 970405698 970591426 970949411 971395433 971734762 972040474
1431.6I72040474L32952K64823K92480M50969M87983L82781K85507L42786M09603L26335
$$ 972040474 972373426 972638249 972930729 973381698 973869681 974252462 974537969 974880755 975290358 975616693
1452I75616693K62142L52382O00160O34670N30958M84765M85003N37395N68271N74708
$$ 975616693 975878835 976231217 976831377 977466047 977997005 978481770 978966773 979504168 980072439 980647147
1472.4I80647147N53846N40793M60386L49999L48925L25382J74999R060J69218L89337
$$ 980647147 981200993 981741786 982202172 982552171 982901096 983226478 983401477 983410537 983579755 983969092
1492.8I83969092K79367J19567J83583L07619K52485j24156o75500q6367M69089L17514
$$ 983969092 984248459 984368026 984551609 984859228 985111713 984987557 984312057 984225690 984694779 985012293
1513.2I85012293O4969J30773L05891K50458J53899P4924Q1539J59740O9618j1801
$$ 985012293 985077262 985208035 985513926 985764384 985918283 985993207 986074746 986234486 986304104 986292303
1533.6I86292303J89662J85549k87712l93271L4630K16067K18987J22548J50203K29538
$$ 986292303 986481965 986667514 986379802 985986531 986021161 986237228 986456215 986578763 986728966 986958504
1554I86958504J55985j16825o2346K30491J14619O1334J6987j53720k5750N0426k44677
$$ 986958504 987114489 986997664 986935318 987165809 987280428 987341762 987358749 987205029 987179279 987229705 986985028
1576.4I86985028k50519P5698J32740n9724j84238j83284j32203r0957n4240P2062
$$ 986985028 986734509 986810207 986942947 986883223 986698985 986515701 986383498 986292541 986238301 986310363
1596.8I86310363P7247j54316k93553j97828j18136j10388q6963q7440j98126k98440
$$ 986310363 986387610 986233294 985939741 985741913 985623777 985513389 985426426 985338986 985140860 984842420
1617.2I84842420j00971n0723j40608o4969q9466j33813k1398o9916l10421j04308
$$ 984842420 984741449 984690726 984550118 984485149 984395683 984261870 984240472 984170556 983860135 983755827
1637.6I83755827J77443J04308p987j29580j33396J04964J5438l21090J20401M40597
$$ 983755827 983933270 984037578 984029591 983900011 983766615 983871579 983887017 983565927 983686328 984126925
1658I84126925L83854K31207J70469Q8275j44899j82450J17361K26915J69099R8407
$$ 984126925 984510779 984741986 984912455 985000730 984855831 984673381 984790742 985017657 985186756 985285163
1678.4I85285163N4479l9280j41561M8280J42276J34170J36495m3273j74105l4631
$$ 985285163 985339642 985300362 985158801 985207081 985349357 985483527 985620022 985576749 985402644 985368013
1698.8I85368013o3419j23501j24335n8472N3406K7895q4818k12312j70052K01166
$$ 985368013 985304594 985181093 985056758 984998286 985051692 985079587 984994769 984782457 984612405 984813571
1719.2I84813571K94149J17063L3975o3419k00212j71304k40922k46942n4777q1241
$$ 984813571 985107720 985224783 985258758 985195339 984995127 984823823 984582901 984335959 984281182 984199941
1739.6I84199941p7665N3764J15692J03355Q8334K25007L49403K51055Q0287j8179
$$ 984199941 984122276 984176040 984291732 984395087 984483421 984708428 985057831 985308886 985389173 985370994
1760I85370994K2590J40130M0770j09375q3983j13725q4758Q0645O1929p0512q3387
$$ 985370994 985393584 985533714 985574484 985465109 985381126 985267401 985182643 985263288 985325217 985254705 985171318
1782.4I85171318K623M7743o1631k38717k63810p8559J16646Q1361r1851m8637J8537
$$ 985171318 985173941 985221684 985160053 984921336 984657526 984578967 984695613 984776974 984685123 984636486 984655023
1804.9I84655023l6538o4611k9743K7060M2558J9848k4557q7142j56820j51038n3882
$$ 984655023 984618485 984553874 984524131 984551191 984593749 984613597 984589040 984501898 984345078 984194040 984140158
1827.3I84140158k98K9981m17o0440j5497L1650o8426k25007j84954K7776J42455J22428
$$ 984140158 984139860 984169841 984169424 984108984 984093487 984125137 984056711 983831704 983646750 983674526 983816981 983939409
1851.8I83939409O8486J79j05918j29282m0412l1531j61529j84237J9788J21475M6491
$$ 983939409 984007895 984008074 983902156 983772874 983732462 983700931 983539402 983355165 983374953 983496428 983542919
1874.2I83542919j013m053m4763o9321m4465o4075j13785q2493m5597l3677O5982J07944
$$ 983542919 983541906 983537853 983493090 983423769 983379304 983315229 983201444 983118951 983073354 983039677 983105659 983213603
1898.7I83213603P213n7161n7042p5519m4584N2452M3213o6638j46031j27792k9088
$$ 983213603 983220816 983163655 983106613 983031094 982986510 983038962 983082175 983015537 982869506 982741714 982712626
1921.1I82712626L2902N7638K5332n8890p0750j610N4181N8770o199j20818r3699K9981
$$ 982712626 982745528 982803166 982828498 982769608 982698858 982697248 982751429 982810199 982804000 982683182 982589483 982619464
1945.6I82619464K1696j2040r060j4662q107l5107q8036j04844q4102k8849K8551L2186
$$ 982619464 982641160 982629120 982620060 982605398 982597291 982562184 982474148 982369304 982285202 982256353 982284904 982317090
1970.1I82317090j2279o794M2140L0935J8596J8776j9312o4373j08659j14620o2764
$$ 982317090 982304811 982298017 982340157 982371092 982389688 982408464 982389152 982324779 982216120 982101500 982038736
1992.5I82038736l8325k5392J8001r895p5936r0122o0976L8982J23620M4703q3566
$$ 982038736 982000411 981975019 981993020 981983125 981907189 981817067 981756091 981795073 981918693 981963396 981879830
2014.9I81879830j05977l7372L9160J2935n1558m1008j6272n126r835m9114n6923M709
$$ 981879830 981773853 981736481 981775641 981788576 981737018 981696010 981679738 981674612 981664777 981615663 981558740 981563449
2039.4I81563449N6505P510m9829J1742N2571k2948q6546p3254M709O1572o736j43528
$$ 981563449 981619954 981627464 981577635 981589377 981641948 981619000 981532454 981459200 981463909 981525481 981518745 981375217
2063.9I81375217j67071l0697Q8513J04964N5492l4809q8573m2200J9372O199j0074
$$ 981375217 981208146 981177449 981265962 981370926 981426418 981391609 981303036 981260836 981280208 981286407 981276333
2086.3I81276333M1783M7088q0824j37627j9252K7120o2943r2804k3365K265l9399
$$ 981276333 981318116 981365204 981284380 981146753 981127501 981154621 981091678 980998874 980975509 980977774 980938375
2108.7I80938375Q166P4327N2392L5346l7968j13607m8697J5736j8656o8844j8358
$$ 980938375 980946541 981020868 981073260 981108606 981070638 980957031 980908334 980924070 980905414 980836570 980818212
2131.2I80818212P7665L2604p4864r7573q1062l1710K4677K9444j1444q5950r4354
$$ 980818212 980895877 980928481 980853617 980756044 980674982 980643272 980667949 980697393 980685949 980599999 980505645
2153.6I80505645K0623R7216L2901j6331P272q941n3406n4181M173M7683k9742j38939
$$ 980505645 980526268 980623484 980656385 980640054 980647326 980638385 980584979 980530798 980534971 980582654 980552912 980413973
2178.1I80413973r1970O4493J15394M2379j1265j9551k3782n4002j07944p2121L9935
$$ 980413973 980322003 980386496 980501890 980544269 980533004 980513453 980489671 980435669 980327725 980255604 980295539
2200.5I80295539N5492J4484J2755l0577p0095m9114p9692j14977k6107O1691J2696
$$ 980295539 980351031 980365515 980378270 980347693 980277598 980228484 980148792 980033815 980007708 980069399 980082095
2222.9I80082095p0513p2658o318N5194O3360j5140j01149m8637O3419O2704l1054
$$ 980082095 980011582 979938924 979932606 979987800 980051160 980036020 979934871 979886234 979949653 980012357 979981303
2245.4I79981303o3002l338J1146l4749p1407n8114K6226O9141R1255J03712l8326
$$ 979981303 979918301 979914963 979926109 979891360 979819953 979761839 979788065 979857206 979948461 980052173 980013847
2267.8I80013847j83463j47342j0133L9994k4616m5002M3154J09732K3008o9976o8009
$$ 980013847 979830384 979683042 979672909 979712903 979688287 979643285 979686439 979796171 979819179 979749203 979681194
2290.2I79681194r3162j03355m9114k0862N9605J59145M6074j28806j16825n4002p212
$$ 979681194 979588032 979484677 979435563 979414701 979474306 979633451 979679525 979550719 979433894 979379892 979372680
2312.7I79372680J02103J39594Q6188P213p0453k2710L7969M3809P7069J41859K61664
$$ 979372680 979474783 979614377 979700565 979707778 979637325 979614615 979652584 979696393 979773462 979915321 980176985
2335.1I80176985L04282Q3864k41518l67523k73346p0453J36554L34382N08845M28259
$$ 980176985 980481267 980565131 980323613 979956090 979682744 979612291 979748845 980083227 980592072 981020331
2355.5I81020331J3173l50773l98040j83106J729j35541l01957l00527k42531j38819
$$ 981020331 981033504 980682731 980284691 980101585 980103314 979967773 979665816 979365289 979122758 978983939
2375.9I78983939q7679n1260O4314Q9705j6451n6803k4260j788J2756N424L7908Q1778
$$ 978983939 978896260 978845000 978909314 978999019 978982568 978925765 978901505 978899717 978912473 978917897 978955805 979037583
2400.4I79037583K026j05500j23203p8022J728J1445m232N3823M3451j0073m77o854
$$ 979037583 979039609 978934109 978810906 978732884 978734612 978746057 978741825 978795648 978839099 978829026 978828549 978821695
2424.8I78821695n7042m2856K5869r060m4644q166J4901N8592J5080q9884p2479k9981
$$ 978821695 978764653 978721797 978747666 978738606 978693962 978685796 978700697 978759289 978774369 978684485 978612006 978582025
2449.3I78582025J4782Q9287K2292j21295j17660k6464M7207M1663l7014j9312O5863
$$ 978582025 978596807 978686094 978708386 978587091 978469431 978442967 978490174 978531837 978494823 978475511 978541374
2471.7I78541374M5896n5731q1241k2411K1517L3796j0848n2810m8756j3769L4332
$$ 978541374 978587270 978531539 978450298 978427887 978449404 978483200 978472352 978419542 978370786 978357017 978391349
2494.2I78391349Q703o2228n0544L6954O6758M0590K1100l7312q9884q4519n4777N901
$$ 978391349 978400052 978337824 978287280 978324234 978390992 978431582 978452682 978415370 978325486 978240967 978186190 978192091
2518.6I78192091L6180k7955r3996k1398J05619N6982l7908M768M8459q822p4327p5817
$$ 978192091 978228271 978200316 978106320 978084922 978190541 978247523 978209615 978214383 978262842 978254020 978179693 978103876
2543.1I78103876l3498K8849L7134L755k1637n9247q1479m8876n245j8478l4034j3769
$$ 978103876 978070378 978099227 978136361 978140116 978118479 978059232 977977753 977928877 977923632 977905154 977871120 977857351
2567.6I77857351M3750R0897K0087o3062k5987L1352n901o2466l9339j4841j1504K6583
$$ 977857351 977901101 977991998 978012085 977949023 977923036 977954388 977948487 977886021 977846682 977831841 977820337 977846920
2592.1I77846920O4075L1770l2485j0073l5465j19388m8280M2022M5657P9691Q0586
$$ 977846920 977910995 977942765 977910280 977900207 977864742 977745354 977697074 977739096 977784753 977864444 977945030
2614.5I77945030n0724j76430j69158o6280K1756K7299L7610P6652o497j34051j6212
$$ 977945030 977894306 977717876 977548718 977482438 977504194 977531493 977569103 977645755 977639258 977505207 977488995
2636.9I77488995J64687N1797j16527l8207Q7261O2704k8133o3598l517o497o8426
$$ 977488995 977653682 977705479 977588952 977550745 977638006 977700710 977672577 977608979 977605462 977598965 977530539
2659.3I77530539j2398M6909j0610j06096j43528r5665P093Q1777Q3268M9531J193
$$ 977530539 977518141 977565050 977554440 977448344 977304816 977209151 977216244 977298021 977381289 977430820 977432013
2681.8I77432013l7849m0770k5928m4227l6358O1631J11401J0013p8618k6584K4736
$$ 977432013 977394164 977353394 977327466 977283239 977246881 977308512 977419913 977429926 977351308 977324724 977349460
2704.2I77349460k2471m4107L1292O4433l4869q4162O4493J46150k7239j66357j37031
$$ 977349460 977326989 977282882 977314174 977378607 977343738 977259576 977324069 977470219 977442980 977276623 977139592
2726.6I77139592l6895O2287O1571m0233r2923k742R7871Q4221j1206o5684k6643k2471
$$ 977139592 977102697 977164984 977226555 977186322 977093399 977090657 977188528 977272749 977261543 977195859 977169216 977146745
2751.1I77146745q2553n1617R119l0577l8028O199K6465l6836j46985n9307R8050K6643
$$ 977146745 977064192 977012575 977021694 976991117 976953089 976959288 976985753 976948917 976801932 976742625 976840675 976867318
2775.6I76867318r3102r2566n0783J8537M291p7009l9637K2709J0550j3590l8564p0155
$$ 976867318 976774216 976681650 976630867 976649404 976653695 976576686 976537049 976559758 976570308 976556718 976518154 976447999
2800.1I76447999r8288j11937k2650J29342P6115j07109p6831M0532Q34o2823j19865
$$ 976447999 976349711 976237774 976215124 976344466 976420581 976313472 976236641 976277173 976278007 976215184 976095319
2822.5I76095319j70648o2943L3796j21057k87890k50161j87218j71662k06113l50892
$$ 976095319 975924671 975861728 975895524 975774467 975486577 975236416 975049198 974877536 974671423 974320531
2842.9I74320531n15699o08564n39839j99020K42770M79221N70476O02067M35054K13444
$$ 974320531 973804832 973196268 972656429 972457409 972700179 973179400 973749876 974351943 974786997 975000441
2863.3I75000441O7353n1737o7949j5378J4663K9445P689j0133M5717K5451j11044
$$ 975000441 975067794 975016057 974948108 974932730 974947393 974976838 974984527 974974394 975020111 975045562 974934518
2885.7I74934518j69098j56581k00987k63036k20179j71721j79947j37627j35481k46525
$$ 974934518 974765420 974608839 974407852 974144816 973924637 973752916 973572969 973435342 973299861 973053336
2906.1I73053336l77059m60148m89890m62950l21149j76669j07526J21057M38213N52356
$$ 973053336 972676277 972216129 971726239 971263289 970942140 970765471 970657945 970779002 971217215 971769571
2926.5I71769571N48959N79655O16610N98193N15699L43144K32756K65598J54794l577
$$ 971769571 972318530 972898185 973514795 974112988 974628687 974971831 975204587 975470185 975624979 975621402
2946.9I75621402L100j788k4438P6294J98543J16825J3172J40489K29597J22606N5850
$$ 975621402 975624502 975622714 975598276 975674570 975873113 975989938 976003110 976143599 976373196 976495802 976551652
2969.3I76551652J70052K55167J23799k4914o1334k4676R1076J14083O974j5020L814
$$ 976551652 976721704 976976871 977100670 977075756 977014422 976989746 977080822 977194905 977201879 977186859 977190673
2991.8I77190673l8325n3227o1036j00851r8884j3232J34230R4533j09077q5234O6399
$$ 977190673 977152348 977099121 977038085 976937234 976838350 976825118 976959348 977053881 976944804 976859570 976925969
3014.2I76925969Q8513P5519O1452q821p7486r5844j29581j57177m1843R5666M4703
$$ 976925969 977014482 977090001 977151453 977142632 977065146 976969302 976839721 976682544 976640701 976736367 976781070
3036.6I76781070o3956n5193M7326J38819J40726N3764r6619k15888j33872K7418N8591
$$ 976781070 976717114 976661921 976709247 976848066 976988792 977042556 976945937 976730049 976596177 976623595 976682186
3059.1I76682186n841r5308q6129R120P8440P0869m827o3539o7771l7133j1683J6272
$$ 976682186 976676345 976581037 976494908 976504028 976582468 976653337 976648510 976584971 976517200 976480067 976468384 976484656
3083.5I76484656K563j3888N0664R8288O6162J6808k6762p4745l5405R120j729L6657
$$ 976484656 976487219 976473331 976523995 976622283 976688445 976705253 976678491 976603746 976568341 976577461 976575732 976612389
3108I76612389J8716q3208j52648j04546j192r775q5593j07825m3451M0352J7583j8358
$$ 976612389 976631105 976547897 976395249 976290703 976289511 976279736 976194143 976086318 976042867 976083219 976100802 976082444
3132.5I76082444L4034R3163J22129O9142o0439j35660r9659l7551J2517O9320M2319
$$ 976082444 976116478 976209641 976331770 976400912 976340473 976204813 976105154 976067603 976080120 976149440 976191759
3154.9I76191759q2016j26302j1563J18494J27196J5616r596J3649j23918j41680M1485
$$ 976191759 976109743 975983441 975971878 976090372 976217568 976233184 976223588 976237237 976113319 975971639 976013124
3177.3I76013124N2571p6890m5240R4653J20937m0948j71542m0651N0903o9797j12474
$$ 976013124 976065695 975988805 975943565 976038218 976159155 976118207 975946665 975906014 975956917 975887120 975774646
3199.8I75774646n3108l7074M2498J03355o8844k07603q4758N8830N9009M0233O8247
$$ 975774646 975721538 975684464 975726962 975830317 975761473 975553870 975469112 975527942 975586951 975627184 975695431
3222.2I75695431o139j73390j39594P7307J03891l4094p6890p7009m2677J38283J88768
$$ 975695431 975689292 975515902 975376308 975453615 975557506 975523412 975446522 975369513 975326836 975465119 975653887
3244.6I75653887j3173j08123n3107k3723l58J5676m1663q1778j7404P3969P4923j00255
$$ 975653887 975640714 975532591 975479484 975455761 975455403 975471079 975429416 975347638 975330234 975404203 975479126 975378871
3269.1I75378871k28107j23799P689Q6069J26779J20938J07765L3617r1612n1618J49846
$$ 975378871 975150764 975026965 975034654 975120723 975247502 975368440 975476205 975509822 975418210 975366592 975516438
3291.5I75516438J57118k9027j19209o6519j79o557l3080l7372L9339J64091J26780
$$ 975516438 975673556 975644529 975525320 975458801 975458622 975452065 975418985 975381613 975420952 975585043 975711823
3314I75711823L0159j0550j79171k42412K3067K05159J39415M5240j00374j96874n6148
$$ 975711823 975741982 975731432 975552261 975309849 975332916 975538075 975677490 975722730 975622356 975425482 975369334
3336.4I75369334M1127r477Q9050K17378K6703j89603k7418J32084J0729r5964q5115
$$ 975369334 975410461 975400984 975490034 975707412 975734115 975544512 975517094 975649178 975659907 975563943 975478828
3358.8I75478828k1160M4585j8061o9618N8592J74641J50561O8009j5497n7101p987
$$ 975478828 975457668 975502253 975484192 975414574 975473166 975647807 975798368 975866377 975850880 975793779 975785792
3381.3I75785792K622k1636J2577M2200J29878J94490K6822j28448o676J491j59383
$$ 975785792 975788414 975766778 975779355 975821555 975951433 976145923 976172745 976044297 976037621 976039112 975879729
3403.7I75879729p4148O9916R4414Q3267k2590j11639j17541j96516j42277J75715
$$ 975879729 975805581 975875497 975969911 976053178 976030588 975918949 975801408 975604892 975462615 975638330
3424.1I75638330L30567K06530M0055l6776o676m0472j96516k42531j31548N245J84477
$$ 975638330 975968897 976175427 976215482 976178706 976172030 976131558 975935042 975692511 975560963 975566208 975750685
3446.5I75750685K60293N8174j03533m8220J6451M8756N6625K1517k5153K6286K02775
$$ 975750685 976010978 976069152 975965619 975917399 975933850 975982606 976039231 976060748 976035595 976061881 976264656
3469I76264656K40802R3043j0669K5451P1228K8014K205O6698R9361l5942j69813p6056
$$ 976264656 976505458 976598501 976587832 976613283 976684511 976712525 976714730 976781428 976880789 976844847 976675034 976598978
3493.4I76598978P9334M4584l4571Q2136K41220J41918p4565j04189R000N9486j6094
$$ 976598978 976678312 976722896 976688325 976770461 977011681 977153599 977079034 976974845 976983845 977043331 977027237
3515.9I77027237j05559n2810J4126j15931k38180n1260K24650L40462L19242L7134
$$ 977027237 976921678 976868868 976882994 976767063 976528883 976477623 976702273 977042735 977361977 977399111
3536.3I77399111k67446k47956j66654K3901L68297J97828k06947k7657L43800K73108
$$ 977399111 977131665 976883709 976717055 976740956 977109253 977307081 977100134 977072477 977416277 977689385
3556.6I77689385j3351j82211j68682k75850m06206J36018O13570M72606J24275j27613
$$ 977689385 977676034 977493823 977325141 977049291 976643085 976779103 977392673 977865279 977989554 977861941
3577I77861941k4438J57237R1195r8705l02911k48849m2797O4433L2008r6202p7128
$$ 977861941 977837503 977994740 978085935 977987230 977684319 977435470 977392673 977457106 977489114 977392912 977315784
3599.5I77315784J22308K50519K3841k48015o4373l039r7990J88410K27988J06454
$$ 977315784 977438092 977688611 977712452 977464437 977400064 977397025 977299035 977487445 977715433 977821887
3619.9I77821887K90751J59979j72258k68399q1718R1851J17003Q2612P1645Q6844
$$ 977821887 978112638 978272617 978100359 977831960 977750242 977842093 977959096 978041708 978113353 978200197
3640.3I78200197J63853J41383l85940p81239J9312L96669p6651k14041K26736L66331
$$ 978200197 978364050 978505433 978119493 977338254 977357566 977754235 977677584 977463543 977690279 978056610
3660.6I78056610J45197j3769p6950k06709k54988j97232l83496j53721M39883N62369
$$ 978056610 978201807 978188038 978111088 977904379 977649391 977452159 977068663 976914942 977354825 977917194
3681I77917194K96831l5524k48194l23414n901L86119L96072K81275K00450j09792
$$ 977917194 978214025 978178501 977930307 977606893 977600992 977987111 978383183 978664458 978864908 978755116
3701.4I78755116k72870Q9169K56419j80066m69267j04010J3530q4519j14560o6459
$$ 978755116 978482246 978571415 978827834 978647768 978178501 978074491 978088021 978003502 977888942 977822483
3721.8I77822483P0333J04487J28150J39594j09434k82288q225Q8155M0531J8537k13980
$$ 977822483 977892816 977997303 978125453 978265047 978155613 977873325 977865100 977953255 977993786 978012323 977798343
3744.3I77798343j90199J3888p8797K2113K69413K78056P7247j48117j50681n2511
$$ 977798343 977608144 977622032 977543235 977565348 977834761 978112817 978190064 978041947 977891266 977838755
3764.7I77838755K9206O7651J33515K25901J04904j72197k79546j18196M4644K7477
$$ 977838755 977867961 977935612 978069127 978295028 978399932 978227735 977948189 977829993 977874637 977902114
3785I77902114k0086N4896M4703m0114o2168l6180n662m4704J72794K53499j00911
$$ 977902114 977882028 977936924 977981627 977941513 977879345 977843165 977837503 977792799 977965593 978219092 978118181
3807.5I78118181j09017J80245K10821K7180j7941r4056k89142j35362R060J9192M4525
$$ 978118181 978009164 978189409 978400230 978427410 978409469 978315413 978026271 977890909 977899969 977919161 977963686
3829.9I77963686J12712J86980L4392k40803k55108j18255k0087J49012K61068M5061
$$ 977963686 978076398 978263378 978297770 978056967 977801859 977683604 977663517 977812529 978073597 978118658
3850.3I78118658l29018j36971K31564J81794k1875j96993L5882L00109n0842l45946
$$ 978118658 977789640 977652669 977884233 978066027 978044152 977847159 977883041 978183150 978132308 977786362
3870.7I77786362p8797n424r7156k20895j27375K60353J47105q4460k5511J4842K14994
$$ 977786362 977707565 977702141 977604985 977384090 977256715 977517068 977664173 977579713 977554202 977569044 977784038
3893.1I77784038M12285J86264k79545k99931n0008Q94J06096J53303k0325j37091
$$ 977784038 978196323 978382587 978103042 977803111 977753103 977753997 977860093 978013396 977993071 977855980
3913.5I77855980l3199O9201P9691P808k9206J09374J18793j21296j52767J27733J32918
$$ 977855980 977822781 977891982 977971673 977979481 977950275 978059649 978178442 978057146 977904379 978032112 978165030
3936I78165030j05857k0385J51038J490j36316n0783P9751k1458j0192K42770K03669
$$ 978165030 978059173 978038788 978189826 978191316 978055000 978004217 978083968 978062510 978052318 978295088 978498757
3958.4I78498757o0082j81138o4492L8087L3379P7903K0742j28388j43528r0122o3896
$$ 978498757 978438675 978257537 978193045 978231132 978264511 978342414 978363156 978234768 978091240 978001118 977937222
3980.8I77937222Q0108J25468p7665j65939n2750J35481K55108J17838
$$ 977937222 978017330 978142798 978065133 977899194 977846444 977981925 978237033 978354871
3997.1I78354871
$$ 978354871
##END=$$ End of the data block
