##TITLE=Tangara - Marcela $$ Begin of the data block
##JCAMP-DX=5.00 $$ ACD/SpecManager v 10.08
##SPECTROMETER/DATA SYSTEM=Alpha
##DATE=24 Oct 2013 10:57:42
##DATA TYPE=INFRARED SPECTRUM
##DATA CLASS=XYDATA
##ORIGIN=
##OWNER=
##NPOINTS=1765
##FIRSTX=399.75695801
##LASTX=3997.56933594
##MAXX=3997.56933594
##MINX=399.75695801
##MAXY=0.84048396
##MINY=0.18947926
##XFACTOR=1.0000000000
##YFACTOR=1.000000000000000e-9
##FIRSTY=0.48577696
##DELTAX=2.03957629
##XUNITS=1/CM
##YUNITS=ARBITRARY UNITS
##XYDATA=(X++(Y..Y))
399.8D85776961m695237k940386j247168K05070J067966J501858K171904K376437P53790
418.1D84971195j966893k638340k051801j978129k534062l190636k994716j869291
434.4D65747327n55516N68927J840680L569663M802972M415572L066808K070099J712561
452.8D87239093J500427O76900j119226k508580k628178k464801l031105l726095l868222
471.1D70070213l658920k940983k157897j726955j288027n21153K21342J51366n36442
489.5D57612544q95470q50499j021027j469046j914174k283364k405256k430916k829730
507.9D41513062l348321l692508l998518m231334m368662m209281l372311k068490
524.2D12223637q30442J39296R28611J938850L364652M829794N819142N878449M971265
$$ y = [485776961, 481081724, 478141338, 476894170, 477099240, 478167206, 479669064, 481840968, 484217405, 484971195, 483004302, 480365962, 478314161, 476336032, 473801970, 470611334, 467616618, 465747327, 465191811, 465760738, 467601418, 471171081, 475974053, 480389625, 483456433, 485526532, 487239093, 488739520, 489416420, 488297194, 485788614, 483160436, 480695635, 477664530, 473938435, 470070213, 466411293, 463470310, 461312413, 459585458, 458297431, 457776278, 457997620, 458148986, 457612544, 456717074, 455866575, 454845548, 453376502, 451462328, 449178964, 446773708, 444342792, 441513062, 438164741, 434472233, 430473715, 426242381, 421873719, 417664438, 414292127, 412223637, 411393195, 411532491, 412461102, 414399952, 417764604, 422594398, 428413540, 434291989, 439263254]
542.5D39263254L473491J639455j88708j439005k117425k755225l600508m540741n374700
560.9D24359888o033808o598205p116198p094801o019771l891647j154154J442462
577.2C87893766L663510N676568P285595P872373P279038N830407M050672K444029
593.5D31995958J218051L66479j78516m37438l44098J02758O30677J170188J813591
611.9D36337650K477318L167420L974945M659384N010873N095095M916966M568547
628.2D70208198M019409L234655K467453J984746J786947J709551J473128J132131
644.5D88016218J069814J360297J572490J366377J104772J126617J292557J365542
660.8D98274684J244813R50068J007259J735986J788437J512885J380861J318335J549900
$$ y = [439263254, 442736745, 444376200, 444187492, 442748487, 440631062, 437875837, 434275329, 429734588, 424359888, 418326080, 411727875, 404611677, 397516876, 391497105, 387605458, 386451304, 387893766, 391557276, 397233844, 404519439, 412391812, 419670850, 425501257, 429551929, 431995958, 433214009, 433580488, 433401972, 432964534, 432620436, 432723194, 433353871, 434524059, 436337650, 438814968, 441982388, 445957333, 450616717, 455627590, 460722685, 465639651, 470208198, 474227607, 477462262, 479929715, 481914461, 483701408, 485410959, 486884087, 488016218, 489086032, 490446329, 492018819, 493385196, 494489968, 495616585, 496909142, 498274684, 499519497, 500469565, 501476824, 503212810, 505001247, 506514132, 507894993, 509213328, 510763228]
679.2E10763228J849174J698614J085162O64115O10530L85225m51505j747072k981067
697.5E11876404l626525l608942l404081l135026k152532k08676K035708L762185M734874
715.9E06273389N427241O428123P520675P872999P221818O172359N588710N436480
732.2E57941794M811645L281295J513779M59314j10686j265228l393233n536139o489455
750.6E51213086o300986o063104o387412o522060n314529k755522J20282K504289M594087
768.9E25088131O996334R537816J1156499J0940254R391308Q077860P698953P373452
785.2E96260607O097973M446864L827989M651129N880833O186008N456448M817843
801.6F37625694M947424N101800M149378K315998J203298J438260J843930J089334
$$ y = [510763228, 512612402, 514311016, 515396178, 516060293, 516670823, 517056048, 516604543, 514857471, 511876404, 508249879, 504640937, 501236856, 498101830, 495949298, 495740622, 497776330, 501538515, 506273389, 511700630, 518128753, 525649428, 533522427, 540744245, 546916604, 552505314, 557941794, 562753439, 566034734, 567548513, 568007827, 567897141, 566631913, 563238680, 557702541, 551213086, 544912100, 538848996, 532461584, 525939524, 520624995, 517869473, 517989755, 520494044, 525088131, 532084465, 541622281, 552778780, 563719034, 573110342, 581188202, 588887155, 596260607, 602358580, 606805444, 610633433, 615284562, 621165395, 627351403, 632807851, 637625694, 642573118, 647674918, 651824296, 654140294, 655343592, 656781852, 658625782, 659715116]
817.9F59715116o94215k165437k623856k973199m379630o629944q308232q456528p724404
836.2F15759671p309497p389724p068217n770743m115164l171503l313601l850043
852.5E73771179l760815k937913j820028M1783L343403P626832J1502564J3551414
868.9F01318419J3082862J0734856P898867N191207K088726j863838n827128q291960
885.2F24332011q923173q717716q593321q535087p936060o765008n913735o203234
901.5E62744677p438660q665382r349466r888649j0858953j1969447j2241304j1104971
917.8D81227845q868992o309152m077166k311319o67274R84698K302498L109276L769428
936.2D69159842M793733N964786O017029L542304j454055p183105j1871159j5200138
$$ y = [659715116, 659020901, 656855464, 654231608, 651258409, 646878779, 640248835, 631940603, 623484075, 615759671, 608450174, 601060450, 593992233, 588221490, 584106326, 580934823, 577621222, 573771179, 570010364, 567072451, 565252423, 565294206, 568637609, 576264441, 587767005, 601318419, 614401281, 625136137, 633035004, 638226211, 640314937, 638451099, 632623971, 624332011, 615408838, 606691122, 598097801, 589562714, 581626654, 574861646, 568947911, 562744677, 555306017, 546640635, 537291169, 527402520, 516543567, 504574120, 492332816, 481227845, 472358853, 466049701, 461972535, 459661216, 458993942, 459978640, 462281138, 465390414, 469159842, 473953575, 479918361, 485935390, 489477694, 488023639, 480840534, 468969375, 453769237]
952.5D53769237j7625839j9256055j9996196k0136118k0162642k0343840k0515204
966.8C15733343k0307004j9630313j8593401j7189592j5308991j2869611r926156o810173
983.1A95098102l958970j659870M4644J325666K226279K689913K781137K637044K380043
1001.4B03563988K038658J544326R61677M59954J87009L41833Q35970J345545J737028
1019.8B13015988K094165K545059L059476L344283L232017K921641K579376K229482
1036.1B35021487J835182J444414J243145J360863J751319K247318K768383L386348
1052.4B51058459M239649N389809O707401Q004307R204299R887576Q768826M377842
1068.7C07638168k658516q775741j0736167q744449n263656k201259j2904J613765
$$ y = [453769237, 436143398, 416887343, 396891147, 376755029, 356592387, 336248547, 315733343, 295426339, 275796026, 257202625, 240013033, 224704042, 211834431, 201908275, 195098102, 191139132, 189479262, 189523906, 190849572, 193075851, 195765764, 198546901, 201183945, 203563988, 205602646, 207146972, 208108649, 208568603, 208755612, 209097445, 209933415, 211278960, 213015988, 215110153, 217655212, 220714688, 224058971, 227290988, 230212629, 232792005, 235021487, 236856669, 238301083, 239544228, 240905091, 242656410, 244903728, 247672111, 251058459, 255298108, 260687917, 267395318, 275399625, 284603924, 294491500, 303260326, 307638168, 304979652, 296203911, 285467744, 276723295, 271459639, 269258380, 269245476, 270859241]
1085B70859241K972156M127592M970491N289882N065293M460394L528833K380342J398414
1103.4C05052638J031548J495719K470255L311127L610283L443033L105789K746195
1119.7C26266587K408445K175063K300441K995580L974527M368514L369928R79840
1136C48838925k066642m855126o850451p976085q257955p733435o619811n248248l904492
1154.4B95326680k718836j617760m19348R89228K529115M108518N826354P810563R886533
1172.7C21721047J1684448J2949228J3744712J4284015J4552980J4323950J3385057
1187D16645437J1780799R801596P780463N891472M226655K977609K362699K425581
1203.3D63892311K952516L663808M441887N280316O013036O339520O016970N026579
$$ y = [270859241, 273831397, 277958989, 282929480, 288219362, 293284655, 297745049, 301273882, 303654224, 305052638, 306084186, 307579905, 310050160, 313361287, 316971570, 320414603, 323520392, 326266587, 328675032, 330850095, 333150536, 336146116, 340120643, 344489157, 347859085, 348838925, 346772283, 341917157, 335066706, 327090621, 318832666, 311099231, 304479420, 299231172, 295326680, 292607844, 290990084, 290570736, 291559964, 294089079, 298197597, 304023951, 311834514, 321721047, 333405495, 346354723, 360099435, 374383450, 388936430, 403260380, 416645437, 428426236, 438227832, 446008295, 451899767, 456126422, 459104031, 461466730, 463892311, 466844827, 470508635, 474950522, 480230838, 486243874, 492583394, 498600364, 503626943]
1219.7E03626943L673911K311647J087486N5314p40231j242816j357615j146972q47757
1238E05419910n60343j56164M78148J259088J960934K418995K630472K687692K664686
1256.4E18803418K537429K335668K175867K193570K451539K748609K750814K319455
1272.7E38316369J630485R52065L69251j31011n28276q13782r60768j050651j244843
1291E36538839j560866j888156k074421k016902j753807j475632j322031j244247j167834
1309.4E22034943j138329j265109j541316j869977k250850k743721l427029m308879
1325.7E03489733n142749n569756n417049m774451l857732k860725j904070j070201
1342D72893000n25177l44455m45932o77228q60512j003027j178086j332015j405627
$$ y = [503626943, 507300854, 509612501, 510699987, 510755301, 510015070, 508772254, 507414639, 506267667, 505419910, 504859567, 504703403, 505181551, 506440639, 508401573, 510820568, 513451040, 516138732, 518803418, 521340847, 523676515, 525852382, 528045952, 530497491, 533246100, 535996914, 538316369, 539946854, 540898919, 541268170, 541137159, 540608883, 539795101, 538834333, 537783682, 536538839, 534977973, 533089817, 531015396, 528998494, 527244687, 525769055, 524447024, 523202777, 522034943, 520896614, 519631505, 518090189, 516220212, 513969362, 511225641, 507798612, 503489733, 498346984, 492777228, 487360179, 482585728, 478727996, 475867271, 473963201, 472893000, 472367823, 472023368, 471577436, 470900208, 470039696, 469036669, 467858583, 466526568, 465120941]
1360.4D65120941j425594j264810r20773n43147k3455O18875J149059J365840J431346
1378.7D65508282J557201J945138K806306L886759M203827L533631K735734J868785
1395.1D88045663Q20160j44244p45058j050889j421303j712709j824916j889169j740426
1413.4D78337109j330823j068472j022965o52969j19537K56479N99473Q77261J052440
1431.8D76927996J261413J558631J675219J517176J479716J333355R03279J94460o19531
1450.1D86231714j166611j409203j960933k397538j278251J54644J583368L089726
1466.4D82846916M414022O184548Q709162R651423Q975565Q603633Q548557Q435846
1482.8E46369672P939339P670938P693649P288456O219208N848110O125509N614818
$$ y = [465120941, 463695347, 462430537, 461509764, 460966617, 460943162, 461562037, 462711096, 464076936, 465508282, 467065483, 469010621, 471816927, 475703686, 479907513, 483441144, 486176878, 488045663, 488865823, 488721579, 487976521, 486925632, 485504329, 483791620, 481966704, 480077535, 478337109, 477006286, 475937814, 474914849, 474261880, 474142343, 474398822, 474998295, 475875556, 476927996, 478189409, 479748040, 481423259, 482940435, 484420151, 485753506, 486656785, 486851245, 486231714, 485065103, 483655900, 481694967, 479297429, 478019178, 478173822, 479757190, 482846916, 487260938, 493445486, 502154648, 511806071, 520781636, 529385269, 537933826, 546369672, 554309011, 561979949, 569673598, 576962054, 583181262, 589029372, 595154881, 600769699]
1499.1F00769699M851758M516840M960954N419016M108668L343343L518045L652275
1515.4F35140598L617227L410518L392816L072381K666235K622962K524852K673150
1531.7F59120739K802133K457738K424538K858222K401173J785755J743197J771152
1548F77364647J854957J928806K089858K215385K227784J423537Q13723J128554J443744
1566.4F92490995J410127J094043Q46386R56654Q78752L67224J41084N4956p6235l09109
1586.8F97854877o22690j000285j322627j640618k023816k411187k871573l329098
1603.1F82632983l646553l925562m441797m856706m845917n272627o242812n518079
1619.4F43882930m749834n299747n321384m878163m565120l789127l222406l517687
$$ y = [600769699, 605621457, 610138297, 615099251, 620518267, 624626935, 627970278, 631488323, 635140598, 638757825, 642168343, 645561159, 648633540, 651299775, 653922737, 656447589, 659120739, 661922872, 664380610, 666805148, 669663370, 672064543, 673850298, 675593495, 677364647, 679219604, 681148410, 683238268, 685453653, 687681437, 689104974, 689918697, 691047251, 692490995, 693901122, 694995165, 695841551, 696798205, 697676957, 698044181, 698185265, 698240221, 698163986, 697854877, 697232187, 696231902, 694909275, 693268657, 691244841, 688833654, 685962081, 682632983, 678986430, 675060868, 670619071, 665762365, 660916448, 655643821, 649401009, 643882930, 639133096, 633833349, 628511965, 623633802, 619068682, 615279555, 612057149, 608539462]
1635.7F08539462l112495j994729j200497m85778J52886O93977J206696K036750K663613
1654.1F08499885K269208K526224L332078L951609M047513L925383M525602N134464
1670.4F38211966M707455M728258M996359M711151M725278N263448N784571M761040
1686.7F77889526M059851M345298M255533M455388M532337M143953M132033L436446
1703G11250365L017604L003836K771020K837121K995253K978384K769232K210915J906693
1721.4G35740423K053619K130866J968622J919031K021372K221406J870096J354813
1737.7G51280248J430631J600087J668572J692295J578569J375795J244902J258135
1754G63129234J332105J249313J108348J123727J145124J177788J196563J120925R88603
$$ y = [608539462, 605426967, 603432238, 602231741, 601745963, 601898849, 602592826, 603799522, 605836272, 608499885, 610769093, 613295317, 616627395, 620579004, 624626517, 628551900, 633077502, 638211966, 642919421, 647647679, 652644038, 657355189, 662080467, 667343915, 673128486, 677889526, 681949377, 686294675, 690550208, 695005596, 699537933, 703681886, 707813919, 711250365, 714267969, 717271805, 720042825, 722879946, 725875199, 728853583, 731622815, 733833730, 735740423, 737794042, 739924908, 741893530, 743812561, 745833933, 748055339, 749925435, 751280248, 752710879, 754310966, 755979538, 757671833, 759250402, 760626197, 761871099, 763129234, 764461339, 765710652, 766819000, 767942727, 769087851, 770265639, 771462202, 772583127, 773571730]
1772.4G73571730Q62479Q60214R13978Q49187P65801Q37385R53019R94801R42171P91729
1792.8G82342494O98685Q23438R17793P76708O22093P14541Q98838Q86679O76810N19336
1813.2G89877415O14404P84398P90297O61076N70833N97418O93917O72400M00722K29120
1833.6G95892000L21925M48763M94480M93646L72410J35779Q6785J95741K24471J54078
1854G98820078J28091K14040L34680L49939K76506K50816K78354K59101K38538K25485
1874.4H01375628J76072K38835M07458M80234M07696L33965L23415L32594L69668L31342
1894.7H04776907J40667L6240J78515L33846K91824J03891k5987N7161K39789K92361
1915.1H06425214J49011p391N1976K45332K84613J06275m5181M0293K52426L09229
$$ y = [773571730, 774434209, 775294423, 776208401, 777057588, 777823389, 778660774, 779613793, 780608594, 781550765, 782342494, 783041179, 783864617, 784782410, 785559118, 786181211, 786895752, 787794590, 788681269, 789358079, 789877415, 790491819, 791276217, 792066514, 792727590, 793298423, 793895841, 794589758, 795262158, 795662880, 795892000, 796213925, 796662688, 797157168, 797650814, 798023224, 798159003, 798245788, 798441529, 798666000, 798820078, 798948169, 799162209, 799496889, 799846828, 800123334, 800374150, 800652504, 800911605, 801150143, 801375628, 801551700, 801790535, 802197993, 802678227, 803085923, 803419888, 803743303, 804075897, 804445565, 804776907, 804917574, 804953814, 805132329, 805466175, 805757999, 805861890, 805835903, 805893064, 806132853, 806425214, 806574225, 806566834, 806618810, 806864142, 807148755, 807255030, 807209849, 807250142, 807502568, 807811797]
1935.5H07811797J61588K1458R1731K90752L67462K20895L2783O6280K96116M55200
1955.9H09816062L45827J00314L7551K43545M27663L00288K0921l9219J66118L54409
1976.3H11773479K80082K7538q7977O4612K90513K96473M3273j86562r3520J87754
1996.7H12595665K33233m7206l13461k54870j9610r53k81513n22375m30286j71960
2017.1H10786664j49846m29987o70910o26326l91603k64763m22538o86824p11799m33743
2037.5H05998325j80781k63154n20170n14328j82033R0838J6331k31385k89261l0637
2057.9H03893745K82407K84850R776j42873M9055L11374K69354r954j32620M0352K58922
2080.3H05114388K76030J09672l5286M1008K96652M02093K08199k503N4538K88070
$$ y = [807811797, 807973385, 807994843, 808086574, 808377326, 808744788, 808965683, 808998466, 809064746, 809360862, 809816062, 810161889, 810262203, 810299754, 810543299, 810970962, 811271250, 811292171, 811252952, 811419070, 811773479, 812053561, 812081099, 811993122, 812057734, 812348247, 812644720, 812687993, 812501431, 812407911, 812595665, 812828898, 812781692, 812468231, 812213361, 812193751, 812192798, 811911285, 811388910, 810958624, 810786664, 810636818, 810206831, 809535921, 808909595, 808517992, 808253229, 807830691, 807143867, 806432068, 805998325, 805817544, 805554390, 805034220, 804519892, 804337859, 804428697, 804445028, 804213643, 803924382, 803893745, 804176152, 804461002, 804470778, 804327905, 804376960, 804688334, 804957688, 804947734, 804815114, 804855466, 805114388, 805390418, 805500090, 805464804, 805505812, 805802464, 806204557, 806412756, 806410253, 806464791, 806752861]
2100.7H06752861L94642K52485L7551J1027K00629L20971J67012n3823n4776J22189
2121.1H08150768K17021J16586n5193j18077k444J48833J50978J729j09613j1802J82152
2143.6H08670938K04206N3226l5107N0664K36273L40462K76208J91509K47419M16875
2164H10652673N48482N29647M34876M64856O19769O99520O16610M83156M70221N76317
2184.4H16096127O58155O34908N24819M53353N08130O08265O31094N36263M12583M06266
2204.8H21469963N42879O52671N96761M61221M13597N03838N92768N33879L67462K78712
2225.2H26413751L77476N16474M77255K83956J87814K89738M25816M29869K82347J53959
2245.6H29838455K14874L77357M20928K68758R8467J61290M00364M86434L03149J30773
$$ y = [806752861, 807147503, 807399988, 807437539, 807448566, 807649195, 807970166, 808137178, 808083355, 808028579, 808150768, 808367789, 808484375, 808429182, 808311105, 808308661, 808457494, 808608472, 808610201, 808500588, 808488786, 808670938, 808875144, 808928370, 808893263, 808943927, 809180200, 809520662, 809796870, 809988379, 810235798, 810652673, 811201155, 811730802, 812165678, 812630534, 813250303, 813949823, 814566433, 815049589, 815519810, 816096127, 816754282, 817389190, 817914009, 818367362, 818875492, 819483757, 820114851, 820651114, 821063697, 821469963, 822012842, 822665513, 823262274, 823723495, 824137092, 824640930, 825233698, 825767577, 826135039, 826413751, 826791227, 827307701, 827784956, 828068912, 828256726, 828546464, 828972280, 829402149, 829684496, 829838455, 830053329, 830430686, 830851614, 831120372, 831218839, 831380129, 831780493, 832266927, 832570076, 832700849]
2265.9H32700849K20179M43757N22852L67164J54555J26362L12209M75943L81172J45614
2286.3H35850656Q3566K52127M07756L36170R4891j3233J72258L74436L32296J53244
2306.7H38044167O6220K00332M09126L89397J62065O2585K21729L83020L43799J69873
2327.1H40452313k0504o6101M3869P4386q3863k58506k00629p3910k49266m72605l65079
2349.6H38780105j6153L90589N72980K74002k54571l67343j54555j79410m64261o96897
2370H37884486o69658m17471k47360l38614n07414m96984k71618n7220p6294k68758
2390.4H34533095l46124j87218l2306j19567l51309m49837l16441j44601j86979m16041
2410.8H31982672n58376m61519l01123l38077n36859o51181n64813m35949m75764o40094
$$ y = [832700849, 832921028, 833364785, 833887637, 834254801, 834409356, 834535718, 834847927, 835323870, 835705042, 835850656, 835934222, 836186349, 836594105, 836930275, 837025166, 837011933, 837184191, 837558627, 837890923, 838044167, 838110387, 838310719, 838719845, 839109242, 839271307, 839333892, 839555621, 839938641, 840282440, 840452313, 840431809, 840365708, 840409577, 840483963, 840400100, 840141594, 839940965, 839867055, 839617789, 839145184, 838780105, 838763952, 839154541, 839727521, 840001523, 839746952, 839379609, 839225054, 839045644, 838581383, 837884486, 837214828, 836797357, 836549997, 836211383, 835703969, 835206985, 834935367, 834878147, 834801853, 834533095, 834186971, 833999753, 833967447, 833847880, 833496571, 833046734, 832730293, 832585692, 832398713, 831982672, 831424296, 830962777, 830661654, 830323577, 829786718, 829135537, 828570724, 828134775, 827659011, 827018917]
2431.2H27018917p08640o20365n04971m75883n82040p33494p07805n05269m27067n82040
2451.5H21171343p33614o82830n03779m28378n25713o36816o05345m44949l43859m17590
2471.9H15848470n42224n65052m67598l48866l47078m56035n00858l86894k55227k61366
2492.3H11717272l72350m16696k75076j06692j49369l16322l75569k81990j58071j62065
2512.7H09103072l15249m31657l68238k60055l04222m73797o07312n69463m17828l96133
2533.1H04959118n62787p18355p05898n68270n01037o05345p40170p24972n64217m50075
2553.5G98817992n45919p34448p44641n74529m66228n27382o60896o95705n69105m43936
2573.9G92855203m84645o28114o83546n54144l75927l79324n51879o19412m66048k81334
$$ y = [827018917, 826310277, 825689912, 825184941, 824709058, 824127018, 823393524, 822685719, 822180450, 821753383, 821171343, 820437729, 819754899, 819251120, 818822742, 818297029, 817660213, 817054868, 816609919, 816266060, 815848470, 815306246, 814741194, 814273596, 813924730, 813577652, 813121617, 812620759, 812233865, 811978638, 811717272, 811344922, 810928226, 810653150, 810546458, 810397089, 810080767, 809705198, 809423208, 809265137, 809103072, 808787823, 808356166, 807987928, 807727873, 807423651, 806949854, 806342542, 805773079, 805355251, 804959118, 804396331, 803677976, 802972078, 802403808, 801902771, 801297426, 800557256, 799832284, 799268067, 798817992, 798272073, 797537625, 796792984, 796218455, 795752227, 795224845, 794563949, 793868244, 793299139, 792855203, 792370558, 791742444, 791058898, 790504754, 790128827, 789749503, 789197624, 788578212, 788112164, 787830830]
2594.3G87830830k64466m15623n54145n12480l79861m04477n92411p50243p73549p03574
2614.7G82480001p10070q86500j089334j112044r96113r83298j147151j338839j357615
2633.1G72859037j217246j136243j202107j326263j371324j282752j179575j191795
2649.4G62951732j292169j327455j206458j070261j109898j253545j281441j130044
2665.7G53280461r50217r51052j108348j162589j014829q25405p92146r26017j036585
2684.1G44513273j002073q66652p84277r03905j116633j154244j010299r45866j090288
2702.4G35639036j274586j299799j171410j070737j130939j259744j269698j136780
2718.7G26025343j035869j078487j181960j180231j011551q53479q88288j030266j051307
$$ y = [787830830, 787566364, 787150741, 786596596, 786084116, 785704255, 785299778, 784707367, 783957124, 783183575, 782480001, 781769931, 780883431, 779794097, 778682053, 777685940, 776702642, 775555491, 774216652, 772859037, 771641791, 770505548, 769303441, 767977178, 766605854, 765323102, 764143527, 762951732, 761659563, 760332108, 759125650, 758055389, 756945491, 755691946, 754410505, 753280461, 752330244, 751379192, 750270844, 749108255, 748093426, 747268021, 746475875, 745549858, 744513273, 743511200, 742644548, 741860271, 740956366, 739839733, 738685489, 737675190, 736729324, 735639036, 734364450, 733064651, 731893241, 730822504, 729691565, 728431821, 727162123, 726025343, 724989474, 723910987, 722729027, 721548796, 720537245, 719683766, 718795478, 717765212, 716713905]
2737.1G16713905r05394p67350p89345r26494r78232q46028o83427o73830p83623q20756
2757.5G08539426p05421n77688n73575o84917q11220q15451p28309p18951q35955r89378
2777.9G01098561j046121r98080r90629j125157j324057j400113j359821j379549j503349
2796.2F89971685j654446j759708j794219j818597j923919k095699k223969k225577
2812.5F74475551k165318k229750k436578k606213k630949k608896k686977k846241
2828.9F54264629k992809l074288l075421l083944l208697l396333l530919l615201
2845.2F28287017l694117l782272l860354l886939l911912m045129m307091m682183
2861.5E96117020n126536n579293o038725o450832o701589o781161o710887o391465
$$ y = [716713905, 715808511, 715041161, 714251816, 713325322, 712347090, 711501062, 710817635, 710143805, 709360182, 708539426, 707834005, 707256317, 706682742, 705997825, 705186605, 704371154, 703642845, 702923894, 702087939, 701098561, 700052440, 699054360, 698063731, 696938574, 695614517, 694214404, 692854583, 691475034, 689971685, 688317239, 686557531, 684763312, 682944715, 681020796, 678925097, 676701128, 674475551, 672310233, 670080483, 667643905, 665037692, 662406743, 659797847, 657110870, 654264629, 651271820, 648197532, 645122111, 642038167, 638829470, 635433137, 631902218, 628287017, 624592900, 620810628, 616950274, 613063335, 609151423, 605106294, 600799203, 596117020, 590990484, 585411191, 579372466, 572921634, 566220045, 559438884, 552727997, 546336532]
2877.8E46336532n770028m985869m182637l374755k559841j805722j219035q20756
2894.1E21617889n87761n55575o78897r06050j219809j566827j947523k391099k892197
2912.5E08872151l354668l631115l659219l489166l151536k642125j959682j104146
2928.8D85880494j17421R52154K036661L062427L989816M808605N498349N994738O282508
2947.2E18388331O500304O735682O870866O870508O798327O655812O438494O138861
2963.5E71397185N765736N396069N136609N023598M966855M879296M766286M599630
2979.8F11931264M376650M138232L852486L528297L219843K881289K455294K022326
2996.1F38405681J619041J173198P31230L59237j133l79979p30574j052440j385808
$$ y = [546336532, 540566504, 535580635, 531397998, 528023243, 525463402, 523657680, 522438645, 521617889, 521030128, 520474553, 519795656, 518889606, 517669797, 516102970, 514155447, 511764348, 508872151, 505517483, 501886368, 498227149, 494737983, 491586447, 488944322, 486984640, 485880494, 485763073, 486715227, 488751888, 491814315, 495804131, 500612736, 506111085, 512105823, 518388331, 524888635, 531624317, 538495183, 545365691, 552164018, 558819830, 565258324, 571397185, 577162921, 582558990, 587695599, 592719197, 597686052, 602565348, 607331634, 611931264, 616307914, 620446146, 624298632, 627826929, 631046772, 633928061, 636383355, 638405681, 640024722, 641197920, 641929150, 642288387, 642287254, 641907275, 641176701, 640124261, 638738453]
3014.5F38738453j706779j960098k133966k270758k439082k641260k774358k810657
3030.8F20001495k837658k942741l121436l217458l199160l244460l368199l445923
3047.1E94624460l466845l495335l521502l500879l522575l607094l616691l551304
3063.4E66342235l509224l551125l647924l676116l601969l480434l401935l495991
3079.7E37977517l641308l657877l632307l589153l539503l594518l645539l524065
3096E09153247l361046l354550l441065l452689l336757l243506l312141l283918l031671
3114.4D79335904k933830l100216l308475l425390l346890l124148k957582k966821
3130.7D54172552l058881l008336k794146k680838k805233k909750k823711k679079
$$ y = [638738453, 637031674, 635071576, 632937610, 630666852, 628227770, 625586510, 622812152, 620001495, 617163837, 614221096, 611099660, 607882202, 604683042, 601438582, 598070383, 594624460, 591157615, 587662280, 584140778, 580639899, 577117324, 573510230, 569893539, 566342235, 562833011, 559281886, 555633962, 551957846, 548355877, 544875443, 541473508, 537977517, 534336209, 530678332, 527046025, 523456872, 519917369, 516322851, 512677312, 509153247, 505792201, 502437651, 498996586, 495543897, 492207140, 488963634, 485651493, 482367575, 479335904, 476402074, 473301858, 469993383, 466567993, 463221103, 460096955, 457139373, 454172552, 451113671, 448105335, 445311189, 442630351, 439825118, 436915368, 434091657, 431412578]
3147D31412578k511084k385408k514720k735227k693266k508611k408921k384723k359062
3165.4D08911556k270401k185106k175420k168089k111286k043009j990825j999557
3181.7C91967863k012581j944363j834690j758874j766711j805515j820355j778215
3198C77246559j641780j496703j478135j546145j559496j485824j396299j369715j353651
3216.4C63918811j306057j287401j265168j239955j251340j206547j016677q73565
3232.7C54472101j054526j273960j201272j041442r33915q45581q57473r75609r92059
3251.1C45296264q54373p74533q31634q54700p60586o75201o59108o11961m93735n33551
3271.4C38246882p49439q35776p74831p00504o65575o71893o35326n71340n34147n25475
$$ y = [431412578, 428901494, 426516086, 424001366, 421266139, 418572873, 416064262, 413655341, 411270618, 408911556, 406641155, 404456049, 402280629, 400112540, 398001254, 395958245, 393967420, 391967863, 389955282, 388010919, 386176229, 384417355, 382650644, 380845129, 379024774, 377246559, 375604779, 374108076, 372629941, 371083796, 369524300, 368038476, 366642177, 365272462, 363918811, 362612754, 361325353, 360060185, 358820230, 357568890, 356362343, 355345666, 354472101, 353417575, 352143615, 350942343, 349900901, 348966986, 348121405, 347263932, 346288323, 345296264, 344441891, 343667358, 342835724, 341981024, 341220438, 340545237, 339886129, 339274168, 338780433, 338246882, 337497443, 336661667, 335886836, 335186332, 334520757, 333848864, 333213538, 332642198, 332108051, 331582576]
3291.8C31582576n75453o74814p94172q14796o12467l79563m52250p64757r81480j003653
3312.2C24529171r06765q23796q13663p97272p50661p31677q23646r35913r24408q81374
3332.6C16139996q25822p29472p82072r61095j031697j020789r61811q29190q82089
3351C08115959j130700j184732j043260r51767r58621r86129q92252p79718r27508
3369.3B99261272j228392j273036j047224q74132q44389q93712q78304p38800n47469
3387.7B90935814l39716l94672p49290q19177m30554j73867m73171q70019p73222m49598
3408.1B85462528l24994l68416m47571m73083m02063l43442l08662j72317N06Q9795
3428.5B82712281N6445Q6815K16901J06156j91093k24739K4140K18510K39820K06977
$$ y = [331582576, 331007123, 330332309, 329538137, 328723341, 328110874, 327731311, 327279061, 326514304, 325532824, 324529171, 323622406, 322798610, 321984947, 321187675, 320437014, 319705337, 318881691, 317945778, 317021370, 316139996, 315314174, 314584702, 313802630, 312841535, 311809838, 310789049, 309827238, 308998048, 308115959, 306985259, 305800527, 304757267, 303805500, 302846879, 301860750, 300968498, 300188780, 299261272, 298032880, 296759844, 295712620, 294838488, 293994099, 293100387, 292222083, 291483283, 290935814, 290596098, 290201426, 289452136, 288632959, 288202405, 288028538, 287555367, 286685348, 285912126, 285462528, 285137534, 284769118, 284321547, 283848464, 283446401, 283102959, 282794297, 282621980, 282622486, 282712281, 282768726, 282855541, 283072442, 283178598, 282987505, 282762766, 282786906, 283005416, 283245236, 283452213]
3448.9B83452213K72572L66628M03434M76539N61059M70131M08650O86794R14216O58125
3469.3B88670361K69651K71380N04882O91473P19726N48959N02586O61224O71029N81354
3489.7B94092625O45072P57187Q42572Q45640P86543P60883O57529N44757O12527P97242
3510.1C01342577R54926R10550P52688P94291R96649J160056J077473Q36611P79867
3528.4C09605688R37551J122713J238704J223624J143366J259595J443237J377463
3544.7C19351941J138986J138627J367420J487464J509428J582324J743406J892567
3561.1C31212163J876682J784235J914054K175928K264618K284885K409011K552301
3577.4C48473877K709448K920359L040940K937198K778470K972126L209293L255397
$$ y = [283452213, 283724785, 284091413, 284494847, 284971386, 285532445, 286002576, 286411226, 287098020, 288012236, 288670361, 288940012, 289211392, 289716274, 290407747, 291127473, 291676432, 292179018, 292840242, 293511271, 294092625, 294737697, 295494884, 296337456, 297183096, 297969639, 298730522, 299388051, 299932808, 300545335, 301342577, 302297503, 303208053, 303960741, 304755032, 305751681, 306911737, 307989210, 308825821, 309605688, 310543239, 311665952, 312904656, 314128280, 315271646, 316531241, 317974478, 319351941, 320490927, 321629554, 322996974, 324484438, 325993866, 327576190, 329319596, 331212163, 333088845, 334873080, 336787134, 338963062, 341227680, 343512565, 345921576, 348473877, 351183325, 354103684, 357144624, 360081822, 362860292, 365832418, 369041711, 372297108]
3593.7C72297108L373116L586859L681630L664970L651977L594428L663123L885656
3610D01398867M021764M094303M034787L990829M241765M274040M049212L848791L888786
3628.4D37843144M286975M288256M130929M132867M136503M176289M264742M274428
3644.7D71534133M141092M125029M301131M181683L948241M154802M351675M089237
3661E04827023L837943L879249L833532L636777L738225L604412L211081L306329L437877
3679.4E37312448L365159L369927L369689L225208K867877K613485K632737K687037
3695.7E61443567K649367K489805K343178K379060K426028K288461J990437J830936
3712E79840839K087593K228618K090156J922667J824796J704156J616776J796782J934648
$$ y = [372297108, 375670224, 379257083, 382938713, 386603683, 390255660, 393850088, 397513211, 401398867, 405420631, 409514934, 413549721, 417540550, 421782315, 426056355, 430105567, 433954358, 437843144, 442130119, 446418375, 450549304, 454682171, 458818674, 462994963, 467259705, 471534133, 475675225, 479800254, 484101385, 488283068, 492231309, 496386111, 500737786, 504827023, 508664966, 512544215, 516377747, 520014524, 523752749, 527357161, 530568242, 533874571, 537312448, 540677607, 544047534, 547417223, 550642431, 553510308, 556123793, 558756530, 561443567, 564092934, 566582739, 568925917, 571304977, 573731005, 576019466, 578009903, 579840839, 581928432, 584157050, 586247206, 588169873, 589994669, 591698825, 593315601, 595112383, 597047031]
3730.3E97047031J840532J561820J380801J635194J758158J279295R92298J532674
3746.7F09027803J510203J046955J281918J648366J489878J185417J181364J327872
3763F19699776J367867J297951J069486J005352J236498J380622J302719J091958R73045
3781.3F30425274R76265J037359J140714J194715J139462J012504J008511J142800
3797.7F39077604R66430P30931R58264R21667P46488R68397J179874R83238P37846
3816F47270739R24289P83742N95331Q64029R24706Q80242Q45074Q41380R46641Q16226
3836.4F55692399N52356N62548O19472O83784Q54909R88007Q08537J42932R0718Q59261
3856.8F61854923R86099P46906N66065N85437O84738N74231N37932N78761N79596O60419
$$ y = [597047031, 598887563, 600449383, 601830184, 603465378, 605223536, 606502831, 607495129, 609027803, 610538006, 611584961, 612866879, 614515245, 616005123, 617190540, 618371904, 619699776, 621067643, 622365594, 623435080, 624440432, 625676930, 627057552, 628360271, 629452229, 630425274, 631401539, 632438898, 633579612, 634774327, 635913789, 636926293, 637934804, 639077604, 640044034, 640774965, 641733229, 642654896, 643401384, 644369781, 645549655, 646532893, 647270739, 648195028, 648978770, 649574101, 650438130, 651362836, 652243078, 653088152, 653929532, 654876173, 655692399, 656244755, 656807303, 657426775, 658110559, 658965468, 659953475, 660762012, 660904944, 660995662, 661854923, 662841022, 663587928, 664153993, 664739430, 665424168, 665998399, 666536331, 667115092, 667694688, 668355107]
3877.2F68355107N99921N73695N71131L95477M72367N60641L62397L90350O37174O54399
3897.6F73572659N11706L77238K12252K44022M49419N10394M91679M70519L38793K20179
3918F77398860K84136L53515L16977K83421K96890K85089L11613M01199L82781L32773
3938.4F80647254L17514K69294L18050L71337K96116K56300K85268L28123L46721L16441
3958.8F83752418K57730K45929K88606L04281K96414K61247K27750K31623K22981K35141
3979.2F86324120L40104L86297K80559K07901K21014K08259K15232K75791K60592
3997.5F88719869
$$ y = [668355107, 668955028, 669528723, 670099854, 670495331, 670967698, 671528339, 671890736, 672281086, 672918260, 673572659, 674084365, 674461603, 674673855, 674917877, 675367296, 675877690, 676369369, 676839888, 677178681, 677398860, 677682996, 678036511, 678353488, 678636909, 678933799, 679218888, 679530501, 679931700, 680314481, 680647254, 680964768, 681234062, 681552112, 681923449, 682219565, 682475865, 682761133, 683089256, 683435977, 683752418, 684010148, 684256077, 684544683, 684848964, 685145378, 685406625, 685634375, 685865998, 686088979, 686324120, 686664224, 687050521, 687331080, 687538981, 687759995, 687968254, 688183486, 688459277, 688719869]
##END=$$ End of the data block
