##TITLE=Tangara - Marcela $$ Begin of the data block
##JCAMP-DX=5.00 $$ ACD/SpecManager v 10.08
##SPECTROMETER/DATA SYSTEM=Alpha
##DATE=24 Oct 2013 10:57:42
##DATA TYPE=INFRARED SPECTRUM
##DATA CLASS=XYDATA
##ORIGIN=
##OWNER=
##NPOINTS=1765
##FIRSTX=399.75695801
##LASTX=3997.56933594
##MAXX=3997.56933594
##MINX=399.75695801
##MAXY=0.84134358
##MINY=0.19003007
##XFACTOR=1.0000000000
##YFACTOR=1.000000000000000e-9
##FIRSTY=0.48745847
##DELTAX=2.03957629
##XUNITS=1/CM
##YUNITS=ARBITRARY UNITS
##XYDATA=(X++(Y..Y))
399.8D87458467n199760k936870o64055N92500O73682J101970K405465K768576P61896
418.1D86961871k261072k938062k310276k142787k615511l208906k761632j454562
434.4D67269063l38167M83275J455485L098339M744381M834682L409832K023578J654089
452.8D88634557J600503N97060j470029k633184k389908k256125k981395l827095m047900
471.1D71226484l676534k811134k113223j818270j397043o51002J46955L27736l51041
489.5D58882928r11862q35597r46284j438707j776367j987249k303749k613694k967476
507.9D43101943l445775l753423l929586m292875m509866m141510l377199k224803
524.2D13426906q56370J83344R89497J974195L372997N000353N983978N701900M591793
$$ plain form
399.8 487458467 482258707 479321837 478657782 479250282 479923964 481025934 483431399 486199975 486961871
418.1 486961871 484700799 481762737 479452461 477309674 474694163 471485257 468723625 467269063
434.4 467269063 466930896 467414171 468869656 471967995 476712376 481547058 484956890 486980468 488634557
452.8 488634557 490235060 490832120 489362091 486728907 484338999 482082874 479101479 475274384 471226484
471.1 471226484 467549950 464738816 462625593 460807323 459410280 458759278 458906233 459233969 458882928
489.5 458882928 457971066 457135469 456189185 454750478 452974111 450986862 448683113 446069419 443101943
507.9 443101943 439656168 435902745 431973159 427680284 423170418 419028908 415651709 413426906
524.2 413426906 412570536 412753880 413743377 415717572 419090569 424090922 430074900 435776800 440368593
542.5D40368593L256380J701862L6567j327514k199471k843142l624379m541755n325049
560.9D25502092n933792o540745p064283p073522o060153l878236j133650J409948
577.2C89227659L630012N634576P222056P875622P302343N751878L950835K483904
593.5D33078885J371086L99768k32577l76791k68400J31011P14571J179874J726210
611.9D37723637K555042L331334M007279M611344M991710N212128N115867M629343
628.2D72177684L953547L195166K465904K064556J920968J717329J438171J213401
644.5D90146726J160294J331300J503646J400769J185983J203448J402020J451522
660.8E00785708J257480R28640R96232J695037J703620J444399J405120J441836J631022
$$ plain form
542.5 440368593 443624973 445326835 445363402 444035888 441836417 438993275 435368896 430827141 425502092
560.9 425502092 419568300 413027555 405963272 398889750 392829597 388951361 387817711 389227659
577.2 389227659 392857671 398492247 405714303 413589925 420892268 426644146 430594981 433078885
593.5 433078885 434449971 434849739 434617162 434240371 433971971 434102982 434817553 435997427 437723637
611.9 437723637 440278679 443610013 447617292 452228636 457220346 462432474 467548341 472177684
628.2 472177684 476131231 479326397 481792301 483856857 485777825 487495154 488933325 490146726
644.5 490146726 491307020 492638320 494141966 495542735 496728718 497932166 499334186 500785708
660.8 500785708 502043188 502971828 503968060 505663097 507366717 508811116 510216236 511658072 513289094
679.2E13289094J849174J724661J159251P04228O55711M97639m28438j908481l128648
697.5E14414191l617108l576874l438354l183842k226293k40534K144664L923834M823863
715.9E09023547N430818O469607P610262P876992P189512O197214N660772N524815
732.2E60983539M852235L232002J464784N10574q3685j431108l592848n572081o482661
750.6E53880751o397068o263733o586731o604373n270779k644897K11299K561628M655540
768.9E27541637P088185R621978J1134088J0880530R417355Q151412P738113P366121
785.2E98939419O115496M476011L819108M675150N954623O224632N406857M787385
801.6F40398681M998088N035758L942549K244413J309455J553893J944661J101315
$$ plain form
679.2 513289094 515138268 516862929 518022180 518726408 519382119 519879758 519451320 517542839 514414191
697.5 514414191 510797083 507220209 503781855 500598013 498371720 498131186 500275850 504199684 509023547
715.9 509023547 514454365 520923972 528534234 536411226 543600738 549797952 555458724 560983539
732.2 560983539 565835774 569067776 570532560 571043134 570959449 569528341 565935493 560363412 553880751
750.6 553880751 547483683 541219950 534633219 528028846 522758067 520113170 520324469 522886097 527541637
768.9 527541637 534629822 544251800 555385888 566266418 575683773 583835185 591573298 598939419
785.2 598939419 605054915 609530926 613350034 618025184 623979807 630204439 635611296 640398681
801.6 640398681 645396769 650432527 654375076 656619489 657928944 659482837 661427498 662528813
817.9F62528813q41439k362192k800166l114522m502356o804704q530021q630395p811427
836.2F17131591p369936p476389p144034n784035m045784l060460l260017l812492
852.5E75178444l691971k892733j764178J22249L406644P663489J1475324J3432682
868.9F02929950J2924075J0563075P654369M903257J828611k092481n957722q319438
885.2F24433696q942485q774340q699178q613646p907093o706476n940557o282627
901.5E62567294p469237q653820r370565r957910j0910630j1944592j2138456j0990828
917.8D81131256q832872o331027m047423k214313n90354J008063K272368L043473L748387
936.2D69187558M832804N986780N963027L409326j615315p316321j1987955j5333593
$$ plain form
817.9 662528813 661687374 659325182 656525016 653410494 648908138 642103434 633573413 624943018 617131591
836.2 617131591 609761655 602285266 595141232 589357197 585311413 582250953 578990936 575178444
852.5 575178444 571486473 568593740 566829562 566951811 570358455 578021944 589497268 602929950
868.9 602929950 615854025 626417100 634071469 638974726 640803337 638710856 632753134 624433696
885.2 624433696 615491211 606716871 598017693 589404047 581496954 574790478 568849921 562567294
901.5 562567294 555098057 546444237 537073672 527115762 516205132 504260540 492122084 481131256
917.8 481131256 472298384 465967357 461919934 459705621 459115267 460123330 462395698 465439171 469187558
936.2 469187558 474020362 480007142 485970169 489379495 487764180 480447859 468459904 453126311
952.5D53126311j7730474j9286990j9979000k0103097k0146400k0338714k0470292
966.8C15071344k0253300j9595415j8481284j6971156j5074283j2686223r801462o708726
983.1A95499495l874913j594514J03608J324549K180115K712234K850846K646953K331510
1001.4B04179883K015740J590490J004785M41254J61081L34188Q36686J361996J756534
1019.8B13682637K131775K595275L046662L280595L198743K914086K575636K232298
1036.1B35657707J845568J481191J311779J436278J782358K228304K742276L370121
1052.4B51855582M255801N430729O698429P914722R087295R783059Q669555M318386
1068.7C08013558k595901q603275j0568201q657873n241573k190799m410J599818K928317
$$ plain form
952.5 453126311 435395837 416108847 396129847 376026750 355880350 335541636 315071344
966.8 315071344 294818044 275222629 256741345 239770189 224695906 212009683 202208221 195499495
983.1 195499495 191624582 190030068 190133676 191458225 193638340 196350574 199201420 201848373 204179883
1001.4 204179883 206195623 207786113 208790898 209232152 209393233 209727421 210564107 211926103 213682637
1019.8 213682637 215814412 218409687 221456349 224736944 227935687 230849773 233425409 235657707
1036.1 235657707 237503275 238984466 240296245 241732523 243514881 245743185 248485461 251855582
1052.4 251855582 256111383 261542112 268240541 276155263 285242558 295025617 303695172 308013558
1068.7 308013558 305417657 296814382 286246181 277588308 272346735 270155936 270151526 271751344 274679661
1087.1B74679661M075378M923910N249083N028754M409105L520668K457469J480073
1103.4C05824101J065582J482815K423584L284544L654241L493786L059089K671719
1119.7C26959461K411783K193749K276033K951115L919304M330575L359586R67771
1136C49369377k064437m832864o800443p876843q172512p693440o590336n229384l905445
1154.4B96203673k741516j645386m30584R92984K549827M137188N827367P764399R792924
1172.7C22450876J1564166J2881130J3782441J4370680J4609098J4345229J3389319
1187D17392939J1757017R772092P780492N904168M225910K969086K362460K439081
1203.3D64603245K981514L716677M508704N313158N994022O298185N966454M965723
$$ plain form
1087.1 274679661 278755039 283678949 288928032 293956786 298365891 301886559 304344028 305824101
1103.4 305824101 306889683 308372498 310796082 314080626 317734867 321228653 324287742 326959461
1119.7 326959461 329371244 331564993 333841026 336792141 340711445 345042020 348401606 349369377
1136 349369377 347304940 342472076 335671633 327794790 319622278 311928838 305338502 300109118 296203673
1154.4 296203673 293462157 291816771 291386187 292379171 294928998 299066186 304893553 312657952 322450876
1172.7 322450876 334015042 346896172 360678613 375049293 389658391 404003620 417392939
1187 417392939 429149956 438922048 446702540 452606708 456832618 459801704 462164164 464603245
1203.3 464603245 467584759 471301436 475810140 481123298 487117320 493415505 499381959 504347682
1219.7E04347682L605485K268732J106977R3460p34150j237750j336754j132071q28385
1238E06153226n23090j13845N22613J318515J999974K389908K579391K672016K664984
1256.4E19663692K540826K343893K162815K173542K456308K760351K743601K301932
1272.7E39146960J610636R37820M04716n8294m76062p87318r69529j086116j257598
1291E37465215j550138j878739k041757j943826j702905j487851j342118j238287j156985
1309.4E23122609j138389j296044j589954j890182k236724k724409l440321m347026
1325.7E04459560n125105n485803n355060m753769l827393k809405j866460j067877
1342D74168688n59062m15295m95941o69956q48531j017839j191914j302779j364201
$$ plain form
1219.7 504347682 507953167 510221899 511328876 511422336 510688186 509450436 508113682 506981611 506153226
1238 506153226 505630136 505516291 506038904 507357419 509357393 511747301 514326692 516998708 519663692
1256.4 519663692 522204518 524548411 526711226 528884768 531341076 534101427 536845028 539146960
1272.7 539146960 540757596 541695416 542100132 542041838 541565776 540778458 539808929 538722813 537465215
1291 537465215 535915077 534036338 531994581 530050755 528347850 526859999 525517881 524279594 523122609
1309.4 523122609 521984220 520688176 519098222 517208040 514971316 512246907 508806586 504459560
1325.7 504459560 499334455 493848652 488493592 483739823 479912430 477103025 475236565 474168688
1342 474168688 473609626 473194331 472698390 472028434 471179903 470162064 468970150 467667371 466303170
1360.4D66303170j439542j330107r82344n63801q344O31690J145094J382888J466691
1378.7D66605395J572877J945049K782523L810317M093617L448665K697319J831174
1395.1D88786936P72834j56254p60466j075089j396715j671911j818806j890629j722515
1413.4D79067385j286119r74953r47744o74039j54138K50429N88060Q63194J057059
1431.8D77789134J293361J622885J710892J498312J474440J344234Q84771J47939o32167
1450.1D87133801j113802j329273j906038k426236j345486J37597J594782L071100
1466.4D83816445M412949O220520Q688986R574234Q942783Q585870Q511663Q432150
1482.8E47185600P989704P745624P759631P294237O182134N835414O165982N669415
$$ plain form
1360.4 466303170 464863628 463533521 462551177 461987376 461979032 462610722 463755816 465138704 466605395
1378.7 466605395 468178272 470123321 472905844 476716161 480809778 484258443 486955762 488786936
1395.1 488786936 489559770 489403516 488643050 487567961 486171246 484499335 482680529 480789900 479067385
1413.4 479067385 477781266 476806313 475858569 475184530 475030392 475280821 475868881 476732075 477789134
1431.8 477789134 479082495 480705380 482416272 483914584 485389024 486733258 487618029 487765968 487133801
1450.1 487133801 486019999 484690726 482784688 480358452 479012966 479150563 480745345 483816445
1466.4 483816445 488229394 494449914 503138900 512713134 521655917 530241787 538753450 547185600
1482.8 547185600 555175304 562920928 570680559 577974796 584156930 589992344 596158326 601827741
1499.1F01827741M870534M554510N078435N492210M020393L259420L519774L691912
1515.4F36314929L641128L470838L492415L109813K644121K568365K483487K676487
1531.7F60401583K793729K458692K523839L000319K419591J697004J646221J752376
1548F78693354J899183J964390K136827K300858K294123J382590P49290J092195J433492
1566.4F93946302J414120J074493Q57949J019478Q75831K81215P6770K1160n0068k35021
1586.8F99282229o07848j042187j362622j655400j983941k345502k825558l282905
1603.1F84176266l585577l869295m386187m772841m712224n118251o139756n477666
1619.4F46114469m714251n241692n241811m807055m526198l734231l090680l350496
$$ plain form
1499.1 601827741 606698275 611252785 616331220 621823430 625843823 629103243 632623017 636314929
1515.4 636314929 639956057 643426895 646919310 650029123 652673244 655241609 657725096 660401583
1531.7 660401583 663195312 665654004 668177843 671178162 673597753 675294757 676940978 678693354
1548 678693354 680592537 682556927 684693754 686994612 689288735 690671325 691420615 692512810 693946302
1566.4 693946302 695360422 696434915 697292864 698312342 699188173 699469388 699546158 699567318 699517250 699282229
1586.8 699282229 698674381 697632194 696269572 694614172 692630231 690284729 687459171 684176266
1603.1 684176266 680590689 676721394 672335207 667562366 662850142 657731891 651592135 646114469
1619.4 646114469 641400218 636158526 630916715 626109660 621583462 617849231 614758551 611408055
1635.7F11408055l033579j963973j129150l35872L70920Q49008J276732K157449K781153
1654.1F12380743K265334K521396L391862M071235M147292L956079M538834N143345
1670.4F42416120M707813M742145M981399M663289M699945N244493N711735M665732
1686.7F81832671L998041M294396M211843M417896M467368M074037M047573L331542
1703G14675367K935111K930463K701640K791583K987922K992570K724171K098858J833797
1721.4G38671482K005398K039671J888573J924038K097428K282381J812339J271546
1737.7G53992856J400113J591444J653194J664221J560927J385748J244843J238585
1754G65731931J317143J229942J086950J079798J073301J156747J233101J163244J001895
$$ plain form
1635.7 611408055 608374476 606410503 605281353 604945481 605316401 606165409 607442141 609599590 612380743
1654.1 612380743 614646077 617167473 620559335 624630570 628777862 632733941 637272775 642416120
1670.4 642416120 647123933 651866078 656847477 661510766 666210711 671455204 677166939 681832671
1686.7 681832671 685830712 690125108 694336951 698754847 703222215 707296252 711343825 714675367
1703 714675367 717610478 720540941 723242581 726034164 729022086 732014656 734738827 736837685 738671482
1721.4 738671482 740676880 742716551 744605124 746529162 748626590 750908971 752721310 753992856
1737.7 753992856 755392969 756984413 758637607 760301828 761862755 763248503 764493346 765731931
1754 765731931 767049074 768279016 769365966 770445764 771519065 772675812 773908913 775072157 776074052
1772.4G76074052Q08477P90477Q81970Q19743P31647Q28325R34661R73642R68337Q20637
1792.8G84631968O97910Q26300R13202P58767O00636O89269Q90672Q96811O67393M96448
1813.2G92069376O09993P81179P80880O76275O03616O21557P15196O89507L79205J76489
1833.6G98103273K88427M50432N30958N44310L73244R1613O9081J93060K09689J47462
1854H01001549J47402K40147L34442L28839K85267L03448L04401K06053J80185K23219
1874.4H03554952J97828K36988L90887M89474M28915L26454K90692L04103L51310L16560
1894.7H06888163J55687P0394J82390L14235K85685J27852J0193P3969K33114K89679
1915.1H08631361J69158L993L9279K26975K61486R7811k7180M7863K33531K95698J63377
$$ plain form
1772.4 776074052 776882529 777673006 778554976 779374719 780106366 780934691 781869352 782842994 783811331 784631968
1792.8 784631968 785329878 786156178 787069380 787828147 788428783 789118052 790008724 790905535 791572928 792069376
1813.2 792069376 792679369 793460548 794241428 794917703 795521319 796142876 796858072 797547579 797926784 798103273
1833.6 798103273 798391700 798842132 799373090 799917400 800290644 800382257 800451338 800644398 800854087 801001549
1854 801001549 801148951 801389098 801723540 802052379 802337646 802641094 802945495 803151548 803331733 803554952
1874.4 803554952 803752780 803989768 804380655 804870129 805299044 805625498 805916190 806220293 806571603 806888163
1894.7 806888163 807043850 807114244 807296634 807610869 807896554 808024406 808034599 808108568 808341682 808631361
1915.1 808631361 808800519 808804512 808843791 809070766 809332252 809430063 809402883 809450746 809684277 809979975 810143352
1937.6H10143352L8743J26242L09289L59952K12789L0339P9393L34799M74811L29554
1958H12439263R2387L3379K31564M14252K84672K3126k3543J72078L63946K92242K1875
1980.4H14345241r3520Q9526L32952L05533J3053j97529p2301J96815K00748r2149
2000.8H15028369l12566k14219J1980l636k91288m88102l84331j76489j82033m55797
2021.2H12531888o80506o04391l58403k51770m29511o80208o59883l76403j73033k85208
2041.6H08032572n24699m98236j84357M8757k6405k22266k26497M4763K99692K27511
2062H06970835k4021j00911R4355L06069K48492j0609j17481N6386K69651K92182J22786
2084.4H08107734k4021O7115L15130L87311J83642J013Q1181L06249L84569K30611
$$ plain form
1937.6 810143352 810182095 810308337 810617626 810977578 811190367 811220706 811300099 811634898 812109709 812439263
1958 812439263 812531650 812565029 812796593 813210845 813495517 813518643 813495100 813667178 814031124 814323366 814345241
1980.4 814345241 814251721 814341247 814674199 814979732 814992785 814795256 814722955 814919770 815120518 815028369
2000.8 815028369 814715803 814501584 814513564 814509928 814218640 813730538 813346207 813169718 812987685 812531888
2021.2 812531888 811851382 811246991 810888588 810636818 810207307 809527099 808867216 808490813 808317780 808032572
2041.6 808032572 807507873 807009637 806825280 806874037 806847632 806625366 806398869 806443632 806743324 806970835
2062 806970835 806946814 806845903 806940258 807246327 807494819 807484210 807366729 807423115 807692766 807984948 808107734
2084.4 808107734 808083713 808150828 808465958 808853269 809036911 809037924 809119105 809425354 809809923 810040534
2104.8H10040534N6386O8545K20835K90811J64151o675j3292J32799K17199J06335
2125.2H11277628q2672j21236L8624J83940J49846j7285j13547j371J77503J90377
2145.6H11681807M7505k8431Q6188K73526L37302K48015J70529K51591M29869N52297
2166H14050198N20765M14312M57764O30438P19011O43075N04911M83691N95212O73890
2186.4H19693267O21558M93347M25041N19991O72400O75738N23448L91841M13119N69940
2206.8H24999690O81341N99742M30941L85165N01454O00517N39482L70621K81275L75032
2227.2H29765260N09322M86135L06785J96219K95520M45545M11093K19941J24872K29299
2247.6H32989991L88086M03046K46048J24931K03789L91125M56691K99573J27256J81079
$$ plain form
2104.8 810040534 810096920 810165465 810386300 810677111 810841262 810834587 810821295 810954094 811171293 811277628
2125.2 811277628 811194956 811073720 811112344 811296284 811446130 811428845 811315298 811313927 811491430 811681807
2145.6 811681807 811729312 811700881 811787069 812060595 812397897 812645912 812816441 813068032 813497901 814050198
2166 814050198 814570963 814985275 815443039 816073477 816792488 817435563 817940474 818424165 819019377 819693267
2186.4 819693267 820314825 820808172 821233213 821753204 822425604 823101342 823624790 824016631 824429750 824999690
2206.8 824999690 825681031 826280773 826711714 827096879 827598333 828198850 828738332 829108953 829390228 829765260
2227.2 829765260 830274582 830760717 831067502 831263721 831559241 832004786 832415879 832635820 832760692 832989991
2247.6 832989991 833378077 833781123 834027171 834152102 834355891 834747016 835203707 835503280 835630536 835811615
2268H35811615M07577N14626L58403J50025J57594L67344M82857L41117J19210R0599
2288.4H38800967K70724L64959K19703k38l6538J65284L18110K11060K4676n36J62005
2310.8H40500176L30687K43365n6505j88053L3796K74360K05756n0903k14398j13964
2331.2H40964317O6936L4929j53482k88904k49505n0902P2896j12355l52323l47137
2351.6H39584470j13785Q0406J8656k17735k47777p0929l8267j14202j90258j98305
2372H38492274k0444R0480p0989k68698k35319q703R2805o7771k79486l07441j54674
2394.4H37262034m6193j49012l67522m36902k78056j33455k25544m47750n40971m23491
2414.8H34213138k80738l28303n29050o55056n65648m13537m47690o33180p24554o21379
$$ plain form
2268 835811615 836219192 836733818 837092221 837242246 837399840 837767184 838250041 838591158 838710368 838800967
2288.4 838800967 839071691 839436650 839656353 839656115 839619577 839784861 840102971 840314031 840338707 840338171 840500176
2310.8 840500176 840830863 841074228 841017723 840829670 840863466 841137826 841343582 841292679 841078281 840964317
2331.2 840964317 841031253 841066182 840912700 840623796 840374291 840323389 840396285 840283930 839931607 839584470
2351.6 839584470 839470685 839551091 839569747 839352012 839104235 839033306 838995039 838880837 838690579 838492274
2372 838492274 838471830 838562310 838491321 838222623 837987304 837978601 838071406 838003635 837724149 837416708 837262034
2394.4 837262034 837215841 837066829 836699307 836262405 835984349 835850894 835625350 835177600 834636629 834213138
2414.8 834213138 833932400 833604097 833075047 832419991 831854343 831440806 830993116 830359936 829635382 829014003
2435.2H29014003m58955m37320n96642p52032p15196n21183m21584n57780p31111o84321
2455.6H23137879m81009l98040n13971o27279n63800m08173l86000n10096n68569m99308
2476H18181634l95477l44217l91841m80592m78625l39866k00510k23219l81232m28557
2496.4H14517498k49624q3328j52528l35514l90232k71916j26303j35660l14593m36246
2516.8H12021554l65794k62559l03626m65750n72503n14388m00901m08649n56291o91592
2537.2H07479501o89864n75066n17547o08504p20382p02381n63562m86314n71311o90758
2557.6H01353812o88314n59092m54068n10454o49929o88017n53608m16040m88818o63101
2578G95682371o98805n41985l71635l90589n33164n74827m28319k48492k70665m75466
$$ plain form
2435.2 829014003 828555048 828117728 827521086 826769054 826053858 825532675 825111091 824553311 823822200 823137879
2455.6 823137879 822656870 822258830 821744859 821117580 820553780 820145607 819759607 819249511 818680942 818181634
2476 818181634 817786157 817441940 817050099 816569507 816090882 815751016 815550506 815327287 814946055 814517498
2496.4 814517498 814267874 814184546 814032018 813696504 813306272 813034356 812908053 812772393 812457800 812021554
2516.8 812021554 811655760 811393201 811089575 810623825 810051322 809536934 809136033 808727384 808171093 807479501
2537.2 807479501 806789637 806214571 805697024 805088520 804368138 803665757 803102195 802615881 802044570 801353812
2557.6 801353812 800665498 800106406 799652338 799141884 798491955 797803938 797250330 796834290 796345472 795682371
2578 795682371 794983566 794441581 794069946 793679357 793146193 792571366 792143047 791894555 791623890 791148424
2598.4G91148424n85496m83513l27587l52264n78224p62701p78795p01487o98030q81016
2618.8G84999311j083791j089275r64225r57190j164139j373946j350761j175225j095593
2637.1G74745166j203775j372039j385034j225590j108706j155794j290977j330852
2653.5G64672399j191378j053989j089156j228034j279772j135230r40442r48429j119435
2671.8G54686534j163601r90630p93814p84576r36866j025498r34064p90656p89642
2690.2G46477187r48966j113117j107692r69887r55105j131773j289606j275957j136839
2708.5G36548245j046956j133978j290977j283288j106918j012981j091599j184762
2724.8G27396786j149237r90748q62539q92341j016856j045584r18806p83503p79807
$$ plain form
2598.4 791148424 790562928 790079415 789751828 789399564 788821340 788058639 787279844 786578357 785880327 784999311
2618.8 784999311 783915520 782826245 781862020 780904830 779740691 778366745 777015984 775840759 774745166
2637.1 774745166 773541391 772169352 770784318 769558728 768450022 767294228 766003251 764672399
2653.5 764672399 763481021 762427032 761337876 760109842 758830070 757694840 756754398 755805969 754686534
2671.8 754686534 753522933 752532303 751738489 750953913 750017047 748991549 748057485 747266829 746477187
2690.2 746477187 745528221 744415104 743307412 742337525 741382420 740250647 738961041 737685084 736548245
2708.5 736548245 735501289 734367311 733076334 731793046 730686128 729673147 728581548 727396786
2724.8 727396786 726247549 725256801 724394262 723501921 722485065 721439481 720520675 719737172 718957365
2743.2G18957365q91328r40085q22186o79016o73712p79092q25584p13825n49257n21898
2763.6G11561382o67751q08537q01086p17640p02918q31962j001596j021862r59396
2782G04048634r96292j139522j278817j338005j364291j412451j519084j666189j751303
2800.3F91582680j764417j795888j911104k069413k182782k238095k238929k249301
2816.6F75132751k397596k584517k620161k597153k689660k850890k977967l049255
2832.9F53365552l062725l112077l278256l454029l541887l608883l708362l815055
2849.3F25784278l918111l982604l992736m076600m350186m778266n261302n706250
2865.6E89718223o130278o545604o830811o918550o773591o379068n810618n110979
$$ plain form
2743.2 718957365 718066037 717125952 716303766 715624750 714951038 714171946 713346362 712632537 712083280 711561382
2763.6 711561382 710893631 710085094 709284008 708566368 707863450 707031488 706029892 705008030 704048634
2782 704048634 703052342 701912820 700634003 699295998 697931707 696519256 695000172 693333983 691582680
2800.3 691582680 689818263 688022375 686111271 684041858 681859076 679620981 677382052 675132751
2816.6 675132751 672735155 670150638 667530477 664933324 662243664 659392774 656414807 653365552
2832.9 653365552 650302827 647190750 643912494 640458465 636916578 633307695 629599333 625784278
2849.3 625784278 621866167 617883563 613890827 609814227 605464041 600685775 595424473 589718223
2865.6 589718223 583587945 577042341 570211530 563292980 556519389 550140321 544329703 539218724
2881.9E39218724m294276l410578k549768j815259j264095q92044o52432n54323o47605
2900.2E23138344q90970j199782j576125k016962k450883k903402l368855l660500
2916.6E05070865l681958l524839l219188k702117j968205j056641l9399R96501K025157
2934.9D91900176L049940M018157M844517N494177N982101O316006O552339O770313
2951.2E34927726O914615O927193O872058O779253O602943O298244N887747N504787
2967.6E86714566N261361N153120N106687N016685M878998M744887M553795M285455
2983.9F25715554M003167L683090L331244K987862K591789K163827J743615J287341
3000.2F47507489Q61644M87864O9738l44932o80268j003742j351774j665592j907528
$$ plain form
2881.9 539218724 534924448 531513870 528964102 527148843 525884748 524992704 524340272 523785949 523138344
2900.2 523138344 522247374 521047592 519471467 517454505 515003622 512100220 508731365 505070865
2916.6 505070865 501388907 497864068 494644880 491942763 489974558 488917917 488878518 489875019 491900176
2934.9 491900176 494950116 498968273 503812790 509306967 515289068 521605074 528157413 534927726
2951.2 534927726 541842341 548769534 555641592 562420845 569023788 575322032 581209779 586714566
2967.6 586714566 591975927 597129047 602235734 607252419 612131417 616876304 621430099 625715554
2983.9 625715554 629718721 633401811 636733055 639720917 642312706 644476533 646220148 647507489
3000.2 647507489 648369133 648856997 648926735 648581803 647901535 646897793 645546019 643880427 641972899
3018.5F41972899k094149k251089k399683k561390k696276k773344k852679l003478
3034.9F21340811l175795l216207l167987l237426l390133l469468l465235l465652
3051.2E94752908l513694l534555l552020l609955l628731l596962l558993l585398
3067.5E66172600l676772l729463l678203l522455l422797l528416l680408l706932
3083.8E37227154l682733l635824l585755l652811l708363l574789l411889l438472
3100.1E08536518l567756l549158l358215l249795l370434l389537l132850l013909
3116.4D81904864l187626l405690l494204l378808l157377l019721l040999l119945
3132.8D56100494l053040k846032k758890k903402l021419k923072k735793k565176
$$ plain form
3018.5 641972899 639878750 637627661 635227978 632666588 629970312 627196968 624344289 621340811
3034.9 621340811 618165016 614948809 611780822 608543396 605153263 601683795 598218560 594752908
3051.2 594752908 591239214 587704659 584152639 580542684 576913953 573316991 569757998 566172600
3067.5 566172600 562495828 558766365 555088162 551565707 548142910 544614494 540934086 537227154
3083.8 537227154 533544421 529908597 526322842 522670031 518961668 515386879 511974990 508536518
3100.1 508536518 504968762 501419604 498061389 494811594 491441160 488051623 484918773 481904864
3116.4 481904864 478717238 475311548 471817344 468438536 465281159 462261438 459220439 456100494
3132.8 456100494 453047454 450201422 447442532 444539130 441517711 438594639 435858846 433293670
3149.1D33293670k494454k628595k799660k741783k553761k443284k422154k426505
3165.4D12783474k384305k294332k242357k243608k184480k071023k026320k057373
3181.7C95279676k073854k035827j946211j851082j825988j846760j854361j790463
3198C80055130j667649j591474j592100j601696j574218j527607j469821j431793j431614
3216.4C66167158j404256j332372j288384j294792j278430j193196j058519r95695
3232.7C56321514j160533j330882j236796j064569r65536q90940r06706j027375j035780
3251.1C46702397q69542p66069q43197q97229q05527p22289p06792o66559n80609o09368
3271.4C39235216p58469q11487p68900p25508o82920o49571o41346o19054n45025n31823
$$ plain form
3149.1 433293670 430799216 428170621 425370961 422629178 420075417 417632133 415209979 412783474
3165.4 412783474 410399169 408104837 405862480 403618872 401434392 399363369 397337049 395279676
3181.7 395279676 393205822 391169995 389223784 387372702 385546714 383699954 381845593 380055130
3198 380055130 378387481 376796007 375203907 373602211 372027993 370500386 369030565 367598772 366167158
3216.4 366167158 364762902 363430530 362142146 360847354 359568924 358375728 357317209 356321514
3232.7 356321514 355160981 353830099 352593303 351528734 350563198 349672258 348765552 347738177 346702397
3251.1 346702397 345832855 345066786 344223589 343326360 342520833 341798544 341091752 340425193 339844584 339235216
3271.4 339235216 338476747 337665260 336896360 336170852 335487932 334838361 334197015 333577961 333032936 332501113
3291.8C32501113o38306p34210p82519p77185o23584m14223m72664q29697j086235
3310.2C26142490j048088q91835q00639q09759q34763p86930p50602q62568r83387
3328.6C18373919r71318r35733q72165p60078q07673r82225j052350j065284j011133
3346.9C09915960q61347r25720j209765j286388j112789r84221j004398j019627q73834
3365.3C00637871p66754r62407j271545j291305j073659r62108r39995r10819q63045
3383.6B91596234p51883n52237l18229l68327p37608q58157n03958k40534n14448q75831
3404B85875022p86215n11467l77298l46958m15236m91887m17352k92510k47597j76549
3424.4B81811953n3138K4349K7686J12265K48283R9332k16187k10613Q5027K78294
$$ plain form
3291.8 332501113 331862807 331128597 330346078 329568893 328945309 328531086 328058422 327228725 326142490
3310.2 326142490 325094402 324202567 323401928 322592169 321757406 320970476 320219874 319357306 318373919
3328.6 318373919 317402601 316466868 315594703 314834625 314026952 313044727 311992377 310927093 309915960
3346.9 309915960 309054613 308128893 306919128 305632740 304519951 303535730 302531332 301511705 300637871
3365.3 300637871 299871117 298908710 297637165 296345860 295272201 294310093 293370098 292459279 291596234
3383.6 291596234 290844351 290292114 289973885 289605558 288867950 288009793 287505835 287265301 286750853 285875022
3404 285875022 285088807 284577340 284200042 283853084 283437848 282945961 282528609 282236099 281988502 281811953
3424.4 281811953 281758815 281783164 281810850 281923115 282171398 282270730 282054543 281843930 281928957 282207251
3444.8B82207251K59280J77800K05636L31074M33654N03630N66959N06341M80950P62344
3465.2B86434919R56475O28859J89841K10345N11229P64757P78675N31376M79132O72221
3485.6B92157829O65039N95420P20978Q34852Q60721Q32439Q21590P90775O31988N87940
3506B99499571P27922Q48323R65297R84133Q35180Q01474R86993J192153J092195Q09848
3526.4C08743089Q17746J046211J191139J300186J339734J245558J302957J508773
3542.7C18495393J513600J239985J161486J359284J476407J578093J738667J875788
3559C30438703J960069J969457J923174J999914K210111K300232K326727K468288K633274
3577.4C50229949K807200L045946L212333L125757K916753L055424L300368L380150
$$ plain form
3444.8 282207251 282466531 282644331 282849967 283181041 283614695 284118325 284685284 285191625 285672575 286434919
3465.2 286434919 287391394 288020253 288210094 288420439 288931668 289696425 290475100 291006476 291485608 292157829
3485.6 292157829 292822868 293418288 294139266 294974118 295834839 296667278 297488868 298279643 298911631 299499571
3506 299499571 300227493 301075816 302041113 303025246 303860426 304661900 305648893 306841046 307933241 308743089
3526.4 308743089 309560835 310607046 311798185 313098371 314438105 315683663 316986620 318495393
3542.7 318495393 320008993 321248978 322410464 323769748 325246155 326824248 328562915 330438703
3559 330438703 332398772 334368229 336291403 338291317 340501428 342801660 345128387 347596675 350229949
3577.4 350229949 353037149 356083095 359295428 362421185 365337938 368393362 371693730 375073880
3593.7C75073880L508806L697217L778785L782600L800869L747464L787130M014521
3610D05191272M164070M208297M130900M068851M271776M317999M148006L980339M038930
3628.4D42520440M401892M341483M145265M163265M211396M256964M319995M321456
3644.7D76682156M251510M292906M368364M150123L939390M156202M347861M084527
3661E10273039L818393L901541L900886L664791L701330L602862L291249L341675L353298
3679.4E42849064L268242L349840L429234L304899K838016K487063K552569K691627
3695.7E66770554K713620K553046K349436K355874K439856K312720J985610J830756
3712E85311472K080203K189099K029658J862883J824260J778722J711845J839400J924514
$$ plain form
3593.7 375073880 378582686 382279903 386058688 389841288 393642157 397389621 401176751 405191272
3610 405191272 409355342 413563639 417694539 421763390 426035166 430353165 434501171 438481510 442520440
3628.4 442520440 446922332 451263815 455409080 459572345 463783741 468040705 472360700 476682156
3644.7 476682156 480933666 485226572 489594936 493745059 497684449 501840651 506188512 510273039
3661 510273039 514091432 517992973 521893859 525558650 529259980 532862842 536154091 539495766 542849064
3679.4 542849064 546117306 549467146 552896380 556201279 559039295 561526358 564078927 566770554
3695.7 566770554 569484174 572037220 574386656 576742530 579182386 581495106 583480716 585311472
3712 585311472 587391675 589580774 591610432 593473315 595297575 597076297 598788142 600627542 602552056
3730.3F02552056J850128J631737J434326J548589J656770J338721J161337J652538
3746.7F14826202J559079R92835J128435J558840J476526J168132J182854J334966
3763F25227869J326620J294136J136303J023829J196921J352847J305103J092136R81629
3781.3F35937393J012444J040459J094758J137555J139879J076639J049578J162589
3797.7F44651294R75191O82116R14991R39309P78437R70066J148402J002848Q52168
3816F52914822R79304P41542N37336P95245Q45492Q18014Q56936R38117J050294Q42571
3836.4F61319673N04613N32806O47783P05004Q51214J025736Q49009J11162N9307Q64148
3856.8F67470455J003683P81953N61237N21124O53982O27279N99325N63383N26369
$$ plain form
3730.3 602552056 604402184 606033921 607468247 609016836 610673606 612012327 613173664 614826202
3746.7 614826202 616385281 617378116 618506551 620065391 621541917 622710049 623892903 625227869
3763 625227869 626554489 627848625 628984928 630008757 631205678 632558525 633863628 634955764 635937393
3781.3 635937393 636949837 637990296 639085054 640222609 641362488 642439127 643488705 644651294
3797.7 644651294 645626485 646308601 647223592 648162901 648941338 649911404 651059806 652062654 652914822
3816 652914822 653894126 654635668 655173004 655968249 656813741 657631755 658488691 659426808 660477102 661319673
3836.4 661319673 661824286 662357092 663004875 663709879 664561093 665586829 666435838 666547000 666606307 667470455
3856.8 667470455 668474138 669256091 669817328 670338452 670992434 671619713 672219038 672782421 673308790
3875.2F73308790O30974O23227O13808N90623M26292M95017N68270L70324L64423N96821
3895.5F78588569O69122N64933L82066J50501J82688M34697M92454M37081M45306M24623
3915.9F82772040L57092L46124L31163K57016K50756L26991L40939L04878L01897L21687
3936.3F85910583L83436L66748K53379L34203M55380L44872K35915K47479K53439K70784
3956.7F89056218L47495L65019K81512K22922K31862K56598K45273K03609K15650K62380
3977.1F91688538K81453L21626L13461K43783K27273K45213K35379K24829K69055K70605
3997.5F94321215
$$ plain form
3875.2 673308790 673939764 674562991 675176799 675767422 676193714 676688731 677257001 677627325 677991748 678588569
3895.5 678588569 679257691 679822624 680204690 680355191 680537879 680972576 681465030 681902111 682347417 682772040
3915.9 682772040 683129132 683475256 683806419 684063435 684314191 684641182 684982121 685286999 685588896 685910583
3936.3 685910583 686294019 686660767 686914146 687248349 687703729 688048601 688284516 688531995 688785434 689056218
3956.7 689056218 689403713 689768732 690050244 690273166 690505028 690761626 691006899 691210508 691426158 691688538
3977.1 691688538 691969991 692291617 692605078 692848861 693076134 693321347 693556726 693781555 694050610 694321215
3997.5 694321215
##END=$$ End of the data block
