##TITLE=Tangara - Marcela $$ Begin of the data block
##JCAMP-DX=5.00 $$ ACD/SpecManager v 10.08
##SPECTROMETER/DATA SYSTEM=Alpha
##DATE=24 Oct 2013 10:57:42
##DATA TYPE=INFRARED SPECTRUM
##DATA CLASS=XYDATA
##ORIGIN=
##OWNER=
##NPOINTS=1765
##FIRSTX=399.75695801
##LASTX=3997.56933594
##MAXX=3997.56933594
##MINX=399.75695801
##MAXY=0.84197348
##MINY=0.19022560
##XFACTOR=1.0000000000
##YFACTOR=1.000000000000000e-9
##FIRSTY=0.49086067
##DELTAX=2.03957629
##XUNITS=1/CM
##YUNITS=ARBITRARY UNITS
##XYDATA=(X++(Y..Y))
399.8 490860671 484934628 481351882 480278969 480787069 481539756 482594848 484825045 487772644 488876224
418.1 488876224 486357898 483224422 481382579 479582965 476544529 472705692 469824314 468778253
434.4 468778253 468720883 469110280 470698237 474148393 478908002 483359963 486471951 488525152 490023404
452.8 490023404 491129875 491560578 490422279 487935722 485212088 482605487 479756087 476297438 472309768
471.1 472309768 468409896 465455741 463414818 461755008 460482389 459892064 459903479 460038006 459873945
489.5 459873945 459364116 458589345 457427561 455836147 453888565 451698869 449484825 447111875 444038630
507.9 444038630 440221101 436268300 432434738 428339392 423846096 419554621 416138709 413974315
524.2 413974315 413213581 413611740 414775163 416815192 420230478 425071925 430758268 436451644 441377372
542.5 441377372 444927573 446596414 446382463 444852620 442594558 439763069 436090916 431525797 426288843
560.9 426288843 420358866 413719207 406690419 399763316 393760055 389894187 388741255 390059233
577.2 390059233 393634707 399285346 406528354 414385676 421690613 427540153 431619346 434021324
593.5 434021324 435167402 435591310 435518384 435167342 434937716 435102105 435652405 436709434 438503832
611.9 438503832 441060841 444346786 448394746 453069955 458077788 463208139 468275785 472989798
628.2 472989798 476991743 480196238 482768953 484927207 486854583 488587916 490011781 491211355
644.5 491211355 492419958 493685067 495015591 496406704 497749925 499014825 500368714 501780212
660.8 501780212 503012002 503976583 505022764 506697297 508411288 509865463 511187017 512535155 514209211
679.2 514209211 516156852 517896175 519047141 519808888 520543396 521050811 520573914 518664241 515584767
697.5 515584767 511961639 508286953 504722536 501485348 499325633 499170035 501343429 505251646 509999275
715.9 509999275 515401244 521898568 529509544 537467122 544807613 551085949 556717634 562203646
732.2 562203646 567063093 570266783 571671903 572114527 571970224 570552468 566976368 561351240 554832935
750.6 554832935 548451543 542188346 535590112 528999090 523707151 521043003 521306574 523857594 528419673
768.9 528419673 535454988 545086920 556287050 567265451 576798081 585042834 592780292 600085437
785.2 600085437 606136620 610584080 614446044 619197845 625148773 631252229 636601925 641468823
801.6 641468823 646556854 651672006 655663967 657867014 659119844 660617471 662445188 663486600
817.9 663486600 662660182 660286248 657491088 654371738 649784446 642892599 634350896 625755548 617945135
836.2 617945135 610510647 602946818 595729053 589939237 585958719 582946479 579676807 575825572
852.5 575825572 572134495 569282532 567522228 567597091 570927262 578524590 590029061 603554726
868.9 603554726 616488457 626996517 634649992 639579594 641379178 639188290 633102953 624690354
885.2 624690354 615733683 607011795 598343551 589683235 581715286 574968696 569001794 562723041
901.5 562723041 555261433 546598136 537189722 527171612 516240418 504320204 492213219 481243134
917.8 481243134 472431064 466118306 462040901 459793597 459232420 460293978 462604553 465657413 469381541
936.2 469381541 474176168 480125725 486038864 489382237 487731457 480437666 468487412 453163326
952.5 453163326 435419172 416138142 396196783 376106441 355915785 335521013 315027446
966.8 315027446 294808209 275294214 256863952 239869609 224738419 212037519 202277884 195618615
983.1 195618615 191790193 190225601 190332696 191684321 193917543 196657777 199519947 202161029 204460263
1001.4 204460263 206459612 208032444 208994642 209423661 209631041 210013032 210850552 212190658 213928789
1019.8 213928789 216042116 218605503 221630707 224934399 228157327 231049433 233594581 235841349
1036.1 235841349 237709925 239169210 240432337 241847470 243683934 245983511 248734280 252102345
1052.4 252102345 256386250 261810929 268447459 276301593 285354793 295128345 303808600 308128983
1068.7 308128983 305524886 296933442 286389142 277748853 272526681 270373076 270415694 272020429
1085 272020429 274922907 278979003 283872306 289104551 294148028 298568428 302087724 304546028 306026369
1103.4 306026369 307079732 308553249 310960233 314183593 317753613 321198136 324288487 327024519
1119.7 327024519 329441130 331623346 333925009 336902559 340834051 345169306 348533034 349498004
1136 349498004 347432137 342604458 335758090 327822626 319687873 312070489 305504411 300271094 296359330
1154.4 296359330 293625921 292026401 291660428 292676598 295165449 299212456 305004358 312768847
1170.7 312768847 322543800 334081352 346950561 360706568 375027895 389621288 403991401
1185 403991401 417404771 429183245 438964874 446709752 452566296 456784904 459766418 462144792
1201.3 462144792 464608908 467609853 471335292 475836456 481142610 487149984 493449360 499397844
1217.6 499397844 504345834 507922113 510147572 511226773 511331260 510635257 509435296 508115351 506978393
1236 506978393 506148219 505648732 505570173 506106615 507412851 509410977 511826217 514427304 517084002
1254.3 517084002 519726932 522288084 524657130 526829123 529018044 531463802 534178913 536886036
1270.6 536886036 539193690 540855527 541846275 542254448 542165279 541680872 540928364 540001988 538928330
1289 538928330 537660599 536110163 534257591 532241106 530293107 528585196 527113199 525783956 524545431
1307.4 524545431 523378849 522222996 520927906 519350827 517451525 515206039 512491882 509064913
1323.7 509064913 504725635 499583304 494071275 488734007 484023005 480213910 477399349 475524902
1340 475524902 474452794 473892212 473495573 473025709 472358942 471493542 470459551 469274342 467973948
1358.3 467973948 466579825 465108573 463779181 462804079 462215692 462173998 462795496 463925749 465274960
1376.7 465274960 466748893 468363404 470318913 473112047 476944894 481012493 484411657 487085730
1393 487085730 488905102 489651203 489472687 488724619 487661630 486232787 484516919 482678384 480791241
1411.4 480791241 479094148 477832466 476854324 475900531 475255758 475125283 475361884 475941181 476834863
1429.7 476834863 477932632 479241431 480871916 482595980 484093010 485543013 486866206 487769514
1446 487769514 487941533 487298220 486160755 484825909 482928693 480511546 479188621 479346275 480938882
1464.4 480938882 483992398 488384694 494585127 503263772 512834191 521759629 530331850 538849771
1480.7 538849771 547271073 555228233 562972069 570763707 578080297 584255278 590081334 596233010
1497 596233010 601861238 606711566 611261904 616325259 621839702 625923336 629210114 632707477 636386514
1515.4 636386514 640055954 643524051 646977067 650087297 652750313 655339360 657843709 660530806
1531.7 660530806 663339019 665801585 668302238 671267986 673673809 675389111 677057683 678806484
1548 678806484 680700421 682674527 684789121 687033474 689318657 690765500 691558123 692675352 694125772
1566.4 694125772 695545375 696622550 697459102 698432922 699303508 699628651 699740529 699793279 699751377 699489534
1586.8 699489534 698863804 697812438 696440578 694793761 692818999 690469563 687657118 684412181
1603.1 684412181 680858791 677011073 672655284 667912245 663210750 658096731 651975811 646528184
1619.4 646528184 641848087 636633158 631404281 626618862 622122765 618422866 615379274 612065375
1635.7 612065375 609047234 607114077 606032133 605732620 606140375 607060730 608402193 610586166 613353014
1654.1 613353014 615601063 618131578 621537685 625596046 629729331 633719444 638319433 643499076
1670.4 643499076 648207664 652927399 657879889 662525594 667215228 672462761 678153574 682744622
1686.7 682744622 686685383 690958202 695157766 699554086 704007268 708065629 712067127 715386569
1703 715386569 718323946 721217096 723889589 726678133 729647815 732606232 735308945 737402678 739241183
1721.4 739241183 741265416 743332267 745235682 747168899 749270797 751513243 753259361 754489779
1737.7 754489779 755879879 757478595 759123683 760769844 762319505 763691962 764922738 766147077
1754 766147077 767439365 768647015 769734681 770850122 771959603 773097336 774279475 775410771 776408494
1772.4 776408494 777250290 778081596 778954089 779749095 780506194 781361938 782291234 783258498 784216762 785022676
1792.8 785022676 785715938 786535025 787453711 788236797 788842142 789513230 790391982 791302085 791983545 792476296
1813.2 792476296 793090165 793873608 794639051 795314789 795947194 796574891 797250152 797897458 798279464 798500061
1833.6 798500061 798811853 799235106 799718201 800230384 800605237 800735652 800849259 801053643 801243126 801371038
1854 801371038 801518500 801781237 802144170 802462697 802692533 802944720 803235650 803465068 803667665 803893387
1874.4 803893387 804094255 804363728 804792166 805268645 805668473 805998445 806302130 806616843 806990564 807319582
1894.7 807319582 807447910 807488382 807671964 807994962 808278143 808402181 808426559 808519840 808742940 809015572
1915.1 809015572 809187174 809192061 809240997 809486389 809741020 809809029 809753060 809799373 810056388 810371041 810543478
1937.6 810543478 810586751 810710788 811017036 811373413 811581314 811618686 811703563 812020838 812471330 812776983
1958 812776983 812866271 812945187 813227117 813648999 813922763 813944697 813924909 814101398 814452529 814712048 814726412
1980.4 814726412 814666152 814783514 815114081 815427065 815472245 815286815 815187216 815364361 815576673 815477729
2000.8 815477729 815136075 814923525 814967036 814993322 814713597 814204752 813786089 813601136 813450158 813046932
2021.2 813046932 812394321 811775506 811390281 811123490 810693085 810010970 809356570 809004843 808838487 808526874
2041.6 808526874 807973206 807469189 807319641 807429612 807432115 807191074 806941867 806969166 807259262 807499886
2062 807499886 807486534 807387888 807496250 807817817 808073223 808065534 807938933 807994425 808308899 808635175 808709204
2084.4 808709204 808628559 808719754 809089661 809496284 809674144 809669256 809750915 810065210 810448170 810656369
2104.8 810656369 810700357 810783863 811028957 811337650 811497748 811476409 811465800 811595619 811788023 811881125
2125.2 811881125 811819434 811727881 811761677 811920583 812058151 812051594 811980665 812025130 812213778 812395334 812429547
2147.7 812429547 812390864 812477112 812746048 813068151 813292205 813453555 813742161 814217150 814762831 815248311
2168 815248311 815652609 816115677 816754997 817485809 818124771 818615675 819091976 819699049 820398629 821029007
2188.4 821029007 821515381 821940899 822445750 823066056 823693156 824219167 824649692 825101078 825681567 826341867
2208.8 826341867 826933622 827376306 827778101 828326464 828970313 829490900 829824090 830111265 830506563 831011057
2229.2 831011057 831467569 831754088 831966341 832264483 832687318 833113492 833368063 833499193 833729625 834126294
2249.6 834126294 834531784 834776044 834882677 835067272 835474730 835966468 836285532 836407840 836599529 837039053
2270 837039053 837539971 837842166 837968051 838161528 838576436 839060009 839354455 839424312 839484096 839747012
2290.4 839747012 840134919 840392768 840425313 840396821 840539396 840832651 841049492 841101706 841109157 841251671
2310.8 841251671 841559410 841786563 841726065 841543436 841558218 841793239 841973484 841914594 841732919 841707587
2331.2 841707587 841842175 841877520 841668487 841282487 841021299 841022968 841046989 840885818 840570629 840276480
2351.6 840276480 840227365 840418696 840491831 840215862 839849532 839711607 839690745 839570761 839373291 839220941
2372 839220941 839232087 839314938 839252055 839032531 838840961 838836610 838925421 838856280 838571668 838265240 838127732
2394.4 838127732 838108480 837959588 837577820 837142050 836863101 836728752 836510897 836077929 835557640 835146666
2414.8 835146666 834858954 834496260 833937287 833296120 832766414 832381725 831943274 831311584 830607474 830001771
2435.2 830001771 829509556 829018712 828418612 827718437 827062726 826549530 826071560 825469434 824767232 824134231
2455.6 824134231 823650420 823194206 822630525 822021365 821509838 821124792 820754826 820283115 819740117 819228768
2476 819228768 818807662 818457127 818084419 817624331 817153275 816804290 816573799 816340566 815990090 815584779
2496.4 815584779 815323472 815212488 815054834 814736009 814365387 814118087 813992739 813838243 813523591 813093603
2516.8 813093603 812730253 812475801 812166631 811687648 811124623 810626566 810227990 809814274 809254229 808564425
2537.2 808564425 807899177 807353735 806828678 806188285 805460811 804784775 804248333 803794980 803250015 802548349
2557.6 802548349 801845789 801290870 800832033 800305784 799646437 798952401 798395693 797983110 797489405 796832442
2578 796832442 796197653 795732319 795367539 794928789 794366002 793796062 793370485 793106735 792822003 792356372
2598.4 792356372 791781723 791300237 790970743 790609181 790026665 789260447 788498104 787832081 787153065 786275148
2618.8 786275148 785188794 784105003 783156037 782206416 781034231 779654324 778314650 777144372 776040077
2637.1 776040077 774843454 773499727 772136390 770892560 769730926 768531680 767239511 765955150
2653.5 765955150 764827490 763816059 762720764 761465311 760198891 759103775 758193851 757263064 756138682
2671.8 756138682 754963219 753963888 753146887 752359867 751449466 750426412 749462247 748635232 747841775
2690.2 747841775 746929824 745860994 744780898 743823707 742876470 741739392 740437210 739166081 738034546
2708.5 738034546 736965954 735811830 734540403 733303547 732239902 731247425 730144441 728926957
2724.8 728926957 727764249 726808786 725985467 725081146 724030912 722975552 722056568 721255302 720448971
2743.2 720448971 719567299 718689799 717921138 717221558 716493428 715716720 714940310 714255929 713704705 713163733
2763.6 713163733 712474048 711651981 710859954 710149765 709413290 708573103 707620382 706624508 705672145 704716027
2784 704716027 703602374 702276349 700891197 699560821 698200881 696701467 695043564 693302095 691550016
2802.3 691550016 689757705 687851787 685792744 683604717 681366682 679132998 676853418 674439311
2818.7 674439311 671888292 669274688 666655421 663978755 661139965 658133805 655060410 651980519
2835 651980519 648838580 645552993 642122984 638609469 635007560 631272614 627429664 623513460 619538188
2853.3 619538188 615523219 611401618 607000887 602184057 596915185 591206670 585045516 578437626
2869.7 578437626 571535885 564580083 557771325 551337719 545513570 540402770 536081731 532650709
2886 532650709 530077875 528215170 526928544 526077211 525466800 524910092 524246693 523321033 522063494
2904.3 522063494 520471811 518485427 516043067 513125956 509729981 506011903 502282560 498748779
2920.6 498748779 495550007 492887467 490943193 489875793 489810765 490812182 492882490 495952487 499940187
2939 499940187 504764795 510285258 516288221 522588015 529143870 535968363 542950690 549928665 556815624
2957.4 556815624 563571155 570150733 576458395 582388699 587950051 593253911 598433375 603565812
2973.7 603565812 608620465 613567948 618412971 623072207 627426505 631434023 635125458 638531566
2990 638531566 641600788 644253016 646478415 648254871 649548411 650429428 650941849 651036739 650733352
3008.3 650733352 650113821 649177551 647868812 646216452 644299269 642202616 639986038 637608945 635043442
3026.7 635043442 632340550 629550576 626700640 623753786 620657980 617486835 614316463 611061037
3043 611061037 607667148 604215562 600752354 597253203 593715072 590182960 586625695 582992136 579366386
3061.4 579366386 575810909 572251022 568586886 564844608 561120629 557465553 553942502 550508678
3077.7 550508678 546950161 543233752 539508820 535796940 532120764 528500199 524838448 521146536
3094 521146536 517547190 514077544 510625303 507081568 503543139 500163913 496858686 493441880 490047246
3112.4 490047246 486887544 483816385 480627835 477260023 473743260 470296472 467097491 464048207
3128.7 464048207 460949928 457783997 454738051 451919973 449165553 446247935 443206549 440222502
3145 440222502 437400997 434805274 432350338 429769933 426975459 424202740 421596438 419089407 416608065
3163.4 416608065 414122194 411704034 409411758 407160908 404898375 402673274 400528729 398469239
3179.7 398469239 396428555 394357264 392312586 390367627 388518095 386667848 384763747 382870555
3196 382870555 381058812 379351556 377729833 376121461 374482095 372852355 371292084 369803041 368335485
3214.3 368335485 366862446 365420848 364047557 362743199 361471593 360195130 358964056 357866824
3230.7 357866824 356848210 355661660 354292750 353031486 351959884 350984961 350075483 349144727 348096937
3249 348096937 347049803 346160740 345363408 344506979 343606740 342790335 342067242 341374218 340755463 340244025
3269.4 340244025 339665443 338903427 338074327 337276965 336522639 335804611 335123241 334476322 333858550 333320200
3289.8 333320200 332817733 332203120 331451446 330608249 329793364 329167128 328716397 328184783 327319652 326213658
3310.2 326213658 325152516 324272275 323490292 322678924 321835369 321032971 320261329 319382012 318369597
3328.6 318369597 317369878 316440642 315605819 314871281 314038157 312989622 311864585 310776025 309792638
3346.9 309792638 308921725 307945043 306731135 305481255 304369032 303349048 302317858 301284552 300405174
3365.3 300405174 299648523 298697799 297416776 296096444 295012146 294076055 293149382 292189687 291257024
3383.6 291257024 290494800 289965838 289624095 289183468 288392484 287527591 287032247 286817551 286332607 285441279
3404 285441279 284637362 284177721 283862144 283488691 282997340 282484114 282092631 281785309 281470746 281260312
3424.4 281260312 281271160 281392783 281424642 281471044 281699628 281806976 281554580 281270832 281291723 281553656
3444.8 281553656 281858146 282118171 282388002 282727122 283140451 283657402 284249306 284744501 285209179 285956144
3465.2 285956144 286894143 287553430 287788004 287975490 288426340 289145797 289926142 290513128 291045576 291755587
3485.6 291755587 292473912 293091983 293765217 294543207 295389354 296209276 296985537 297770798 298464388 299082339
3506 299082339 299800068 300678700 301712513 302730411 303555995 304357380 305358917 306577384 307737917
3524.4 307737917 308606595 309407443 310431182 311653048 312982589 314310223 315534711 316858739 318410903
3542.7 318410903 319928080 321151078 322330594 323765844 325322598 326869220 328507900 330367535
3559 330367535 332401574 334418297 336345166 338371396 340620935 342967838 345371336 347927898 350622833
3577.4 350622833 353439718 356459737 359652877 362778038 365702957 368771583 372097343 375535429
3593.7 375535429 379135519 382918209 386743367 390554547 394389570 398198307 402074307 406132221
3610 406132221 410275936 414451927 418583751 422695309 427002102 431336492 435558945 439672887 443738520
3628.4 443738520 448009074 452302337 456552088 460811496 465021163 469252557 473560601 477872431
3644.7 477872431 482138127 486425310 490713120 494824618 498795718 502956510 507266104 511345744
3661 511345744 515216649 519138336 522984087 526645780 530473232 534148097 537323058 540523827 543879807
3679.4 543879807 547212899 550594091 554000437 557279885 560169935 562734962 565293908 567924619
3695.7 567924619 570547760 573023498 575347781 577724814 580166817 582471430 584486187 586318612
3712 586318612 588367641 590553343 592612028 594518065 596335471 598034263 599664629 601503134 603488982
3730.3 603488982 605388403 606992483 608317435 609838665 611606479 613061726 614221811 615771413
3746.7 615771413 617254078 618269742 619450271 621007085 622498512 623725176 624914348 626199484
3763 626199484 627510905 628830135 629991114 631030798 632211328 633517504 634791970 635862112 636810839
3781.3 636810839 637830138 638926864 640070140 641201019 642298043 643348813 644381106 645508230
3797.7 645508230 646453619 647145450 648080647 649001062 649769306 650757670 651898742 652878523 653729200
3816 653729200 654759526 655577064 656147301 656950712 657831609 658689082 659513593 660346866 661314726 662172794
3836.4 662172794 662764192 663326383 663901567 664533973 665395558 666485846 667379618 667433977 667390347 668245614
3856.8 668245614 669277251 670081973 670711875 671323895 671991706 672561467 673133075 673746645 674341440
3875.2 674341440 675044596 675708294 676280916 676820993 677203238 677650273 678202927 678574800 678941250 679534853
3895.5 679534853 680168867 680687129 681069672 681271613 681503952 681917489 682365596 682843626 683365345 683785737
3915.9 683785737 684111297 684468746 684794009 685024977 685297132 685667455 686001480 686291397 686621547 686933517
3936.3 686933517 687252462 687628210 687956512 688281238 688673079 689000309 689243793 689515769 689815879 690098166
3956.7 690098166 690376103 690627635 690858245 691120386 691404819 691708505 692016125 692297220 692545593 692752540
3977.1 692752540 692944109 693200767 693525970 693830609 694091380 694336593 694542766 694752038 695062459 695376098
3997.5 695376098
##END=$$ End of the data block
