##TITLE=TR008 - Forro - Termofilme transmitancia $$ Begin of the data block
##JCAMP-DX=5.00 $$ ACD/SpecManager v 10.08
##SPECTROMETER/DATA SYSTEM=Alpha
##DATE=20 Nov 2014 10:13:22
##DATA TYPE=INFRARED SPECTRUM
##DATA CLASS=XYDATA
##ORIGIN=
##OWNER=
##NPOINTS=1765
##FIRSTX=399.76428223
##LASTX=3997.64306641
##MAXX=3997.64306641
##MINX=399.76428223
##MAXY=0.83722711
##MINY=0.18032804
##XFACTOR=1.0000000000
##YFACTOR=1.000000000000000e-9
##FIRSTY=0.79159915
##DELTAX=2.03961372
##XUNITS=1/CM
##YUNITS=ARBITRARY UNITS
##XYDATA=(X++(Y..Y))
$$ plain form
399.8 791599154 791725874 789808154 787828743 786508977 785271227 782862365 779517531 776512444 773414612
418.1 773414612 769657373 766651332 764679313 763615966 763433814 763491213 763177276 762566924 762370944
436.5 762370944 763453901 765869021 769141972 772704065 775818765 778352857 780502558 782090843
452.8 782090843 782738864 782218039 780987084 779782832 778615475 777248085 775514126 773434043 771000862
471.2 771000862 768184185 765272081 762527525 759984910 757603347 755228221 752867341 750436664
487.5 750436664 747326553 743179679 737989545 732094586 726725757 723472714 723451674 726606965 732032657
505.8 732032657 738942146 745684743 750513554 753120899 754455507 755414486 756209314 757139504 758590221
524.2 758590221 760526240 762853324 765570641 768337190 770993710 773729742 776450992 779213905
$$ packed form
399.8G91599154J26720j917720j979411j319766j237750k408862l344834l005087l097832
418.1G73414612l757239l006041j972019j063347j82152N7399l13937o10352j95980
436.5G62370944J082957K415120L272951L562093L114700K534092K149701J588285
452.8G82090843O48021n20825j230955j204252j167357j367390j733959k080083k433181
471.2G71000862k816677k912104k744556k542615k381563k375126k360880k430677
487.5G50436664l110111m146874n190134n894959n368829l253043k1040L155291N425692
505.8G32032657O909489O742597M828811K607345J334608R58979P94828R30190J450717
524.2G58590221J936019K327084K717317K766549K656520K736032K721250K762913
$$ plain form
540.5 779213905 782036722 784579158 786775172 788704574 790520728 792373002 794117272 795573771
556.8 795573771 796908140 798312366 799418569 800128341 800783515 801407456 802095175 802826464 803264260
575.2 803264260 803471148 803663492 803695381 803478062 803209603 802966177 802621424 802243412 801967442 801718831
595.6 801718831 801418066 801025331 800442219 799738050 799145818 798669815 798210084 797757208 797291100 796783566
616 796783566 796240449 795658469 794838727 793525100 791255713 786183238 778648436 775630593 780728221
634.3 780728221 787165642 789816320 790161431 789802611 789121568 788440049 787747264 786955714 786216080
652.7 786216080 785498440 784687161 783744514 782602847 781261265 779793620 777609050 774763346 772920072
671 772920072 770992994 767637730 763120234 759376943 758361578 759664893 761225402 761601210 760579944
$$ packed form
540.5G79213905K822817K542436K196014J929402J816154J852274J744270J456499
556.8G95573771J334369J404226J106203P09772O55174O23941O87719P31289M37796
575.2H03264260K06888J92344L1889k17319k68459k43426l44753l78012k75970k48611
595.6H01718831l00765l92735n83112p04169n92232m76003m59731m52876m66108n07534
616G96783566n43117n81980q19742j313627k269387n072475p534802l017843N097628
634.3G80728221O437421K650678L45111l58820o81043o81519o92785p91550p39634
652.7G86216080p17640q11279r42647j141667j341582j467645k184570k845704j843274
671G72920072j927078l355264m517496l743291j015365J303315J560509L75808j021266
$$ plain form
689.4 760579944 758305371 754417121 747897863 737786233 724661827 711258948 700092256 691121101
705.7 691121101 683026850 675213218 666454196 652063727 623360038 569228530 483079851 380329758
722 380329758 298227638 261467844 263848275 286990345 322310150 372446954 443451375 533679545
738.3 533679545 626167715 699637234 745926261 770754337 783115506 789232671 792130113 793124259
754.7 793124259 792961180 792176604 791217685 790124834 788658261 786798358 784655571 782365382 780054390
773 780054390 777676821 775023520 771730959 767069161 759957790 749484479 735300064 717869759
789.3 717869759 701046526 693690956 701497197 717289150 728618681 732044816 731885910 731530070
805.6 731530070 731527567 731673300 731966078 732463777 733097911 733622909 733662784 732874751 731037438 728194535
$$ packed form
689.4G60579944k274573l888250o519258j0111630j3124406j3402879j1166692q971155
705.7F91121101q094251p813632q759022j4390469k8703689n4131508q6148679j02750093
722C80329758q2102120l6759794K380431K3142070L5319805N0136804P1004421R0228170
738.3E33679545R2488170P3469519M6289027K4828076J2361169O117165K897442R94146
754.7G93124259j63079p84576r58919j092851j466573j859903k142787k290189k310992
773G80054390k377569k653301l292561m661798p111371j0473311j4184415j7430305
789.3G17869759j6823233p355570P806241J5791953J1329531L426135j58906l55840
805.6G31530070k503J45733K92778M97699O34134N24998L9875p88033j837313k842903
$$ plain form
826 728194535 724511862 719740748 713655114 706692517 699641287 693197072 687781453 683418155 680074692
844.4 680074692 678119004 678082824 679892600 682620406 685234427 686902463 686671674 683135927 674328566
862.8 674328566 657720029 630494535 592194498 553237617 533554733 540206432 561760306 586943567
879.1 586943567 610825837 630697727 645518303 655545294 661332071 663467586 663043559 661871731
895.4 661871731 662051618 665357411 672935009 684920669 700163007 716540456 731854320 744638622
911.7 744638622 754374564 761300027 765949190 768909752 770709455 771732688 772189438 772184432 771872401
930.1 771872401 771360815 770655334 769771814 768755794 767624557 766410649 765207469 764010549 762676895
948.4 762676895 761071563 759022236 756301820 752703249 747971237 741850317 734095156 724579930
$$ packed form
826G28194535l682673m771114o085634o962597p051230o444215n415619m363298l343463
844.4F80074692j955688l6180J809776K727806K614021J668036k30789l535747q807361
862.8F74328566j6608537k7225494l8300037l8956881j9682884O651699K1553874K5183261
879.1E86943567K3882270J9871890J4820576J0026991N786777K135515m24027j171828
895.4F61871731J79887L305793P577598J1985660J5242338J6377449J5313864J2784302
911.7G44638622R735942O925463M649163K960562J799703J023233M56750n006l12031
930.1G71872401n11586p05481q83520j016020j131237j213908j203180j196920j333654
948.4G62676895j605332k049327k720416l598571m732012o120920p755161r515226
$$ plain form
964.7 724579930 713662624 702707112 694434583 691833615 695709348 703645170 712300479 719798923
981.1 719798923 725487947 729047418 730717778 731741667 733207703 734653831 734839141 733214259 729853213
999.4 729853213 724638402 716573119 703314304 681335509 645259380 586713433 505294502 426017642
1015.7 426017642 385075986 392775804 429378450 474478751 518282950 550699234 565783501
1030 565783501 568547487 565517604 559370637 551679194 544674814 541025400 542879939 551114440 565278769
1048.4 565278769 583844662 604507983 624573588 641357303 652936816 658578694 658641934 654048800
1064.7 654048800 645500660 633009732 615838110 592575192 561771691 523332834 479687542
1079 479687542 435307652 394370884 358698785 327776074 300609887 277151048 258086324 244029716
$$ packed form
964.7G24579930j0917306j0955512q272529k600968L875733P935822Q655309P498444
981.1G19798923N689024L559471J670360J023889J466036J446128J85310j624882l361046
999.4G29853213n214811q065283j3258815k1978795l6076129n8545947q1418931p9276860
1015.7D26017642m0941656P699818L6602646M5100301M3804199L2416284J5084267
1030E65783501K763986l029883o146967p691443p004380l649414J854539Q234501J4164329
1048.4E65278769J8565893K0663321K0065605J6783715J1579513N641878O3240m593134
1064.7F54048800q548140j2490928j7171622k3262918l0803501l8438857m3645292
1079D79687542m4379890m0936768l5672099l0922711k7166187k3458839j9064724j4056608
$$ plain form
1095.3 244029716 235096216 230990499 231178015 235038579 241763666 249890774 256860822 260428727
1111.6 260428727 260310352 257446706 253364056 250294238 249959856 252430528 256699175 261837095 268154234
1129.9 268154234 277587503 292590529 314224154 341391534 372251868 405867308 442023009
1144.2 442023009 479895562 517637014 553142488 584662139 610891759 631217897 645978332
1158.5 645978332 656116009 662113667 663055897 657214582 644744873 629858792 618986666 616591752
1174.8 616591752 623268604 636814237 653646886 669887304 682674170 690918446 694987297 695682943
1191.1 695682943 693602562 689380825 683755040 677337587 670558631 663660765 656715930 649521410
1207.5 649521410 641691566 632821083 622412145 609785736 594186544 575308621 553617060 529359221
$$ packed form
1095.3B44029716q933500m105717J87516L860564O725087Q127108O970048L567905
1111.6B60428727j18375k863646m082650l069818l34382K470672M268647N137920O317139
1129.9B68154234R433269J5003026K1633625K7167380L0860334L3615440L6155701
1144.2D42023009L7872553L7741452L5505474L1519651K6229620K0326138J4760435
1158.5F45978332J0137677N997658R42230n841315j2469709j4886081j0872126k394914
1174.8F16591752O676852J3545633J6832649J6240418J2786866Q244276M068851O95646
1191.1F95682943k080381m221737n625785o417453o778956o897866o944835p194520
1207.5F49521410p829844q870483j0408938j2626409j5599192j8877923k1691561k4257839
$$ plain form
1223.8 529359221 501312613 467173874 425514430 377917975 329507589 286691368 253695428
1238.1 253695428 231118932 217008457 208692074 203900933 201159328 199562311 198479623 197459593
1254.4 197459593 196262240 195060596 194292933 194269493 195040688 196594387 198789015 201462775 204389215
1272.7 204389215 207366049 210440457 213817954 217784077 222498223 227962449 234175414 241370738
1289 241370738 250048459 261175245 275999099 295592129 319899112 346779972 373188108 398069084
1305.4 398069084 422993243 448987782 475223243 500393152 523834884 546217322 568472207
1319.6 568472207 590441644 611252785 629013598 640560627 642089248 629731774 601803184
1333.9 601803184 561425149 516830385 482003838 473338008 497327685 545708001 599611282
$$ packed form
1223.8E29359221k8046608l4138739m1659444m7596455m8410386m2816221l2995940
1238.1B53695428k2576496j4110475q316383m791141k741605j597017j082688j020030
1254.4A97459593j197353j201644p67663k3440P71195J553699K194628K673760K926440
1272.7B04389215K976834L074408L377497L966123M714146N464226O212965P195324
1289B41370738Q677721J1126786J4823854J9593030K4306983K6880860K6408136K4880976
1305.4C98069084K4924159K5994539K6235461K5169909K3441732K2382438K2254885
1319.6E68472207K1969437K0811141J7760813J1547029J528621j2357474k7928590
1333.9F01803184m0378035m4594764l4826547q665830K3989677M8380316N3903281
$$ plain form
1348.2 599611282 642824888 670745373 686198473 692341387 690360546 679008484 655216813 622186959
1364.5 622186959 589691937 564945400 553419292 555889010 568957388 586372972 603341460
1378.8 603341460 617533505 627007186 631760776 633012354 631373763 626721859 618034005 603919387
1395.1 603919387 584842324 559436142 527057290 486126959 434845865 388255656 368143111
1409.4 368143111 389125168 449980527 528648615 605770707 668894172 704060972 719194353
1423.7 719194353 724119961 720507085 708571136 690917075 671874285 651037514 631520331 619528472
1440 619528472 612485409 607491195 603206456 598162830 592775762 588846982 588671863 596987545 615889192
1458.3 615889192 635096610 653465271 673915625 690643191 698700249 703978002 714881420 730581760
$$ packed form
1348.2E99611282M3213606K7920485J5453100O142914j980841j1352062k3791671l3029854
1364.5F22186959l2495022k4746537j1526108K469718J3068378J7415584J6968488
1378.8F03341460J4192045R473681M753590J251578j638591m651904q687854j4114618
1395.1F03919387j9077063k5406182l2378852m0930331n1281094m6590209k0112545
1409.4C68143111K0982057O0855359P8668088P7122092O3123465L5166800J5133381
1423.7G19194353M925608l612876j1935949j7654061j9042790k0836771j9517183j1991859
1440F19528472p043063m994214m284739n043626n387068l928780j75119Q315682J8901647
1458.3F15889192J9207418J8368661K0450354J6727566Q057058N277753J0903418J5700340
$$ plain form
1474.7 730581760 744361162 755699635 765840411 775010407 782369673 787827253 791133165 791503668
1491 791503668 788937032 782032907 765533924 735074461 694247842 655607224 639475644 672826886
1507.3 672826886 721237123 750212014 766856134 775471389 779099882 779725015 778580487 777251661
1523.6 777251661 776938200 777762592 779586256 782073557 785121858 787729800 789472401 790287852 790031254
1542 790031254 789576232 789244711 788899541 788213551 787261009 786152005 785033047 782837212 779092193
1560.3 779092193 776071012 772506475 767254710 758797944 745186210 729245007 709626853 686962485
1576.6 686962485 679649472 692753851 717611015 742439568 759411991 768797398 773869634 776757896
1593 776757896 777929246 777290940 774997950 771443486 767053545 761908352 755359650 747183144 739127040
$$ packed form
1474.7G30581760J3779402J1338473J0140776R169996P359266N457580L305912L70503
1491G91503668k566636o904125j6498983l0459463m0826619l8640618j6131580L3351242
1507.3F72826886M8410237K8974891J6644120Q615255L628493O25133j144528j328826
1523.6G77251661l13461Q24392J823664K487301L048301K607942J742601Q15451k56598
1542G90031254m55022l31521l45170o85990r52542j109004j118958k195835l745019
1560.3G79092193l021181l564537n251765q456766j3611734j5941203j9618154k2664368
1576.6F86962485p313013J3104379K4857164K4828553J6972423R385407N072236K888262
1593G76757896J171350o38306k292990l554464m389941n145193o548702q176506q056104
$$ plain form
1611.3 739127040 734330416 735745072 743927717 751947641 756422102 758484721 758867264 758448422 757779360
1629.7 757779360 757244051 756577790 755290866 753985226 753057718 752039611 750773370 748863399 746613681
1648 746613681 745160997 742934227 738374412 734312177 730264008 724539578 716236532 706535518 697498918
1666.4 697498918 687317312 675379813 664889216 653793037 640684187 628067791 616083682
1680.7 616083682 604378045 593891501 586956382 580299973 570575416 557999313 539453566 514183819
1697 514183819 482780635 439551920 397429705 353871584 304544181 261222214 226622045 200972334
1713.3 200972334 185259759 180328041 181086227 181079850 181759626 183704361 186155155 189208061 193901062
1731.7 193901062 205477461 221910059 238440230 266696036 310699016 364439368 424900323
$$ packed form
1611.3G39127040m796624J414656Q182645Q019924M474461K062619L82543m18842o69062
1629.7G57779360n35309o66261j286924j305640r27508j018107j266241j909971k249718
1648G46613681j452684k226770m559815m062235m048169n724430q303046r701014r036600
1666.4F97498918j0181606j1937499j0490597j1096179j3108850j2616396j1984109
1680.7F16083682j1705637j0486544o935119o656409r724557j2576103j8545747k5269747
1697E14183819l1403184m3228715m2122215m3558121m9327403m3321967l4600169k5649711
1713.3B00972334j5712575m931718P58186o377O79776J944735K450794L052906M693001
1731.7A93901062J1576399J6432598J6530171K8255806M4002980N3740352O0460955
$$ plain form
1745.9 424900323 487748384 550058961 602927387 639979422 668296158 691942632 709978640
1760.2 709978640 724936187 736649811 745453119 753063858 759639621 765573144 770505548 774396420
1776.5 774396420 777821779 781066298 783982754 786632061 788964570 790980220 792761624 794371843
1792.8 794371843 795760334 796910822 797847152 798544466 799227595 799886644 800443590 800811887 801060200
1811.2 801060200 801241457 801334262 801369667 801536024 801990330 802671194 803699970 805084407 806792021
1829.6 806792021 808775783 810869753 812961459 815096736 817279041 819380045 821483493 823643684
1845.9 823643684 825708270 827600718 829391181 831024826 832397819 833489835 834436119 835267425 835917354
1864.2 835917354 836402476 836675107 836856723 837039888 837179124 837227106 837201536 837091804 836896241 836631000
$$ packed form
1745.9D24900323O2848061O2310577N2868426L7052035K8316736K3646474J8036008
1760.2G09978640J4957547J1713624Q803308P610739O575763N933523M932404L890872
1776.5G74396420L425359L244519K916456K649307K332509K015650J781404J610219
1792.8G94371843J388491J150488R36330O97314O83129O59049N56946L68297K48313
1811.2H01060200J81257R2805L5405J66357M54306O80864J028776J384437J707614
1829.6H06792021J983762K093970K091706K135277K182305K101004K103448K160191
1845.9H23643684K064586J892448J790463J633645J372993J092016R46284Q31306O49929
1864.2H35917354M85122K72631J81616J83165J39236M7982k5570j09732j95563k65241
$$ plain form
1884.6 836631000 836289525 835783780 835143149 834552646 833925962 833245516 832575321 831934929 831285715 830602765
1905 830602765 829885840 829089999 828243613 827438354 826655209 825690448 824654758 823716879 822682440 821496189
1925.4 821496189 820240140 818852365 817258239 815441310 813429534 811283886 809013367 806539774
1941.7 806539774 804101944 802149177 800701618 799700856 799145639 798943281 799018145 799405932 800284684
1960.1 800284684 801918268 804350436 807199001 809950113 812264919 814108014 815580010 816748977
1976.4 816748977 817687571 818501711 819267392 819989264 820725203 821528018 822391689 823342562 824382186
1994.8 824382186 825414300 826362193 827235162 828076601 828872740 829559326 830152273 830741167 831352115
2013.1 831352115 831889987 832323611 832750499 833193779 833596408 833956361 834274828 834530175 834718704 834849477
$$ packed form
1884.6H36631000l41475n05745o40631n90503o26684o80446o70195o40392o49214o82950
1905H30602765p16925p95841q46386q05259p83145r64761j035690r37879j034439j186251
1925.4H21496189j256049j387775j594126j816929k011776k145648k270519k473593
1941.7H06539774k437830j952767j447559j000762n55217k02358P4864L87787Q78752
1960.1H00284684J633584K432168K848565K751112K314806J843095J471996J168967
1976.4H16748977R38594Q14140P65681P21872P35939Q02815Q63671R50873J039624
1994.8H24382186J032114R47893Q72969Q41439P96139O86586N92947N88894O10948
2013.1H31352115N37872M33624M26888M43280M02629L59953L18467K55347J88529J30773
$$ plain form
2033.5 834849477 834934711 834947407 834885180 834794283 834706664 834573686 834343612 834055185 833718896 833296835
2053.9 833296835 832811415 832298040 831752241 831169903 830558002 829950750 829351425 828712761 828014731 827298939
2074.3 827298939 826637208 826031566 825464129 824976742 824545205 824075818 823582470 823158622 822819531 822524071
2094.7 822524071 822275758 822067797 821850359 821627736 821442544 821296990 821191311 821127594 821102560 821139336
2115.1 821139336 821231306 821355760 821532011 821767151 822034061 822295547 822504103 822657883 822779834 822870314
2135.5 822870314 822977364 823158205 823371410 823564768 823787749 824098527 824492574 824947715 825430334 825901926
2155.9 825901926 826390445 826923430 827466190 827981710 828473151 828986406 829480946 829870045 830190659 830505610
2176.3 830505610 830766439 830951452 831126332 831306815 831436276 831490934 831561744 831665695 831695020 831615925
$$ packed form
2033.5H34849477Q5234J2696o2227r0897q7619j32978k30074k88427l36289m22061
2053.9H33296835m85420n13375n45799n82338o11901o07252n99325o38664o98030p15792
2074.3H27298939o61731o05642n67437m87387m31537m69387m93348m23848l39091k95460
2094.7H22524071k48313k07961k17438k22623j85192j45554j05679o3717k5034L6776
2115.1H21139336R1970J24454J76251K35140K66910K61486K08556J53780J21951R0480
2135.5H22870314J07050J80841K13205J93358K22981L10778L94047M55141M82619M71592
2155.9H25901926M88519N32985N42760N15520M91441N13255M94540L89099L20614L14951
2176.3H30505610K60829J85013J74880J80483J29461N4658P0810J03951K9325p9095
$$ plain form
2196.7 831615925 831445277 831202388 830888152 830505371 830153942 829899728 829713762 829594016 829522014 829484046
2217.1 829484046 829478741 829434872 829306304 829131007 828929126 828692555 828462243 828305185 828170002 827961385
2237.5 827961385 827739716 827553511 827337265 827092826 826852858 826619327 826436162 826285779 826137543 826078534
2257.9 826078534 826122403 826211393 826323867 826400697 826355636 826176643 825935423 825632453 825185299 824607551
2278.3 824607551 824012816 823530555 823256969 823242903 823524058 824044883 824676037 825328827 826015413 826737285
2298.7 826737285 827361941 827813387 828140557 828359604 828448474 828418016 828289688 828077018 827791870 827362359
2319.1 827362359 826829493 826486528 826401770 826343238 826240003 826146245 826050282 825914621 825732946 825511217
2339.5 825511217 825234592 824857295 824554205 824599802 824673474 824250758 823293269 822252274 821348011 820581257
$$ packed form
2196.7H31615925j70648k42889l14236l82781l51429k54214j85966j19746p2002l7968
2217.1H29484046n305m3869j28568j75297k01881k36571k30312j57058j35183k08617
2237.5H27961385k21669j86205k16246k44439k39968k33531j83165j50383j48236n9009
2257.9H26078534M3869Q8990J12474P6830m5061j78993k41220l02970m47154n77748
2278.3H24607551n94735m82261k73586j4066K81155N20825O31154O52790O86586P21872
2298.7H26737285O24656M51446L27170K19047Q8870l0458j28328k12670k85148m29511
2319.1H27362359n32866l42965q4758n8532j03235r3758r5963j35661j81675k21729
2339.5H25511217k76625l77297l03090M5597P3672m22716r57489j040995r04263p66754
$$ plain form
2359.9 820581257 819957972 819317281 818616986 818038344 817652822 817387760 817237139 817167580 817095816 817081869
2380.2 817081869 817166388 817267001 817340493 817424774 817539334 817667007 817837417 818098426 818411231 818739235
2400.6 818739235 819143236 819614232 820077062 820526242 820981681 821454942 821949601 822438121 822899103 823375285
2421 823375285 823895633 824415743 824905276 825364113 825797081 826211095 826604784 826975822 827298939 827567995
2441.4 827567995 827798307 827982247 828145683 828299820 828416705 828472018 828452349 828403234 828367472 828308046
2461.8 828308046 828218997 828119218 827978611 827798843 827599466 827385902 827132821 826826334 826521873 826246381
2482.2 826246381 825954139 825598776 825209439 824837506 824438870 823980153 823558271 823218644 822941005 822714865
2502.6 822714865 822496414 822255969 822016716 821823359 821635664 821411371 821194708 821005046 820810318 820602655
$$ packed form
2359.9H20581257o23285o40691p00295n78642l85522k65062j50621o9559p1764j3947
2380.2H17081869Q4519J00613P3492Q4281J14560J27673J70410K61009L12805L28004
2400.6H18739235M04001M70996M62830M49180M55439M73261M94659M88520M60982M76182
2421H23375285N20348N20110M89533M58837M32968M14014L93689L71038L23117K69056
2441.4H27567995K30312J83940J63436J54137J16885N5313j9669m9115l5762n9426
2461.8H28308046q9049r9779j40607j79768j99377k13564k53081l06487l04461k75492
2482.2H26246381k92242l55363l89337l71933l98636m58717m21882l39627k77639k26140
2502.6H22714865k18451k40445k39253j93357j87695k24293k16663j89662j94728k07663
$$ plain form
2523 820602655 820423663 820284665 820179820 820128441 820122421 820101440 820026696 819961131 819951773 819931388 819864690 819791317
2547.5 819791317 819760203 819779575 819803715 819842875 819910944 819968283 819995522 820029378 820095897 820142210 820190430
2569.9 820190430 820295990 820369720 820350468 820325673 820381999 820521176 820725083 821000516 821348667 821756542
2590.3 821756542 822191060 822624922 823019028 823329270 823578060 823733568 823761106 823765576 823815405 823884010
2610.7 823884010 823960721 824000418 823939621 823804617 823624134 823399961 823178828 823044837 823087215 823340952
2631.1 823340952 823790431 824357331 824934185 825462461 825876117 826135874 826318741 826488078 826628685 826759219
2651.5 826759219 826851904 826851189 826847494 826901376 826927006 826935828 826979280 826962709 826875925 826828659 826813757 826761365
2676 826761365 826692224 826679170 826730371 826785684 826790571 826736093 826660037 826591671 826521516 826447129 826371431 826266170
$$ packed form
2523H20602655j78992j38998j04845n1379o020k0981p4744o5565r358k0385o6698p3373
2547.5H19791317l1114J9372K4140L9160O8069N7339K7239L3856O6519M6313M8220
2569.9H20190430J05560P3730j9252k4795N6326J39177K03907K75433L48151M07875
2590.3H21756542M34518M33862L94106L10242K48790J55508K7538M470M9829O8605
2610.7H23884010P6711L9697o0797j35004j80483k24173k21133j33991M2378K53737
2631.1H23340952M49479N66900N76854N28276M13656K59757J82867J69337J40607J30534
2651.5H26759219R2685p15l695N3882K5630Q822M3452j6571q6784m7266j4902n2392
2676H26761365o9141j3054N1201N5313M887n4478p6056o8366p0155p4387p5698j05261
$$ plain form
2700.5 826266170 826088727 825871229 825672686 825487554 825339913 825233400 825126588 825017154 824838758 824555039
2720.9 824555039 824234068 823896348 823567212 823283315 822979510 822599947 822232366 821955204 821685553 821376324
2741.2 821376324 821091413 820805132 820458949 820144713 819972932 819870412 819735944 819589913 819472253 819419503
2761.6 819419503 819423139 819434345 819426537 819372118 819294274 819239736 819183588 819046140 818809092 818519652 818178236
2784.1 818178236 817765355 817319930 816920400 816582739 816227257 815755606 815199971 814663827 814184189 813819766
2804.5 813819766 813592732 813498199 813572645 813739538 813874900 813926280 813856244 813663840 813333392 812827528
2824.9 812827528 812179804 811427653 810572982 809582293 808421910 807121873 805685997 804018855 802034974
2843.2 802034974 799752414 797320306 794916153 792608142 790531933 788889408 787661135 786659062
$$ packed form
2700.5H26266170j77443k17498j98543j85132j47641j06513j06812j09434j78396k83719
2720.9H24555039l20971l37720l29136k83897l03805l79563l67581k77162k69651l09229
2741.2H21376324k84911k86281l46183l14236j71781j02520j34468j46031j17660n2750
2761.6H19419503L636J1206p808n4419p7844n4538n6148j37448k37048k89440l41416
2784.1H18178236m12881m45425l99530l37661l55482m71651n55635n36144m79638l64423
2804.5H13819766k27034r4533P4446J66893J35362N1380p0036j92404l30448n05864
2824.9H12827528o47724p52151q54671r90689j160383j300037j435876j667142j983881
2843.2H02034974k282560k432108k404153k308011k076209j642525j228273j002073
$$ plain form
2859.5 786659062 785708010 784677386 783556402 782363117 780985117 779434204 777889192 776393533
2875.9 776393533 774829745 773014724 770849764 768502295 766378164 764871180 764196038 764360905 765162289
2894.2 765162289 766275764 767245948 767561674 767063200 766206861 765774012 766309857 767841399 769952536
2912.6 769952536 772018373 773570001 774500787 774842083 774634659 773984432 772918940 771366417 769198239
2930.9 769198239 766205013 762156665 756775141 749742866 740865946 730261922 718468726 706265450
2947.2 706265450 694375157 683425009 673969090 666449606 661250293 658613384 658495903 660552502
2963.6 660552502 664271891 669252753 675392807 682694256 690788031 698942065 706559658 713431597
2979.9 713431597 719614029 725241184 730437815 735227466 739546359 743391693 746788502 749761760
$$ packed form
2859.5G86659062r51052j030624j120984j193285j378000j550913j545012j495659
2875.9G76393533j563788j815021k164960k347469k124131j506984o75142J64867Q01384
2894.2G65162289J113475R70184L15726m98474q56339m32849N35845J531542K111137
2912.6G69952536K065837J551628R30786L41296k07424o50227j065492j552523k168178
2930.9G69198239k993226m048348n381524p032275q876920j0604024j1793196j2203276
2947.2G06265450j1890293j0950148r455919p519484n199313k636909j17481K056599
2963.6F60552502L719389M980862O140054P301449Q093775Q154034P617593O871939
2979.9G13431597O182432N627155N196631M789651M318893L845334L396809K973258
$$ plain form
2996.2 749761760 752459526 755068779 757690430 760346711 763008595 765612721 768176556 770924032
3012.5 770924032 774145305 777895391 781821966 785431743 788425207 790785193 792760432 794565439
3028.8 794565439 796172559 797534823 798625112 799242973 799175799 798301637 796407163 793179691 788559139
3047.2 788559139 783247948 778659403 776025057 775641978 776851058 778357804 779030740 778707027 778029740
3065.5 778029740 777726352 778067052 778794408 779432297 779619157 779418826 779378653 780107319 781822026 784265637
3085.9 784265637 786927283 789260447 790778816 791176915 790422797 788887382 787371159 786679208 787148297
3104.3 787148297 788624644 790792286 793295383 795708358 797744930 799286485 800226569 800561666 800509155
3122.6 800509155 800356030 800322711 800653040 801495612 802709520 803995788 805152059 806140304 806989491
$$ packed form
2996.2G49761760K697766K609253K621651K656281K661884K604126K563835K747476
3012.5G70924032L221273L750086L926575L609777K993464K359986J975239J805007
3028.8G94565439J607120J362264J090289O17861o7174q74162j894474l227472m620552
3047.2G88559139n311191m588545k634346l83079J209080J506746O72936l23713o77287
3065.5G78029740l03388L40700P27356O37889J86860k00331m0173P28666J714707K443611
3085.9G84265637K661646K333164J518369L98099p54118j535415j516223o91951M69089
3104.3G87148297J476347K167642K503097K412975K036572J541555R40084L35097n2511
3122.6H00509155j53125l3319L30329Q42572J213908J286268J156271R88245Q49187
$$ plain form
3141 806989491 807696521 808221340 808613777 808967412 809284449 809643805 810112238 810500085 810684323 810811460
3161.4 810811460 810975492 811139286 811294734 811407328 811456621 811499000 811571300 811673224 811761498 811785579
3181.8 811785579 811733127 811615050 811525881 811581135 811699867 811771154 811871409 812020004 812146068 812244296
3202.2 812244296 812297761 812320411 812363029 812372983 812291384 812148452 811969697 811764657 811612964 811542094 811408520
3224.6 811408520 811195195 811083436 811054468 810966015 810910702 810993195 811132729 811272919 811407268 811512411
3245 811512411 811652839 811881006 812045872 812023640 811946988 811956584 811992288 811981082 811944723 811894834 811825216
3267.5 811825216 811735213 811675191 811660409 811591625 811455846 811347842 811315775 811259747 811032295 810699821 810374558
3289.9 810374558 810052037 809768200 809585273 809530795 809596181 809657335 809638858 809686840 809896410 810147643
$$ packed form
3141H06989491P07030N24819L92437L53635L17037L59356M68433L87847J84238J27137
3161.4H10811460J64032J63794J55448J12594M9293M2379P2300J01924Q8274K4081
3181.8H11785579n2452j18077q9169N5254J18732P1287J00255J48595J26064R8228
3202.2H12244296N3465K2650M2618R954q1599j42932j78755k05040j51693p0870j33574
3224.6H11408520k13325j11759k8968q8453n5313Q2493J39534J40190J34349J05143
3245H11512411J40428K28167J64866k2232p6652R596L5704j1206l6359m9889o9618
3267.5H11825216r0003o0022j4782o8784j35779j08004l2067n6028k27452l32474l25263
3289.9H10374558l22521k83837j82927n4478O5386O1154j8477M7982K09570K51233
$$ plain form
3310.3 810147643 810305119 810367286 810368419 810315490 810206890 809975982 809611738 809213638 808814347 808405221
3330.7 808405221 808063388 807848871 807782769 807901263 808209002 808671296 809162736 809548676 809883952 810345411
3351.1 810345411 810909748 811336696 811558068 811722994 811926067 812063873 811982751 811846733 811895728 812046170
3371.5 812046170 812116742 812029362 811863303 811725020 811605573 811461210 811259151 810959578 810539424 810070574
3391.9 810070574 809587538 808950484 808077395 807154775 806325078 805359721 803981781 802240729 800288081
3410.2 800288081 798147738 795840025 793326855 790512502 787498236 784526467 781598985 778655648
3426.5 778655648 776152670 774808586 774865270 775988221 777845025 780217528 782699823 785036981 787254214
3444.9 787254214 789366841 791421354 793464363 795376778 797056019 798446774 799515247 800472975
$$ packed form
3310.3H10147643J57476O2167J133n2929j08600k30908l64244l98100l99291m09126
3330.7H08405221l41833k14517o6102J18494L07739M62294M91440L85940L35276M61459
3351.1H10345411N64337M26948K21372J64926K03073J37806q1122j36018M8995J50442
3371.5H12046170P0572q7380j66059j38283j19447j44363k02059k99573m20154m68850
3391.9H10070574m83036o37054q73089r22620q29697r65357j377940j741052j952648
3410.2H00288081k140343k307713k513170k814353l014266k971769k927482k943337
3426.5G78655648k502978j344084N6684J122951J856804K372503K482295K337158K217233
3444.9G87254214K112627K054513K043009J912415J679241J390755J068473R57728
$$ plain form
3461.2 800472975 801415086 802131116 802616835 803164244 803906262 804588914 804951608 805063486 805189371 805397391
3481.6 805397391 805469990 805351436 805242717 805199921 805048227 804692090 804245055 803857863 803498566 803035200
3502 803035200 802568555 802209973 801786065 801198363 800536156 799893200 799274683 798593640 797797441 796914339
3522.4 796914339 796073377 795309484 794519901 793718576 792924643 792073965 791177630 790372372 789731681 789155066
3542.8 789155066 788631916 788369358 788278639 788078070 787970781 788182795 788507819 788853824 789392829 790129125
3563.2 790129125 790814877 791490078 792501569 793660462 794656932 795561969 796392083 797074616 797692001
3581.5 797692001 798189163 798318028 798177361 798202217 798265874 798050821 797677219 797338963 796909571 796400189
3601.9 796400189 795960188 795356810 794499099 793737411 793001473 792233288 791618645 790848911 790037513 789690137
$$ packed form
3461.2H00472975R42111P16030M85719N47409P42018O82652L62694J11878J25885K08020
3481.6H05397391P2599j18554j08719m2796j51694l56137m47035l87192l59297m63366
3502H03035200m66645l58582m23908n87702o62207o42956o18517o81043p96199q83102
3522.4G96914339q40962p63893p89583q01325p93933q50678q96335q05258o40691n76615
3542.8G89155066n23150k62558r0719k00569j07289K12014L25024L46005N39005P36296
3563.2G90129125O85752O75201J011491J158893R96470R05037Q30114O82533O17385
3581.5G97692001M97162J28865j40667K4856O3657k15053l73602l38256m29392n09382
3601.9G96400189m40001o03378q57711p61688p35938p68185o14643p69734q11398l47376
$$ plain form
3622.3 789690137 789663255 789480388 788807392 788443148 788738847 789101124 789482653 790027082 790711582 791512012
3642.7 791512012 792466879 793385625 794022977 794957578 796346247 797493160 798446476 799556315 800730348
3661.1 800730348 801943719 803235173 804393113 805210710 806112945 807022512 807542622 808261752 809093714
3679.4 809093714 809675336 810369968 811360002 812318742 813103735 814004838 814947963 815793872 816569269 817186296
3699.8 817186296 817619801 818077922 818614185 819039166 819038570 818768442 818890750 819187403 819297493 819278896
3720.2 819278896 819196403 818986714 818802595 818948150 819163620 819013417 818478227 818130136 818484902 819115400
3740.6 819115400 819209516 818806827 818887770 818872213 818080425 817518353 817643285 817779362 817625701 817593634
3761 817593634 817829370 818063736 818255365 818367064 818448961 818610787 818747520 818726838 818595648 818559527
$$ packed form
3622.3G89690137k6882j82867o72996l64244K95699L62277L81529N44429O84500Q00430
3642.7G91512012R54867R18746O37352R34601J388669J146913R53316J109839J174033
3661.1H00730348J213371J291454J157940Q17597R02235R09567N20110P19130Q31962
3679.4H09093714N81622O94632R90034R58740P84993R01103R43125Q45909P75397O17027
3699.8H17186296M33505M58121N36263M24981n96k70128J22308K96653J10090j8597
3720.2H19278896q2493k09689j84119J45555K15470j50203n35190l48091L54766O30498
3740.6H19115400R4116m02689Q0943j5557p91788n62072J24932J36077j53661l2067
3761H17593634K35736K34366J91629J11699Q1897J61826J36733k0682j31190l6121
$$ plain form
3781.4 818559527 818583429 818620384 818721175 818789065 818797290 818701386 818474352 818378210 818223417 817825556 817725956
3803.9 817725956 817634523 817453444 817705154 818185151 818402171 818361044 818421483 818211079 817926884 818068862
3824.3 818068862 818215668 818305612 818364978 818403125 818502367 818373084 818065047 818002343 818016946 817980289 818066716
3846.7 818066716 818351209 818476915 817759991 816990197 817200899 817644358 817800283 817558348 817339182 817443609
3867.1 817443609 817413807 817213237 817147195 817254186 817461133 817386508 817248464 817278504 817076683 816996872
3887.5 816996872 817057550 816813767 816691935 816902220 816959202 816709697 816412151 816196799 816163301 816279054
3907.9 816279054 816332877 816316307 816268027 816097200 815883696 815842152 815833092 815722048 815764368 815907001 815846503
3930.3 815846503 815709710 815710843 815746546 815730989 815637350 815494835 815473437 815498650 815424979 815315068 815225720
$$ packed form
3781.4H18559527K3902L6955J00791O7890Q225r5904k27034r6142j54793l97861r9600
3803.9H17725956r1433j81079K51710M79997K17020m1127O0439k10404k84195J41978
3824.3H18068862J46806Q9944N9366L8147R9242j29283l08037o2704J4603l6657Q6427
3846.7H18066716K84493J25706p16924p69794K10702M43459J55925k41935k19166J04427
3867.1H17443609k9802k00570o6042J06991K06947p4625j38044L0040k01821p9811
3887.5H16996872O0678k43783j21832K10285N6982k49505k97546k15352l3498J15753
3907.9H16279054N3823j6570m8280j70827k13504m1544r060j11044M2320J42633o0498
3930.3H15846503j36793J133L5703j5557r3639j42515k1398K5213p3671j09911q9348
$$ plain form
3952.7 815225720 815166473 815129995 815075576 814930320 814754307 814639211 814529240 814428270 814387858 814326167
3973.1 814326167 814163983 813987494 813895881 813815773 813645065 813500345 813501716 813522518 813461900 813381493 813336968
3995.6 813336968 813348055
3997.6 813348055
$$ packed form
3952.7H15225720n9247l6478n4419j45256j76013j15096j09971j00970m0412o1691
3973.1H14326167j62184j76489r1613q0108j70708j44720J371K0802o0618q0407m4525
3995.6H13336968J1087
3997.6H13348055
##END=$$ End of the data block
