##TITLE=$$ Begin of the data block
##JCAMP-DX=5.00 $$ ACD/SpecManager v 10.08
##SPECTROMETER/DATA SYSTEM=Varian
##DATE=30 Apr 2013 10:13:46
##DATA TYPE=INFRARED SPECTRUM
##DATA CLASS=XYDATA
##ORIGIN=
##OWNER=
##NPOINTS=3735
##FIRSTX=399.26403809
##LASTX=4000.35498047
##MAXX=4000.35498047
##MINX=399.26403809
##MAXY=66.80938721
##MINY=6.70561552
##XFACTOR=1.0000000000
##YFACTOR=0.000000100000000
##FIRSTY=41.87319946
##DELTAX=0.96440572
##XUNITS=1/CM
##YUNITS=TRANSMITTANCE
##XYDATA=(X++(Y..Y))
399.3D18731995J34115677P6646347K3314056n27496R03625P411041O504212R94415
407F68093872j707153n03998N42831n61828j867752j758805j594238l120651n345535
415.7F52176743n606308l011551N24368K559967K467957J398696P19529Q63189J228104
424.3F53320694P87582r58175l255692m478454l607560j345596N03388P95516k441
433F41759262n75180j68381Q64029J626587J517410O05545n47180j385345j792526
441.7F41904221k069626k463455k830391k923661k910881l297500m248543n253792
449.4F15906372n671997n408516m762077l738518j981277M52690K611656L336258K383156
458.1F03127747N95741j013336k061577k643624k795181k485618k009621j937065k477226
$$ plain form
399.3 418731995 552847672 629494019 652808075 652280579 653184204 660595245 667099457 668093872
407 668093872 666386719 665882721 666425552 665863724 663995972 662237167 660642929 657522278 652176743
415.7 652176743 646570435 643558884 644083252 646643219 649111176 650509872 651229401 652092590 653320694
424.3 653320694 654108276 653150101 649894409 645415955 641808395 640462799 640966187 641761703 641759262
433 641759262 641184082 641015701 641879730 643506317 645023727 645629272 645082092 643696747 641904221
441.7 641904221 639834595 637371140 634540749 631617088 628706207 625408707 621160164 615906372
449.4 615906372 610234375 604825859 600063782 596325264 594343987 594796677 597408333 600744591 603127747
458.1 603127747 603723488 602710152 600648575 598004951 595209770 592724152 590714531 588777466 586300240
466.8E86300240l143464l330764l145409l355598m412232n734939o239357n579987
474.5E51358490m659576m755936o197052q026772q969421q578606p365532n948944
482.2D96856651m334030k102203Q31489L819847N822220O071244M506721J813507q51135
490.9E12434311k387810k391052j443024o74286q64067j921463l238678m443512n667228
499.6D89403191p102471q528213r463272r752846r824600j0269242j1235161j2320976
507.3D10906410j3028641j3224144j3131141j2979584j2768555j2369194j1757431
514C21647720j1057491j0349979r480610q099461n910263k888927P30476M677658Q819370
522.7B88088493J3055306J7004509J9851188K0645257J8901863J4981956R898834M742775
$$ plain form
466.8 586300240 583156776 579826012 576680603 573325005 568912773 563177834 556938477 551358490
474.5 551358490 546698914 541942978 535745926 527719154 518749733 510171127 502805595 496856651
482.2 496856651 492522621 490420418 491251907 495071754 500893974 506965218 511471939 513285446 512434311
490.9 512434311 510046501 507655449 506212425 505538139 504674072 502752609 499513931 495070419 489403191
499.6 489403191 482300720 473772507 464309235 454556389 444731789 434462547 423227386 410906410
507.3 410906410 397877769 384653625 371522484 358542900 345774345 333405151 321647720
514 321647720 310590229 300240250 290759640 282660179 276749916 273860989 274591465 279269123 288088493
522.7 288088493 301143799 318148308 337999496 358644753 377546616 392528572 402427406 407170181
530.4D07170181K37770l297004n768624p205887p755088p626191o978340n909729m572982
539.1C58294106l210640j976815p40242Q25959K886390N188294P195854Q481293R001426
547.8C85945625R044991Q948059Q830986Q544884P868232O791497N609588M677430
555.5D46261292M036788L330498K134857L62778j707230l773231n798264p938613j0293770
564.2D26615105j2810097j5387840j7927666k0159912k1428261k0704517j6919155
570.9C01277657r479542J231632J3634758K5271835L3699646L7524376L6896210L3147163
578.6D73203735K7940712K2615700J8013535J4539337J2163162J0445213Q824425P068138
586.4E94813957N434761M327469L806496L519096L107414K568016K138634J913758
$$ plain form
530.4 407170181 407407951 404110947 398342323 391136436 383381348 375755157 368776817 362867088 358294106
539.1 358294106 355083466 353106651 352366409 353192368 356078758 361267052 368462906 376944199 385945625
547.8 385945625 394990616 403938675 412769661 421314545 429182777 435974274 441583862 446261292
555.5 446261292 450298080 453628578 455763435 456126213 454418983 450645752 444847488 436908875 426615105
564.2 426615105 413805008 398417168 380489502 360329590 338901329 318196812 301277657
570.9 301277657 291798115 293029747 306664505 331936340 365635986 403160362 440056572 473203735
578.6 473203735 501144447 523760147 541773682 556313019 568476181 578921394 587745819 594813957
586.4 594813957 600248718 604576187 608382683 611901779 615009193 617577209 619715843 621629601
594.1F21629601J719894J392975J038666Q91418R70421J009102P71675L34129l1051
602.8F29726830j98594l13034n63087r33266j234093j329727j265831j195106j241074
611.4F21453018j436081j727257k007293k189484k310066k538948l045464l839569
619.2F02358856m775619n709076o622544p623748q878556j0530433j2512169j4251976
626.9E31454735j4616318j2477112p724113j855660K630234L823280J764527j519852
634.6E01479721l328094j911660K682152Q893128J4612884J8174362J8914681J7196274
642.3E76713448J4004097J0388908P068863M348411K262116P29256l81699j231155
650F13902245j947937k567559l040237l316422l423195l459320l525123l639641l717423
$$ plain form
594.1 621629601 623349495 624742470 625781136 626672554 627642975 628652077 629423752 629757881 629726830
602.8 629726830 629528236 629215202 628652115 627718849 626484756 625155029 623889198 622694092 621453018
611.4 621453018 620016937 618289680 616282387 614092903 611782837 609243889 606198425 602358856
619.2 602358856 597583237 591874161 585251617 577627869 568749313 558218880 545706711 531454735
626.9 531454735 516838417 504361305 496637192 494781532 497411766 501235046 502999573 501479721
634.6 501479721 498151627 496239967 498922119 507815247 522428131 540602493 559517174 576713448
642.3 576713448 590717545 601106453 608175316 612523727 614785843 615515099 615133400 613902245
650 613902245 611954308 609386749 606346512 603030090 599606895 596147575 592622452 588982811 585265388
658.7E85265388l632087l322678k827186k179146j284256P400J621895L092995L809395
667.4E80551720L533630K657623J875229J589051J666221J734505J615295J419144
675.1E96642418J309357J295585J264076J120339Q41789M38805o8550o35376j197052
683.8F01011391j698838k105827k396583k583123k733040k933616l220406l570480
691.5E79769478l980560m512444n232925o147538p230224q472595r851265j1297875
699.2E23044052j2810631j4520797j6313210j7129822j4877205p704887L999481J6811104
706.9D60498085K5886345K7993240K3442841J5391312P387275J378708k512169m973678
714.6E54491959o578064p594643q221436q704910r231338r808808j0280952j0423622
$$ plain form
658.7 585265388 581633301 578310623 575483437 573304291 572020035 572027435 573649330 576742325 580551720
667.4 580551720 584085350 586742973 588618202 590207253 591873474 593607979 595223274 596642418
675.1 596642418 597951775 599247360 600511436 601631775 602473564 602912369 602843819 602208443 601011391
683.8 601011391 599312553 597206726 594810143 592227020 589493980 586560364 583339958 579769478
691.5 579769478 575788918 571276474 566043549 559896011 552665787 544193192 534341927 523044052
699.2 523044052 510233421 495712624 479399414 462269592 447392387 439687500 443686981 460498085
706.9 460498085 486384430 514377670 537820511 553211823 560599098 561977806 559465637 554491959
714.6 554491959 547913895 540319252 532097816 523392906 514161568 504352760 494071808 483648186
722.3D83648186j0050011r099579p689132o069985m485207l029708j631661j78184
730.1D41414719J337471K779693L982849M904976N664292O411018P160416P768325
737.8D81423759Q092041Q151513Q097915Q019448P828140P382622O708068O029206
745.5E41732712N552826N251350M905357M335862L524551K502403J237030k24266j476898
754.2E67340927j795578o48460J721077M280433N884133O051559N149765L901978K782707
762.8E94668541J859283J067124M79393K63710M48837Q19283J053390R42726M86450
771.5F02088737j70173q40454j362572j631813j631126j443673j210937j049919j000099
780.2E91747971j045723j182518j438027j813850k216645k483291k508392k361451
$$ plain form
722.3 483648186 473598175 464498596 456809464 450739479 446254272 443224564 441592903 441414719
730.1 441414719 442752190 445531883 449514732 454419708 460084000 466495018 473655434 481423759
737.8 481423759 489515800 497667313 505765228 513784676 521612816 528995438 535703506 541732712
745.5 541732712 547285538 552536888 557442245 561778107 565302658 567805061 569042091 568817825 567340927
754.2 567340927 565545349 564896889 566617966 570898399 576782532 582834091 587983856 591885834 594668541
762.8 594668541 596527824 597594948 598074341 598338051 598786888 599606171 600659561 601602287 602088737
771.5 602088737 601918564 601078110 599715538 598083725 596452599 595008926 593797989 592748070 591747971
780.2 591747971 590702248 589519730 588081703 586267853 584051208 581567917 579059525 576698074
787.9E76698074k262954k422028k886810l544770m263725n021972n899201o951981
795.6E43444633q118133r252815j0269852j1243477j2365608j3783226j5462494j7215958
803.4D45733070j8889770k0531044k2307396k4112663k5128060k3797760j8511886
810.1B92454491q730641M214497J7349281K7335053L2023544L1294937K6728249K0471573
817.8D43140984J4123306Q266640K759056k627907p779083j2323990j6026116j8896446
825.5D10636444k0734978k0547790j6729584q314018L617782J5811577K4474793K7503128
833.3D15717354K5484505K0751609J5484085J0534859N744820J097412k505913l516121
841D88792610p77893N481644J3435402K0413513K4209709K4118729K1045265J6690864
$$ plain form
787.9 576698074 574435120 572013092 569126282 565581512 561317787 556295815 550396614 543444633
795.6 543444633 535326500 526073685 515803833 504560356 492194748 478411522 462949028 445733070
803.4 445733070 426843300 406312256 384004860 359892197 334764137 310966377 292454491
810.1 292454491 283723850 287938347 305287628 332622681 364646225 395941162 422669411 443140984
817.8 443140984 457264290 465530930 468289986 465662079 457882996 445559006 429532890 410636444
825.5 410636444 389901466 369353676 352624092 344310074 347927856 363739433 388214226 415717354
833.3 415717354 441201859 461953468 477437553 487972412 493717232 494814644 492308731 488792610
841 488792610 488014717 493496361 506931763 527345276 551554985 575673714 596718979 613409843
848.7F13409843J2498513R108085O521187M555741L087615J993485J063385R2468r58328
857.4F51371994j956635k777633l466263m226379n285187o774750q636131j0473938
865.1F07775078j1445503j0479126o931343j275940M849472R477462J1445733J0923347
872.8F14339180Q984337O736717M774132L215713K014161J137466N59769K23388N0507
881.5F42035370m1733j39923l06015n28030p30439q53309r02100r05914q61778p66297
891.1F35999832o84357p12471q51593r75380r71946q96569r13658j080513j246414
899.8F27666931j213150r65118o90689n80826o44913p40433p50846o97213o84242p72858
909.4F19926643r20410j039963j098976j144256j227799j326484j361657j309356j258583
$$ plain form
848.7 613409843 625908356 635016441 641537628 646093369 649180984 651174469 652237854 652330322 651371994
857.4 651371994 649415359 646637726 643171463 638945084 633659897 626885147 618249016 607775078
865.1 607775078 596329575 585850449 578919106 577643166 582492638 591970100 603415833 614339180
872.8 614339180 623323517 630060234 634834366 638050079 640064240 641201706 641761475 641984863 642035370
881.5 642035370 641993637 641853714 641547699 641019669 640289230 639435921 638533821 637627907 636766129 635999832
891.1 635999832 635315475 634603004 633751411 632776031 631804085 630907516 629993858 628913345 627666931
899.8 627666931 626453781 625488663 624797974 624217148 623572235 622831802 622080956 621383743 620699501 619926643
909.4 619926643 619006233 617966270 616867294 615723038 614495239 613168755 611807098 610497742 609239159
918.1F09239159j317406j469002j566162j498260j333046j243325j301727j395035
925.8E98115196j367264j207809j066780j090965j285515j535301j723137j817551
933.6E87020874j887321k056771k407875k848511l060798k671051j576042j49918R27124
942.2E71289711J131897M72298n47524j323509j554871j348114j019516q33893q90464
950.9E65376015j160927j553803j929016k109794j964493j513977r49745n05562k99187
959.6E53389511k89650l72391m87442o29997p88307r24378j019172j111870j262245
968.3E46504059j474953j678505j782150j754189j651229j590233j681099j946717
976E32944984k280311k497864k486687k321624k214508k321206k599525k870750l006592
$$ plain form
918.1 609239159 607921753 606452751 604886589 603388329 602055283 600811958 599510231 598115196
925.8 598115196 596747932 595540123 594473343 593382378 592096863 590561562 588838425 587020874
933.6 587020874 585133553 583076782 580668907 577820396 574759598 572088547 570512505 570362587 571289711
942.2 571289711 572421608 572893906 572346382 571022873 569468002 568119888 567100372 566266479 565376015
950.9 565376015 564215088 562661285 560732269 558622475 556657982 555144005 554194260 553688698 553389511
959.6 553389511 553099861 552727470 552240028 551610031 550821724 549897346 548878174 547766304 546504059
968.3 546504059 545029106 543350601 541568451 539814262 538163033 536572800 534891701 532944984
976 532944984 530664673 528166809 525680122 523358498 521143990 518822784 516223259 513352509 510345917
984.7E10345917l018418k982711k938729k906761k955856l171349l531151l878479
992.4D84962463m072532m136887m215431m402199m685707n050507n528831o099930
1000.1D46770439o652870p196007q046264r534569j1340523j2281685j1164970q096085
1007.8C72457466m844208l636894n412025r208527j3202667j6212311j8198719j9548664
1015.5B82193451k0176716j9400463j6503658j1269684m076100M266339J2654838J9845543
1023.2B47533550K4752274K6817951K6193352K3594093J9967232J6179733J2826805
1030C97864990J0175591Q229217O869812N973664N419006N032501M596749L957099
1037.7D48118629L116265K215690J415711P89184L00332j43433o15616j115875j572037
$$ plain form
984.7 510345917 507327499 504344788 501406059 498499298 495543442 492372093 488840942 484962463
992.4 484962463 480889931 476753044 472537613 468135414 463449707 458399200 452870369 446770439
1000.1 446770439 440117569 432921562 424875298 415340729 404000206 391718521 380553551 372457466
1007.8 372457466 367613258 363976364 358564339 349355812 336153145 319940834 301742115 282193451
1015.5 282193451 262016735 242616272 226112614 214842930 210766830 215033169 227688007 247533550
1023.2 247533550 272285824 299103775 325297127 348891220 368858452 385038185 397864990
1030 397864990 408040581 416269798 423139610 429113274 434532280 439564781 444161530 448118629
1037.7 448118629 451234894 453450584 454866295 455655479 455955811 455812378 455196762 454080887 452508850
1046.4D52508850j907349k120666k290802k487030k692185k842636k943649l104591
1054.1D32119942l427353l875771m295692m578552m777871n042228n457459n983810
1061.8C94681206o546059p135925p795334q520889r233322r851609j0363807j0787278
1069.5C24446983j1068725j1057797j0593509r604779q118019o181450l808651j002044
1077.2B63012009K173443N537166Q798790J1631546J3774662J5112476J5669404J5538673
1085C51248169J4819717J3628731J2138863J0563812R069214P702713O411209N125847
1092.7D30708275L821411K519913J264000Q6670j016121k099038l256607m621543o370202
1101.4D21036758q634338j1197052j3137550j2922249r274178k371559N710488J1991767
$$ plain form
1046.4 452508850 450601501 448480835 446190033 443703003 441010818 438168182 435224533 432119942
1054.1 432119942 428692589 424816818 420521126 415942574 411164703 406122475 400665016 394681206
1061.8 394681206 388135147 380999222 373203888 364682999 355449677 345598068 335234261 324446983
1069.5 324446983 313378258 302320461 291726952 282122173 274004154 267822704 264014053 263012009
1077.2 263012009 265185452 270722618 279521408 291152954 304927616 320040092 335709496 351248169
1085 351248169 366067886 379696617 391835480 402399292 411468506 419171219 425582428 430708275
1092.7 430708275 434529686 437049599 438313599 438400269 437384148 435285110 432028503 427406960 421036758
1101.4 421036758 412402420 401205368 388067818 375145569 365871391 363499832 369210320 381202087
1109.1C81202087J4407998J2989387R467278N815925L073464J256981K3040p95135
1116.8D27441025j173172j130867q19931m10805Q659M10576P60651J007423J120415
1125.5D27213974J111107J021118Q98476P70263O11725L48206p7782o20918j123314
1134.1D30152855j432877j545524j616822j808624k125244k416954k548866k546730
1141.9D14111214k550927k651596k802734k911644k965813l035354l162384l287850
1149.6C90742912l309364l179436k945709k721863k641067k799874l192596l696518
1157.3C66256485m172821m599342n075188n680580o382218p106056p844391q611831
1165C16784058r349118j0019035j0790462j1837445j2628841j1490956o448631K844296
$$ plain form
1109.1 381202087 395610085 408599472 418066750 423882675 426956139 428213120 428236160 427441025
1116.8 427441025 426267853 425136986 424317055 423906250 423914909 424325485 425086136 426093559 427213974
1125.5 427213974 428325081 429346199 430244675 431014938 431626663 431974869 431897087 431276169 430152855
1134.1 430152855 428719978 427174454 425557632 423749008 421623764 419206810 416657944 414111214
1141.9 414111214 411560287 408908691 406105957 403194313 400228500 397193146 394030762 390742912
1149.6 390742912 387433548 384254112 381308403 378586540 375945473 373145599 369953003 366256485
1157.3 366256485 362083664 357484322 352409134 346728554 340346336 333240280 325395889 316784058
1165 316784058 307434940 297415905 286625443 274787998 262159157 250668201 244219570 247063866
1172.7B47063866J3796081K1859780K3456897J8473759J0146637K531242k137565m113388
1180.4C31077309m875641n622864o824074q551254j0533180j1698742j0149555m350071
1188.1B68471928N144539J5172576K1602250K2012233J7171555J0132561L911399j79901
1195.9C63439140k473488l810958m676094n173836n391884n527306n706176n850106
1203.6C24829292n779876n414620m855995m326515m048138m138889m563885n169964
1211.3B86531410n797558o375942o926231p495346q100071q722153r307442r764633
1219B24042034r994221r965858r754734r471092r143219q675576p929849o827412n383234
1227.7A46896839l686752j897965k60000R33256J440325J172762K23083j182832k755184
$$ plain form
1172.7 247063866 260859947 282719727 306176624 324650383 334797020 337328262 335190697 331077309
1180.4 331077309 326201668 320578804 313754730 305203476 294670296 282971554 272821999 268471928
1188.1 268471928 273616467 288789043 310391293 332403526 349575081 359707642 363619041 363439140
1195.9 363439140 360965652 357154694 352478600 347304764 341912880 336385574 330679398 324829292
1203.6 324829292 319049416 313634796 308778801 304452286 300404148 296265259 291701374 286531410
1211.3 286531410 280733852 274357910 267431679 259936333 251836262 243114109 233806667 224042034
1219 224042034 214047813 204081955 194327221 184856129 175712910 167037334 159107485 152280073 146896839
1227.7 146896839 143210087 141312122 141052122 141985378 143425703 144598465 144821548 143638716 140883532
1236.4A40883532m192906n213270n573473n099640l740559j637544Q56418L267785
1244.1A19550343N188789O438274P084809P338838P420502P503862P739163Q276214
1251.8A76540794R226094J0563221J2042846J3225994J3639965J3005047J1383648
1258.5B59627609R145031O780586M691067L080406J972428J285305Q87089O15310K96116
1267.2B88380947k03514r03206j672039k270393k457352k092552j181698J40133J646080
1275.9B79386406L058052M097061M547863M309998L411350J984806K27242j644097
1283.6B99378681l434734n003052o258717p145576p645435p815399p812462p850952
1291.3B46412354q114548q689633r548187j0521850j1217518j0948220q850307m276600
$$ plain form
1236.4 140883532 136690626 131477356 125903883 120804243 117063684 115426140 116282558 119550343
1244.1 119550343 124739132 131177406 138262215 145601053 153021555 160525417 168264580 176540794
1251.8 176540794 185766888 196330109 208372955 221598949 235238914 248243961 259627609
1258.5 259627609 268772640 275553226 280244293 283324699 285297127 286582432 287469521 288084831 288380947
1267.2 288380947 288177433 287274227 285602188 283331795 280874443 278781891 277600193 277740326 279386406
1275.9 279386406 282444458 286541519 291089382 295399380 298810730 300795536 301022778 299378681
1283.6 299378681 295943947 290940895 284682178 277536602 269891167 262075768 254263306 246412354
1291.3 246412354 238297806 229608173 220059986 209538136 198320618 187372398 178522091 174245491
1299A74245491K694092J0967464J8646908K3729382K4935417K2202053J6556969R489860
1306.8C03467636K263146m381199j0005532j4072494j5821591j4623336j0532322m530831
1314.5B31763477J796513O956100J0120068J1250496J0829067R483090P748985O010227
1322.2B95958023M510803L376942K631397K219639K051258K045269K149544K321720
1329.9C17264595K489319K545204K411156K111053J763497J479148J269379J072998
1337.6C32406349Q63915P07130O92520Q31261J034775J187477J219978J118393Q97942
1346.3C40959740N87692K30980j26686m54369p36999r64699j141396j302566j498223
1355C35553474j733360j935119k007294j935654j827087j825447j976281k180481k297573
$$ plain form
1299 174245491 176939583 187907047 206553955 230283337 255218754 277420807 293977776 303467636
1306.8 303467636 305730782 301349583 291344051 277271557 261449966 246826630 236294308 231763477
1314.5 231763477 233559990 240516090 250636158 261886654 272715721 282198811 289947796 295958023
1322.2 295958023 300468826 303845768 306477165 308696804 310748062 312793331 314942875 317264595
1329.9 317264595 319753914 322299118 324710274 326821327 328584824 330063972 331333351 332406349
1337.6 332406349 333270264 333977394 334669914 335501175 336535950 337723427 338943405 340061798 340959740
1346.3 340959740 341547432 341778412 341651726 341197357 340460358 339495659 338354263 337051697 335553474
1355 335553474 333820114 331884995 329877701 327942047 326114960 324289513 322313232 320132751 317835178
1363.7C17835178k294197k286644k425899k737084l086853l317966l410149l487720
1371.4B94788666l668404l927669m123040m142990m004841l820781l695984l669930
1379.1B63735027l725032l810063l862343l845405l786488l768558l858776m036751
1386.8B33041611m198551m237900m132157l967666l876915l934765m084396m171601
1394.5B00437660m073543l796254l445282l093605k703476k185688j512680p54566
1402.2A78872566k4013N92708J061096J397858J657906J885814K063065K131062K076854
1410.9A91714916J942520J715088J280537O54182K86732R66969L164730O379013R255028
1419.6B17359715J0519351R896813Q160458O361389N052395M165248L419342K692357
$$ plain form
1363.7 317835178 315540981 313254337 310828438 308091354 305004501 301686535 298276386 294788666
1371.4 294788666 291120262 287192593 283069553 278926563 274921722 271100941 267404957 263735027
1379.1 263735027 260009995 256199932 252337589 248492184 244705696 240937138 237078362 233041611
1386.8 233041611 228843060 224605160 220473003 216505337 212628422 208693657 204609261 200437660
1394.5 200437660 196364117 192567863 189122581 186028976 183325500 181139812 179627132 178872566
1402.2 178872566 178848553 179441261 180502357 181900215 183558121 185443935 187507000 189638062 191714916
1410.9 191714916 193657436 195372524 196653061 197307243 197593975 198560944 201725674 208104687 217359715
1419.6 217359715 227879066 237775879 245936337 252297726 257350121 261515369 264934711 267627068
1427.3B67627068K023735J442165R19437M64631J29318j70841p65877j986256l718204
1436B65965176n351506o421470p320404q995781j1507225j2930794j0332260k538090
1443.7B00567646P891979J5869141J7499618J2990990O102028R14936r16195l13053
1451.4B60607090R65767J820640K003365J607018P68775l01971j357155k298450l258705
1460.1B60556374m467030o050892p867279r343090r463501p208614k372761L900680
1467.8B17683887R534798J2699661J2785836J0426693O763076K757588r63078l939285
1475.5B67749176n796986o348705n659408l949681j470184J479969M440842O791954
1483.2B57236977P969036P734050O248417L895665J071205j850338m437676o280346
$$ plain form
1427.3 267627068 269650803 271092968 272012405 272477036 272606354 272435513 271669636 269683380 265965176
1436 265965176 260613670 254192200 246871796 237876015 226368790 213437996 203105736 200567646
1443.7 200567646 208459625 224328766 241828384 254819374 260921402 261836338 260920143 260607090
1451.4 260607090 261572857 263393497 265396862 267003880 267772655 267470684 266113529 263815079 260556374
1460.1 260556374 256089344 250038452 242171173 232828083 223364582 216155968 213783207 217683887
1467.8 217683887 227218685 239918346 252704182 263130875 269893951 272651539 271688461 267749176
1475.5 267749176 261952190 255603485 249944077 245994396 244524212 246004181 250445023 257236977
1483.2 257236977 265206013 272940063 279188480 283084145 284155350 282305012 277867336 271586990
1491B71586990p280807p839241q596592r878330j1407795j2616463j3205738j3330975
1498.7A87431049j3257656j2994442j2381859j1467037j0602445j0066767r658213
1505.4A07002630q776378o923628m110689q09775K386456N067596P141638Q844843
1513.1A09822693J0585613J2579832J4501219J5570679J5149059J3299484J0705242
1519.9B02213821Q011189N328636K420082p54299l834286o382942q236160r456005
1527.6A89310036j0091477j0184250r960613r772539r703932r354877q203430o180439
1535.3A15858479l758851j463661N66426K483587M388265O272278Q216420J0369806
1543A42932749J2626848J4522362J5662479J6199684J6670590J7332687J7860527J7813282
$$ plain form
1491 271586990 264306183 256466942 247870350 237992020 226584225 213967762 200762024 187431049
1498.7 187431049 174173393 161178951 148797092 137330055 126727610 116660843 107002630
1505.4 107002630 98226252 91302624 87191935 86382160 88768616 93836212 100977850 109822693
1513.1 109822693 120408306 132988138 147489357 163060036 178209095 191508579 202213821
1519.9 202213821 210225010 215553646 217973728 217219429 213385143 207002201 198766041 189310036
1527.6 189310036 179218559 169034309 159073696 149301157 139597225 130242348 122038918 115858479
1535.3 115858479 112099628 110635967 111202393 113685980 118074245 124346523 132562943 142932749
1543 142932749 155559597 170081959 185744438 201944122 218614712 235947399 253807926 271621208
1550.7B71621208J7235508J6579724J6091461J5536651J4643479J3593673J2831154
1557.5C78132858J2435761J1953430J0959244R625740Q548546Q068657P947273P725143
1565.2D55396652P214623O513023N679360M632263L389778K182960J152611J6670j725082
1573.9D84452858m157448o646995q330689q941688r080391r651261j1087303j3133507
1581.6D13423576j5287132j7289085j9110680k0487022k0537186j7967701j1864853
1588.4B90879917k578850P986260J7042522K2231789K2733688J9424095J4090805Q392449
1596.1D00202675L269882j035957m686089p981033j1181946j4336319j7122078j8819084
1603.8C28310051j8502789j5499706r986133l348008K185555M689999L714065M26903
$$ plain form
1550.7 271621208 288856716 305436440 321527901 337064552 351708031 365301704 378132858
1557.5 378132858 390568619 402522049 413481293 423107033 431655579 439724236 447671509 455396652
1565.2 455396652 462611275 469124298 474803658 479435921 482825699 485008659 486161270 486177940 484452858
1573.9 484452858 480295410 473648415 465317726 456376038 447295647 437644386 426557083 413423576
1581.6 413423576 398136444 380847359 361736679 341249657 320712471 302744770 290879917
1588.4 290879917 288301067 296287327 313329849 335561638 358295326 377719421 391810226 400202675
1596.1 400202675 403472557 402436600 397750511 389769478 378587532 364251213 347129135 328310051
1603.8 328310051 309807262 294307556 284321423 280973415 283158970 287848969 291563034 291989937
1611.5B91989937l471031p054158j0426826j3833523j6799908j8358917j8058605j6507778
1619.2A87479191j4796696j3438196j1951571r402818n234118L80068O743698J3009901
1626.9A52789459J8416901K2402592K4702797K5420112K4981117K3969136K2872829
1633.7C15554943K1850453K0682411J9037056J6889419J4678841J2968101J1927681
1640.4D33588905J1214829J0388527R353599Q320236P438431O656342N977630N636788
1648.1D98575287N812530O211892O184120N378608M187813L386460L340416L682365
1655.9E36759491L776627L369140K705116K123490J706009J352577J052818R56764
1663.6E53802032J175080J586914J894569J884957J645393J516266J784286K369080
$$ plain form
1611.5 291989937 288518906 281464748 271037922 257204399 240404491 222045574 203986969 187479191
1619.2 187479191 172682495 159244299 147292728 137889910 132655792 133035860 139779558 152789459
1626.9 152789459 171206360 193608952 218311749 243731861 268712978 292682114 315554943
1633.7 315554943 337405396 358087807 377124863 394014282 408693123 421661224 433588905
1640.4 433588905 444803734 455192261 464545860 472866096 480304527 486960869 492938499 498575287
1648.1 498575287 504387817 510599709 516783829 522162437 526350250 529736710 533077126 536759491
1655.9 536759491 540536118 543905258 546610374 548733864 550439873 551792450 552845268 553802032
1663.6 553802032 554977112 556564026 558458595 560343552 561988945 563505211 565289497 567658577
1671.3E67658577K848358K847786K416420J958160J784859J826897J835747J764335
1679E84941139J762467J787872J451454M72756p49321j289559o06956P64961J641235
1687.7E90176048J367607M72336K7237M26941R86595Q12836p9651p50656m49371M49562
1697.3E93439484Q29734J13221j063042j564331j018562j62812M9973n20630j193047
1706E88909988j326942r68971o31256o41442q72001j022683r88502r14154j010399
1714.7E80533638j379929j934280k391396k413520j896363j161461p50885r32159j424522
1723.4E66249123j695519j530647j225052j181984j402283j494331j198311p81822
1731.1E55739174p83959j364364k023964k078514j393166n49850k45590n98031j108856
$$ plain form
1671.3 567658577 570506935 573354721 575771141 577729301 579514160 581341057 583176804 584941139
1679 584941139 586703606 588491478 589942932 590415688 589666367 588376808 587769852 588534813 590176048
1687.7 590176048 591543655 592015991 592043228 592470169 593456764 594269600 594189949 593439293 592989922 593439484
1697.3 593439484 594269218 594382439 593319397 591755066 590736504 590573692 590623665 590103035 588909988
1706 588909988 587583046 586614075 585982819 585341377 584469376 583446693 582458191 581544037 580533638
1714.7 580533638 579153709 577219429 574828033 572414513 570518150 569356689 568605804 567673645 566249123
1723.4 566249123 564553604 563022957 561797905 560615921 559213638 557719307 556520996 555739174
1731.1 555739174 554955215 553590851 551566887 549488373 548095207 547545357 547299767 546701736 545592880
1739.8E45592880j261101j015625p00378n47829m90455l80821k54517k85797n52254
1748.4E40104103r23157j171112j130447p83386k91939M9744M882l63578o94809o77681
1758.1E34122620l96157k37426m23928p33490p67479m35676n1613O7291j6174L6163
1767.7E31164131M14276R45359J318779J432457J456337J590652J840591K044144K064476
1776.4E44271202J911545J697540J520615J412391J357995J324691J272469J173706
1784.1E55942154J060753J034508J174697J419640J564102J433830J077881P56188
1791.8E65463753P06978R26780J197434J313019J252288J133538J053047J013908R91059
1800.5E75051804R98649J056099J121292J111489R98916Q50907P46803O85768O12869
$$ plain form
1739.8 545592880 544331779 543316154 542615776 542067947 541577492 541196671 540942154 540656357 540104103
1748.4 540104103 539180946 538009834 536879387 536096001 535804062 535853806 535858688 535495110 534800301 534122620
1758.1 534122620 533726463 533489037 533065109 532331619 531564140 531128464 531076851 531144142 531127968 531164131
1767.7 531164131 531578407 532523766 533842545 535275002 536731339 538321991 540162582 542206726 544271202
1776.4 544271202 546182747 547880287 549400902 550813293 552171288 553495979 554768448 555942154
1784.1 555942154 557002907 558037415 559212112 560631752 562195854 563629684 564707565 565463753
1791.8 565463753 566170731 567097511 568294945 569607964 570860252 571993790 573046837 574060745 575051804
1800.5 575051804 576050453 577106552 578227844 579339333 580338249 581189156 581935959 582621727 583234596
1809.2E83234596N31731N38635P04193R51958J098404J027260P90443N28717L38364
1817.9E89744301K47001K72675M16489N82962O05468M32892K54250L25775O43196Q75626
1827.5E94400635P15294K52800q5335R651M17137P64160Q31375P09229N95512N70069
1837.2E99180527O02417O70585P61071P76634N80635J81808j94053l00179j31264P3357
1846.8F02201538R4223n3749j90735k00157j30234q5106q8005r1171p7057r1972j74446
1857.4F01113129k91863l79906m25758m72679n37720n61180m81834l59993l80669o82106
1867.1E96539421j173210j555634j571350j244468q65593p30324q97789j197891j440621
1875.7E85862541j580276j671830j729583j686173j500015j257019j116371j160660
$$ plain form
1809.2 583234596 583766327 584304962 585009155 585961113 587059517 588086777 588877220 589405937 589744301
1817.9 589744301 589991302 590263977 590680466 591263428 591868896 592301788 592556038 592881813 593525009 594400635
1827.5 594400635 595115929 595368729 595283394 595293045 595710182 596474342 597305717 598014946 598610458 599180527
1837.2 599180527 599782944 600453529 601214600 601991234 602571869 602753677 602559624 602259445 602128181 602201538
1846.8 602201538 602295761 602242012 602051277 601851120 601720886 601635780 601547775 601456604 601379547 601287575 601113129
1857.4 601113129 600821266 600441360 600015602 599542923 599005203 598444023 597962189 597602196 597221527 596539421
1867.1 596539421 595366211 593810577 592239227 590994759 590129166 589398842 588501053 587303162 585862541
1875.7 585862541 584282265 582610435 580880852 579194679 577694664 576437645 575321274 574160614
1883.4E74160614j339912j578141j902084k414284l136596l917046m511833m730225
1891.2E50630493m453468l539887j837043N98106L283539N422439O366463O040154
1898.9E62510796M928207L656502K588196J764030J113014O12030K56195j6555k91062
1907.6E77121353n73997p88613q72383q39653p38067n91927m33922l52630m35639o39534
1917.2E70854988p87201p51228o24657o36673q83674j188736j275559j060791p27463
1925.9E62919006n14335m88549n46188n84297o03905o48994p17278p75070q26797r09005
1935.5E56304588j008682j041641r48334p87773o93779p31392q30307q75931q40568
1944.2E48546181p95174p98225q15659p69386o42853n07431m50058m95377o13899p72514
$$ plain form
1883.4 574160614 572820702 571242561 569340477 566926193 563789597 559872551 555360718 550630493
1891.2 550630493 546177025 542637138 540800095 541398201 544681740 550104179 556470642 562510796
1898.9 562510796 567439003 571095505 573683701 575447731 576560745 577172775 577428970 577412415 577121353
1907.6 577121353 576547356 575758743 574886360 574046707 573308640 572716713 572282791 571930161 571494522 570854988
1917.2 570854988 570067787 569316559 568691902 568055229 567171555 565982819 564707260 563646469 562919006
1925.9 562919006 562404671 561916122 561369934 560785637 560181732 559532738 558815460 558040390 557213593 556304588
1935.5 556304588 555295906 554254265 553305931 552518158 551824379 551092987 550262680 549386749 548546181
1944.2 548546181 547751007 546952782 546137123 545367737 544724884 544217453 543767395 543272018 542658119 541885605
1953.8E41885605r51462j115570j206932j194344j117820j060753j066704j101456
1961.6E33070564j106796j083679j102371j219483j399002j530838j530800j421623
1969.3E22675972j306000j266823j296234j323814j304321j266556j275253j353646
1977E12283325j458511j530457j553268j551018j535339j480294j360702j203957j079177
1985.7D99530602j033555j055679j107559j174240j262551j351165j378403j296730
1993.4D89870720j134720r83124r15413r36584j006775j096115j201134j311111j396866
2002.1D79888878j437950j449700j464615j488914j497803j477928j464386j517143
2009.8D68090439j658020j840515j987496k057228k073517k094192k158127k261620
$$ plain form
1953.8 541885605 540934143 539818573 538611641 537417297 536299477 535238724 534172020 533070564
1961.6 533070564 531963768 530880089 529777718 528558235 527159233 525628395 524097595 522675972
1969.3 522675972 521369972 520103149 518806915 517483101 516178780 514912224 513636971 512283325
1977 512283325 510824814 509294357 507741089 506190071 504654732 503174438 501813736 500609779 499530602
1985.7 499530602 498497047 497441368 496333809 495159569 493897018 492545853 491167450 489870720
1993.4 489870720 488736000 487752876 486837463 485900879 484894104 483797989 482596855 481285744 479888878
2002.1 479888878 478450928 477001228 475536613 474047699 472549896 471071968 469607582 468090439
2009.8 468090439 466432419 464591904 462604408 460547180 458473663 456379471 454221344 451959724
2017.5D51959724k381172k506599k646599k806969k975654l136711l292313l450623
2025.2D28763084l592376l657036l585625l377380l097344k830734k633514k530861
2032.9D03458214k538376k662582k877388l121567l333054l486481l591003l656387
2040.6C78191376l670502l616600l501358l360863l233566l121300k975120k724533
2048.4C51987534k327004j792107j159782m63257K69509R83734J592483K021599K254715
2057C53367424K322731K261581K110520J938782J823196J780167J750869J688996J630249
2065.7C70674515J623192J623916J560478J512108J679802K041168K140389J505585
2073.4C84361153M35333J81045J989670N787621R924812J2405663J2458496J0924225
$$ plain form
2017.5 451959724 449578552 447071953 444425354 441618385 438642731 435506020 432213707 428763084
2025.2 428763084 425170708 421513672 417928047 414550667 411453323 408622589 405989075 403458214
2032.9 403458214 400919838 398257256 395379868 392258301 388925247 385438766 381847763 378191376
2040.6 378191376 374520874 370904274 367402916 364042053 360808487 357687187 354712067 351987534
2048.4 351987534 349660530 347868423 346708641 346245384 346514893 347498627 349091110 351112709 353367424
2057 353367424 355690155 357951736 360062256 362001038 363824234 365604401 367355270 369044266 370674515
2065.7 370674515 372297707 373921623 375482101 376994209 378674011 380715179 382855568 384361153
2073.4 384361153 384796486 384977531 386967201 392754822 402679634 415085297 427543793 438468018
2081.1D38468018R243087Q223572P748032P370300O902885O433068O024132N603904
2088.9D96016998N108338M589195M133606L745689L363991K957764K563171K230950
2096.6E24709702J973228J765938J577987J392823J213646J060180R48754Q69484P95898
2105.2E36307640P19376O56814O18630N79376N02891L88527K74659J92833J34887P3014
2114.9E40448647l663q3961j51787j91879j89057j47705j11618j37672k34871l39661
2124.5E38856773l75290l33290k75306k56806k72178k78702k61688k47002k59934k91786
2134.2E36004791l21426l49922l97530m69971n42183n82160n85671n78346n84221o00014
2143.8E30993347n99289n63278n02243m45480m10843l90511l68423l47443l48701l79029
$$ plain form
2081.1 438468018 447711105 455934677 463682709 471053009 477955894 484388962 490413094 496016998
2088.9 496016998 501125336 505714531 509848137 513593826 516957817 519915581 522478752 524709702
2096.6 524709702 526682930 528448868 530026855 531419678 532633324 533693504 534642258 535511742 536307640
2105.2 536307640 537027016 537683830 538302460 538881836 539384727 539773254 540047913 540240746 540375633 540448647
2114.9 540448647 540444984 540361023 540209236 540017357 539828300 539680595 539568977 539431305 539196434 538856773
2124.5 538856773 538481483 538148193 537872887 537616081 537343903 537065201 536803513 536556511 536296577 536004791
2134.2 536004791 535683365 535333443 534935913 534465942 533923759 533341599 532755928 532177582 531593361 530993347
2143.8 530993347 530394058 529830780 529328537 528883057 528472214 528081703 527713280 527365837 527017136 526638107
2153.5E26638107m09202l91274l03345j70135m1466M3717P1373M5242k1515j07078
2163.1E25354424j82305k23465k22092j85165j30958q4839p0725r3574j32561j58196
2172.8E23870544j62010j65977j96038k52418l08189l32413l10745k47727j62926r2506
2182.4E21639595p3090j13678j83486k40479k75917l12347l57514l73077l16124k07482
2192E19186401j30577j48964k31971k82631k42844j54533j08109j44424k17667k49939
2201.7E17274742k12822j45035j07536j28822j91956k59666l07846l36266l52669l58505
2211.3E14873619l47710l22761l01323l01743l20930l36380l31497l16353l11089l20625
2221E11663208l29361l25355l14408l07617l01514k84958k64473k66151l05634l60946
$$ plain form
2153.5 526638107 526228905 525837631 525534286 525364151 525322685 525366402 525437775 525483017 525461502 525354424
2163.1 525354424 525172119 524948654 524726562 524541397 524410439 524325600 524254875 524161301 524028740 523870544
2172.8 523870544 523708534 523542557 523346519 523094101 522785912 522453499 522142754 521895027 521732101 521639595
2182.4 521639595 521566505 521452827 521269341 521028862 520752945 520440598 520083084 519710007 519393883 519186401
2192 519186401 519055824 518906860 518674889 518392258 518149414 517994881 517886772 517742348 517524681 517274742
2201.7 517274742 517061920 516916885 516809349 516680527 516488571 516228905 515921059 515584793 515232124 514873619
2211.3 514873619 514525909 514203148 513901825 513600082 513279152 512942772 512611275 512294922 511983833 511663208
2221 511663208 511333847 511008492 510694084 510386467 510084953 509799995 509535522 509269371 508963737 508602791
2230.6E08602791l91464l78266l39546l03574k75650k45132k16637k20146k81525l86581
2240.3E05564270m81300n11818m61693l61023k61650k07977k19155k82707l63502m21219
2249.9E01992226m33159m03671l55034l08609k74887k60621k74124l17993l78265m26712
2259.5D98559151m39415m12941l58811k90641k21978j73111j68152k13737k85721l45878
2269.2D95648766l75672l89595m11491m45633m76761m95682n15137n56144o22444o94046
2278.8D90666161p40014p35931o70471n46684l83339k13242p4234L891J1787l1929
2288.5D87285995q6021j11237j00746q9721j21346j97906k69509k79579k18315j31416
2298.1D85680199p7362q8807j63345k66685l34587k96326j37100N4016J37787N7449
$$ plain form
2230.6 508602791 508211327 507833061 507493515 507189941 506914291 506669159 506452522 506232376 505950851 505564270
2240.3 505564270 505082970 504571152 504109459 503748436 503486786 503278809 503059654 502776947 502413445 501992226
2249.9 501992226 501559067 501155396 500800362 500491753 500216866 499956245 499682121 499364128 498985863 498559151
2259.5 498559151 498119736 497706795 497347984 497057343 496835365 496662254 496494102 496280365 495994644 495648766
2269.2 495648766 495273094 494883499 494472008 494026375 493549614 493053932 492538795 491982651 491360207 490666161
2278.8 490666161 489926147 489190216 488519745 487973061 487589722 487376480 487302246 487306137 487317924 487285995
2288.5 487285995 487199974 487088737 486987991 486898270 486776924 486579018 486309509 486029930 485811615 485680199
2298.1 485680199 485602837 485514030 485350685 485084000 484749413 484453087 484315987 484370003 484507790 484565239
2307.8D84565239r3651j67808j34201j14556k27051m20799n12047l87573j28097Q9225
2317.4D82468681J76010J76545J48391O9504j01127l15400m50019m30069l03879j78604
2327.1D81260033j21384j38245k07023k79808k77291j51786J2321K3766k24381n96962
2336.7D79299240q12263p16439m28924j95809j51443k70882n03845q45146j222191
2345.4D74152298j405830j153107m75121L01857P97272Q81920P16133N22575L86391
2354.1D74724388K75192J68610J00136Q4801P5569J6784r3879k25716l75137n63240
2363.7D74187508p74651r38911j005516j016655j069031j199532j335029j374016j301575
2372.4D64172592j201210j152458j144371j104088r91936q49571p49588p25059p50885
$$ plain form
2307.8 484565239 484471588 484303780 484169579 484055023 483827972 483407173 482895126 482507553 482379456 482468681
2317.4 482468681 482644691 482821236 482969627 483039131 482938004 482622604 482172585 481742516 481438637 481260033
2327.1 481260033 481138649 481000404 480793381 480513573 480236282 480084496 480096817 480120583 479896202 479299240
2336.7 479299240 478486977 477770538 477341614 477145805 476994362 476723480 476219635 475374489 474152298
2345.4 474152298 472746468 471593361 471118240 471420097 472217369 473099289 473815422 474337997 474724388
2354.1 474724388 474999580 475168190 475268326 475353127 475428696 475445480 475351601 475125885 474750748 474187508
2363.7 474187508 473412857 472473946 471468430 470451775 469382744 468183212 466848183 465474167 464172592
2372.4 464172592 462971382 461818924 460674553 459570465 458578529 457728958 456979370 456254311 455503426
2381.1D55503426p82853p90062p51953o55822n12925l72238k95982l10288l86848m75006
2390.7D50169449n43442n86014n99670n74417n10559m34037l78952l59497l65066l81317
2400.3D45436478m12026m67148n39817n99556o10123n59654m70696l87420l48130l62167
2410D40679741m06990m47083m57954m40178m07524l75748l57818l65334m04243m62799
2419.6D36554070n10102n17425m84772m43573m29688m50897m80842m84543m48494l89748
2429.3D31913986l32947k84538k29645j54266p2060k4490m7417j34430k34146k89154
2438.9D30110893k79274k32963j98326k04010k49291l17612l93409m63143n10788n23796
2448.6D26738281n08003m87480m87938n13382n45120n59845n51758n35736n31197n47828
$$ plain form
2381.1 455503426 454720573 453930511 453178558 452522736 452009811 451637573 451341591 451031303 450644455 450169449
2390.7 450169449 449626007 449039993 448440323 447865906 447355347 446921310 446542358 446182861 445817795 445436478
2400.3 445436478 445024452 444557304 444017487 443417931 442807808 442248154 441777458 441390038 441041908 440679741
2410 440679741 440272751 439825668 439367714 438927536 438520012 438144264 437786446 437421112 437016869 436554070
2419.6 436554070 436043968 435526543 435041771 434598198 434168510 433717613 433236771 432752228 432303734 431913986
2429.3 431913986 431581039 431296501 431066856 430912590 430840530 430816040 430768623 430634193 430400047 430110893
2438.9 430110893 429831619 429598656 429400330 429196320 428947029 428629417 428236008 427772865 427262077 426738281
2448.6 426738281 426230278 425742798 425254860 424741478 424196358 423636513 423084755 422549019 422017822 421469994
2458.2D21469994n78843o09130o27366o34422o40831o49834o45065o01196n13229m15535
2467.8D15554543l61290l75290m28124m65126m63524m52537m74625n27916n58815n16090
2477.5D10931206m09432l07159k76604l27873m14238m81720n12810n28068n52101n83649
2487.1D06537552n94940n57556m68750l60566k81486k65122l11889l92113m69398n17579
2496.8D02318153n24101m87900m26254l75175l72315m23508m93202n34553n35355n28221
2506.4C97617569n49469n97687o36368o37245o11725n91735n91622n99441o03867o17714
2516.1C91580696o61659p28836p80297p87200p69577p79648q39653r07708r17053q50448
2525.7C83558617p63855p28798p58286q01506q09212p88269p81326q05397q29735q17451
$$ plain form
2458.2 421469994 420891151 420282021 419654655 419020233 418379402 417729568 417084503 416483307 415970078 415554543
2467.8 415554543 415193253 414817963 414389839 413924713 413461189 413008652 412534027 412006111 411447296 410931206
2477.5 410931206 410521774 410214615 409938011 409610138 409195900 408714180 408201370 407673302 407121201 406537552
2487.1 406537552 405942612 405385056 404916306 404555740 404274254 404009132 403697243 403305130 402835732 402318153
2496.8 402318153 401794052 401306152 400879898 400504723 400132408 399708900 399215698 398681145 398145790 397617569
2506.4 397617569 397068100 396470413 395834045 395196800 394585075 393993340 393401718 392802277 392198410 391580696
2516.1 391580696 390919037 390190201 389409904 388622704 387853127 387073479 386233826 385326118 384409065 383558617
2525.7 383558617 382794762 382065964 381307678 380506172 379696960 378908691 378127365 377321968 376492233 375674782
2535.4C75674782p73087p35359p30019p46650p59735p61528p63359p75109p93075q06542
2545C68030319q06198p84721p38869o76079o12640n59731n13420m69017m38576m44717
2554.6C61986351m89044n34096n26428m43764l13301j87912j04599o5422m6463k2011
2564.3C59253311J4916M8408N0621L815q2283j76811k51122k93693l15361l38631l91274
2574.9C57521896m91562o29539p60460q31680q25310p72171p22771p01332o94694o82869
2584.5C50409508o67687o69708o97021p31163p39594o99577o06995m70772l07312j39389
2594.2C44680290R728J26419K09579K61955K81220K65541K27318J96991K01301K37427
2603.8C46697769K69928K57492J86348P7629l4294j25580j85241k04430j78070j21460
$$ plain form
2535.4 375674782 374901695 374166336 373436317 372689667 371929932 371168404 370405045 369629936 368836861 368030319
2545 368030319 367224121 366439400 365700531 365024452 364411812 363852081 363338661 362869644 362431068 361986351
2554.6 361986351 361497307 360963211 360436783 359993019 359679718 359491806 359387207 359321785 359275322 359253311
2564.3 359253311 359268227 359316635 359367256 359371071 359288788 359111977 358860855 358567162 358251801 357913170 357521896
2574.9 357521896 357030334 356400795 355640335 354808655 353983345 353211174 352488403 351787071 351092377 350409508
2584.5 350409508 349741821 349072113 348375092 347643929 346904335 346204758 345597763 345126991 344819679 344680290
2594.2 344680290 344690018 344816437 345026016 345287971 345569191 345834732 346062050 346259041 346460342 346697769
2603.8 346697769 346967697 347225189 347411537 347489166 347454872 347329292 347144051 346939621 346761551 346640091
2613.5C46640091q0414j02463j91688k95983l46908l21808k61459k30027k56576l18985
2623.1C44233780l72963l91083l72734l35693l06282l12233l67470m53415n27344n58281
2632.8C40236282n56221n57747n80329o01273n85442n27305m55857m03137l80134l85170
2642.4C35203667m19655m80118n39627n60989n36385n04150n08995n49355n79109n63927
2652C29961357n25246n13496n47447n95894o22063o27517o43311o80046p12891p14645
2661.7C23778801o93054o77185o73294o51207n83229m88282m24499m37012n20801o35281
2671.3C17994957p41673q22734q75912r01852r10091r20487r48772r90658j024151
2680C09858627j034527j024913j008148r84517r39865q59642p44743o13899m92745
$$ plain form
2613.5 346640091 346559677 346457214 346265526 345969543 345622635 345300827 345039368 344809341 344552765 344233780
2623.1 344233780 343860817 343469734 343097000 342761307 342455025 342142792 341775322 341321907 340794563 340236282
2632.8 340236282 339680061 339122314 338541985 337940712 337355270 336827965 336372108 335968971 335588837 335203667
2642.4 335203667 334784012 334303894 333764267 333203278 332666893 332162743 331653748 331104393 330525284 329961357
2652 329961357 329436111 328922615 328375168 327779274 327157211 326529694 325886383 325206337 324493446 323778801
2661.7 323778801 323085747 322408562 321735268 321084061 320500832 320012550 319588051 319151039 318630238 317994957
2671.3 317994957 317253284 316430550 315554638 314652786 313742695 312822208 311873436 310882778 309858627
2680 309858627 308824100 307799187 306791039 305806522 304866657 304007015 303262272 302648373 302155628
2688.7C02155628l96671l17021k23922q8330Q5335K56043L81679M56181N08842N59655
2698.3C03377419N86643N45273M21409K56405J16520L9482N188m0169j36852k79236
2708C04892082m21505n17349n56145n61866n62020n59368n46246n34801n57709o28910
2717.6B99446163p15694p63054p50961p13845p01313p29656p76901q16059q37498q41770
2727.3B91799412q30307q11634q07801q34732q78105q98704q70228q07247p56569p58934
2736.9B83545151q24719r31072j035995j097947j094951j039009r67312r15241q94833
2745.6B74744072q97503r14497r45473r86633j019993j022301r86748r32693q88367
2754.3B66149864q67710q62446q58345q52337q54187q72211r04865r44691r85508j019936
$$ plain form
2688.7 302155628 301758957 301441936 301218014 301129684 301215019 301471062 301852741 302308922 302817764 303377419
2698.3 303377419 303964062 304509335 304930744 305187149 305303669 305343151 305348339 305308170 305171318 304892082
2708 304892082 304470577 303953228 303397083 302835217 302273197 301713829 301167583 300632782 300075073 299446163
2717.6 299446163 298730469 297967415 297216454 296502609 295801296 295071640 294294739 293478680 292641182 291799412
2727.3 291799412 290969105 290157471 289349670 288514938 287636833 286738129 285867901 285060654 284304085 283545151
2736.9 283545151 282720432 281789360 280753365 279655418 278560467 277521458 276554146 275638905 274744072
2745.6 274744072 273846569 272932072 271986599 270999966 269979973 268957672 267970924 267038231 266149864
2754.3 266149864 265282154 264419708 263561363 262709026 261854839 260982628 260077763 259133072 258147564 257127628
2763.9B57127628j032943j011506r67483r41868r72614j052799j128712j146755j101685
2772.6B47771263j036548r99775j005364j031990j047306j032162r91115r48620r31225
2781.3B38747158r43356r61856r60045r37786r17683r10149q97216q62942q31719q54873
2790.9B29669533r49288j062851j114235j069469r70554q91476q73947r00345r21860
2799.6B20915508q97884q20732p12223o02265n06763m21410l36208k53029j85490j40590
2809.2B16038914j12286r1514p5398o0215l3817P686M0722K8134l3341r1667q7090
2819.8B15530128k1057L7670K3137o4698j77765k92511m36801o36502q58478j027146
2829.5B12075977j102981j132736j213208j412162j713162k009010k127381j881847
$$ plain form
2763.9 257127628 256094685 255083179 254115696 253173828 252201214 251148415 250019703 248872948 247771263
2772.6 247771263 246734715 245734940 244729576 243697586 242650280 241618118 240627003 239678383 238747158
2781.3 238747158 237803802 236841946 235881901 234944115 234026432 233116283 232219067 231356125 230524406 229669533
2790.9 229669533 228720245 227657394 226543159 225473690 224503136 223611660 222737713 221837368 220915508
2799.6 220915508 220017624 219196892 218484669 217882404 217375641 216954231 216618023 216364994 216179504 216038914
2809.2 216038914 215926628 215835114 215759716 215699501 215665684 215673370 215714092 215742226 215708885 215617218 215530128
2819.8 215530128 215509071 215546741 215569878 215505180 215327415 215034904 214598103 213961601 213103123 212075977
2829.5 212075977 210972996 209840260 208627052 207214890 205501728 203492718 201365337 199483490
2837.2A99483490j161671k8953J258278K354374L001251L140297K883663K395782J807747
2845.9B15134258J213055O93245L14922R7676L700k7924l9463m2553l9539l8777m9533
2856.5B17219067o5174o7406m5395j1635M101j7510o4697j04847j16539j09978j13925
2867.1B16506062j40038j70212j82209j79386j89609k34299l07636l86544m51526m91886
2876.7B13772717m98505m74510m47369m58317n22213o07052o63566o81706o97994p48577
2886.4B07972908q27217q97751r41086r71222j002559j023732j014995r81045r48925
2895.1A99364376r29356q97140q21590p09782o09608n68752n98354o75030p71904q74539
2904.7A91908321r75570j061211j111832j113243j071014j011391r66930r50146r33418
$$ plain form
2837.2 199483490 198321819 198292866 199551144 201905518 204906769 208047066 210930729 213326511 215134258
2845.9 215134258 216347313 217040558 217355480 217453156 217456856 217428932 217389469 217346916 217307377 217268600 217219067
2856.5 217219067 217153893 217086487 217041092 217029457 217033558 217016048 216951351 216846504 216729965 216619987 216506062
2867.1 216506062 216366024 216195812 216013603 215834217 215644608 215410309 215102673 214716129 214264603 213772717
2876.7 213772717 213274212 212799702 212352333 211894016 211371803 210764751 210101185 209419479 208721485 207972908
2886.4 207972908 207145691 206247940 205306854 204335632 203333073 202309341 201294346 200313301 199364376
2895.1 199364376 198435020 197537880 196716290 196006508 195396900 194828148 194229794 193554764 192782860 191908321
2904.7 191908321 190932751 189871540 188759708 187646465 186575451 185564060 184597130 183646984 182713566
2913.4A82713566q64754p11899n02319l12862k16294k32734l30563m65069o08692p49283
2923A77719097q74786r75514j060352j156139j281872j422005j532287j574631j548901
2931.7A66292610j492462j450253j441116j440830j394253j251306j010418p31802
2939.4A56080170n05371l86620l60632l69396l79248m18730n40771p52392r82742j134892
2949.1A50249376j163702j103000j020995r55753r02996q55398q35772q79440r82437
2957.7A41549883j083403j109714j047278r62782r52568j060371j241255j402674j478614
2966.4A31211224j466151j396465j283636j113958q83570o31237m20542k87886k20327
2975.1A23507452j85757j74083j98841k57931l14036l18203k52914j46399m5414J4258
$$ plain form
2913.4 182713566 181848812 181136913 180634594 180321732 180105438 179872704 179542141 179077072 178468380 177719097
2923 177719097 176844311 175868797 174808445 173652306 172370434 170948429 169416142 167841511 166292610
2931.7 166292610 164800148 163349895 161908779 160467949 159073696 157822390 156811972 156080170
2939.4 156080170 155574799 155188179 154827547 154458151 154078903 153660173 153119402 152367010 151384268 150249376
2949.1 150249376 149085674 147982674 146961679 146005926 145102930 144247532 143411760 142532320 141549883
2957.7 141549883 140466480 139356766 138309488 137346706 136394138 135333767 134092512 132689838 131211224
2966.4 131211224 129745073 128348608 127064972 125951014 125067444 124436207 124015665 123727779 123507452
2975.1 123507452 123321695 123147612 122948771 122690840 122376804 122058601 121805687 121659288 121613874 121628132
2984.7A21628132K4433O027k413L0337R3212J33886J09053M0770K040L4056Q5983N8737
2996.3A22244253q7795k87294m38214n09929n60008o54602p94124r30147j032038j104889
3006A15845213j139574j075516q43124m48075K480L65810N57919N85155N08728L98560
3015.6A14757576L17745L21751M35409O24447Q04234R02004R15060R04627R23471R57528
3025.2A21863852R44652Q49075P07989N94073N37204M96588M19779L23448L02687M48799
3034.9A27488146P57913J118651J389837J490755J427994J257534J035328Q01535N88455
3043.6A37356148M26140L31382K94094K81287K58989K13814J59883J24493J24702J52226
3053.2A39723158J80054J76649J23043J8463j16892k47335l38927l88641m33521n18532
$$ plain form
2984.7 121628132 121652565 121658592 121656179 121686516 121779728 121913614 122022667 122063437 122065477 122099533 122185516 122244253
2996.3 122244253 122156458 121869164 121430950 120921021 120361013 119706411 118912287 117982140 116950102 115845213
3006 115845213 114705639 113630123 112786999 112338924 112341404 112707214 113265133 113850288 114359016 114757576
3015.6 114757576 115075321 115397072 115832481 116456928 117261162 118163166 119078226 119982853 120906324 121863852
3025.2 121863852 122808504 123657579 124365568 124959641 125496845 125993433 126413212 126736660 127039347 127488146
3034.9 127488146 128246059 129364710 130754547 132245302 133673296 134930830 135966158 136767693 137356148
3043.6 137356148 137782288 138113670 138407764 138689051 138948040 139161854 139321737 139446230 139570932 139723158
3053.2 139723158 139903212 140079861 140202904 140221367 140104475 139857140 139518213 139129572 138696051 138177519
3062.9A38177519o44694p52229p69911o86703n68876n05915n40209o49690p86553r18302
3072.5A31354437j033640j124725j185408j223106j259385j313028j379404j435194
3080.2A21400547j457539j444759j414995j392584j387081j386566j368809j329031
3087.9A10219183j294174j298552j337909j352978j271773j077451q28982o10580m62170
3096.6A00684614l63455k78272k04563j70250j94188k59370l27597l68690l73660l50828
3106.2I7793741l22418l28054m06752n61514p41138q71964r19084r14593r16720r45406
3115.9I0866098r68399r44109q71725p82604o96793o02636m89988l89805l59907m28829
3125.5H4331303n59311o77862p37095p43800p30209p14693o95262o75888o79584p23466
$$ plain form
3062.9 138177519 137532825 136780596 136010685 135323982 134755106 134249191 133708982 133059292 132272739 131354437
3072.5 131354437 130320797 129196072 128010664 126787558 125528173 124215145 122835741 121400547
3080.2 121400547 119943008 118498249 117083254 115690670 114303589 112917023 111548214 110219183
3087.9 110219183 108925009 107626457 106288548 104935570 103663797 102586346 101757364 101146784 100684614
3096.6 100684614 100321159 100042887 99838324 99668074 99473886 99214516 98886919 98518229 98144569 97793741
3106.2 97793741 97471323 97143269 96736517 96175003 95433865 94561901 93642817 92728224 91811504 90866098
3115.9 90866098 89897699 88953590 88081865 87299261 86602468 85999832 85509844 85120039 84760132 84331303
3125.5 84331303 83771992 83094130 82357035 81613235 80883026 80168333 79473071 78797183 78117599 77394133
3135.2G7394133p86176q14371p71408o79393o07839o10361o72960p22370o91710n79858
3144.8G0457687m53057l89185m16117m92258n40347n02877l74627j98822l4242P7362
3154.5F7133517J22710J13916P6914M3692M3383Q9459J70470K52342K96979K85745
3164.1F8629127K34189J89013K01569K92692M33183N59358O21834O22511O06313O17356
3173.8G3007145O62866P25650P95813Q85334J001925J125398J220317J272593J303176
3182.4H2000217J339484J379928J400271J398496J420422J526442J725359J946287
3190.1I4136906K093210K128763K110224K136707K263966K464742K662793K798566
3197.9A12795877K858220K863712K845287K823563K800922K756701K660188K498913
$$ plain form
3135.2 77394133 76607957 75793586 75022178 74342785 73734946 73124585 72451625 71729255 71037545 70457687
3144.8 70457687 70004630 69615445 69199328 68707070 68166723 67663846 67289219 67090397 67056155 67133517
3154.5 67133517 67256227 67370143 67447057 67490749 67534132 67623591 67794061 68046403 68343382 68629127
3164.1 68629127 68863316 69052329 69253898 69546590 69979773 70539131 71160965 71783476 72389789 73007145
3173.8 73007145 73670011 74395661 75191474 76076808 77078733 78204131 79424448 80697041 82000217
3182.4 82000217 83339701 84719629 86119900 87518396 88938818 90465260 92190619 94136906
3190.1 94136906 96230116 98358879 100469103 102605810 104869776 107334518 109997311 112795877
3197.9 112795877 115654097 118517809 121363096 124186659 126987581 129744282 132404470 134903383
3205.6A34903383K297383K103271J951771J848688J791153J789913J853457J956386
3213.3A50495405K037001K043056J978140J891422J821681J754360J638889J444550
3221A65104504J197147R68304Q26473P91721Q20942Q36067P78942O60382N57594N59578
3230.7A73101654O96106R11255J100197J172905J097450Q99792O38942L82557J87474
3239.3A80188332P7076K7694j8940j16787k76336m57764o04458o82888o99520o88381
3249A76748028o84719p06654p52029q08010q66280r29718j003189j073933j113415
3257.7A68810081j104984j069431j051197j070233j093444j066857r77859q76484q24299
3266.3A59675293q31299q49886q31880p76253p13635o53057n58462l87726j44205J16902
$$ plain form
3205.6 134903383 137200766 139304037 141255808 143104496 144895649 146685562 148539019 150495405
3213.3 150495405 152532406 154575462 156553602 158445024 160266705 162021065 163659954 165104504
3221 165104504 166301651 167269955 168096428 168888149 169709091 170545158 171324100 171984482 172542076 173101654
3230.7 173101654 173797760 174709015 175809212 176982117 178079567 178979359 179618301 180000858 180188332
3239.3 180188332 180265408 180293102 180274162 180157375 179881039 179423275 178818817 178135929 177436409 176748028
3249 176748028 176063309 175356655 174604626 173796616 172930336 172000618 170997429 169923496 168810081
3257.7 168810081 167705097 166635666 165584469 164514236 163420792 162353935 161376076 160499592 159675293
3266.3 159675293 158843994 157994108 157162228 156385975 155672340 155019283 154460821 154073095 153928890 154045792
3276A54045792L34196M88863O12087P51629R34477J151313J367932J550207J690502
3284.7A62926998J815872J965161K149467K333775K469158K544079K598762K674866
3292.4A81478138K757702K785721K728271K642651K633304K742463K895793K968312
3300.1B03632355K904911K764625K646370K584954K531719K431488K297725K197800
3307.8B23991947K173271K192002K183742K116738K027492J974220J971550J972676
3315.5B40603638J916694J789379J642228J553688J567363J657048J743622J754474
3323.2B54228134J678410J566524J477719J421222J358624J261291J156082J102314
3330.9B65250320J122609J170349J172352J099052R81865Q71162P91188P40852P19070
$$ plain form
3276 154045792 154379988 154868851 155480938 156232567 157167044 158318357 159686289 161236496 162926998
3284.7 162926998 164742870 166708031 168857498 171191273 173660431 176204510 178803272 181478138
3292.4 181478138 184235840 187021561 189749832 192392483 195025787 197768250 200664043 203632355
3300.1 203632355 206537266 209301891 211948261 214533215 217064934 219496422 221794147 223991947
3307.8 223991947 226165218 228357220 230540962 232657700 234685192 236659412 238630962 240603638
3315.5 240603638 242520332 244309711 245951939 247505627 249072990 250730038 252473660 254228134
3323.2 254228134 255906544 257473068 258950787 260372009 261730633 262991924 264148006 265250320
3330.9 265250320 266372929 267543278 268715630 269814682 270796547 271667709 272458897 273199749 273918819
3339.6B73918819P31049P64332P80010P38239O34308M99535L73382K80247K30560K31152
3349.3B79181633K77615L38783L63655L16582K07233P8583l3550j26992k18868l13702
3358.9B80070972l99589m75197n64785o91242q41103r67483j041069j083584j141033
3367.6B72865887j227455j319352j408176j531868j734715j994800k223854k356358
3375.3B59069309k424850k530270k738685l022194l302422l533993l732547l937569
3383B33846779m177857m473171m844494n294990n779591o217117o541386o741428o848755
3391.7A82927990o891766o871700o773453o584415o286831n842237n189782m268455
3399.4A34219351l043137j515054K83899K294664M438257O626549Q776798J0821085
$$ plain form
3339.6 273918819 274649868 275414200 276194210 276932449 277566757 278066292 278439674 278719921 278950481 279181633
3349.3 279181633 279459248 279798031 280161686 280478268 280685501 280764084 280730534 280603542 280384674 280070972
3358.9 280070972 279671383 279196186 278631401 277940159 277099056 276131573 275090504 274006920 272865887
3367.6 272865887 271638432 270319080 268910904 267379036 265644321 263649521 261425667 259069309
3375.3 259069309 256644459 254114189 251375504 248353310 245050888 241516895 237784348 233846779
3383 233846779 229668922 225195751 220351257 215056267 209276676 203059559 196518173 189776745 182927990
3391.7 182927990 176036224 169164524 162391071 155806656 149519825 143677588 138487806 134219351
3399.4 134219351 131176214 129661160 129945059 132239723 136677980 143304529 152081327 162902412
3407.1A62902412J2700043J4353752J5720082J6745548J7396679J7661838J7545166
3413.9B75025520J7066422J6264114J5199623J3950615J2600823J1229667R910927
3420.6C71247711Q700218P618218O636963N701637M779854L901481L144227K564735
3428.3D14295044K140350J784630J423569J063270P80564O48231O73332P98874R46198
3437D24554062J050186J065826R80492Q32520P03392O55403O60705O16646M50669K17018
3446.7D31786919O7367J08605K95219M72069N22804M62799L86276L45002L03001K07176
3456.3D34957237P6180j297M1618J75476K99149L29323K63328J62277Q7891N9700O2065
3466.9D36512947P6981J00288J36757J86348K39525K79617K89650K64473K26631K24228
$$ plain form
3407.1 162902412 175602455 189956207 205676289 222421837 239818516 257480354 275025520
3413.9 275025520 292091942 308356056 323555679 337506294 350107117 361336784 371247711
3420.6 371247711 379947929 387566147 394203110 399904747 404684601 408586082 411730309 414295044
3428.3 414295044 416435394 418220024 419643593 420706863 421487427 422135658 422808990 423607864 424554062
3437 424554062 425604248 426670074 427650566 428483086 429186478 429841881 430502586 431119232 431569901 431786919
3446.7 431786919 431854286 431962891 432258110 432730179 433252983 433715782 434102058 434447060 434750061 434957237
3456.3 434957237 435033417 435032120 435073738 435249214 435548363 435877686 436141014 436303291 436391182 436450882 436512947
3466.9 436512947 436589928 436690216 436826973 437013321 437252846 437532463 437822113 438086586 438313217 438537445
3476.6D38537445K91901L99818M56619L89367K31132J11847J36871K77939L98865L98140
3486.2D41629944L06091K38228K67105L62587M43764M62036M20723L45383K67982K26479
3495.8D44970322K49290L22266L85627L82691L06702J98097J11160R4414J78413L42140
3505.5D47541122M92402N13687L74031J67389K3117j7319r346K327M7646J63040L01132
3516.1D49599228L65524L31917K79770K84004L14407K92817K25105K11983L10440M31480
3525.7D52646675M19960K27966k7351j79100j52435J1596K23999M03443M85344M36630
3535.4D54496727K93427J61933J48621K77367M75769O32667O55442M95071J67503k10266
3545D57594261m34913l35694O3706N08384O86837M90799J16539j03875J4191L71551
$$ plain form
3476.6 438537445 438829346 439229164 439685783 440075150 440306282 440418129 440555000 440832939 441231804 441629944
3486.2 441629944 441936035 442174263 442441368 442803955 443247719 443709755 444130478 444475861 444743843 444970322
3495.8 444970322 445219612 445541878 445927505 446310196 446616898 446814995 446926155 447020569 447198982 447541122
3505.5 447541122 448033524 448547211 448921242 449088631 449111748 449094429 449085083 449087410 449135056 449298096 449599228
3516.1 449599228 449964752 450296669 450576439 450860443 451174850 451467667 451692772 451904755 452215195 452646675
3525.7 452646675 453066635 453294601 453267250 453088150 452935715 452947311 453171310 453574753 454060097 454496727
3535.4 454496727 454790154 454952087 455100708 455378075 455853844 456486511 457141953 457637024 457804527 457594261
3545 457594261 457159348 456823654 456887360 457395744 458082581 458573380 458689919 458586044 458600235 458971786
3554.7D58971786P05987Q23173P11517M83132K68783J70861K53791M80156O55060N18074
3564.3D64042320m997o36101r02557n44586K21519Q74939J046143P97081M74052L31917
3574D65699730L48587L64609L18451K82859L10288L40614L06816K80037M13170P03621
3583.6D69368782Q82835O40336n73n85441n97840L8796Q45146J208725R28650L46947
3593.2D73076363k1935N0202L96537P02019P80487O37360L78685J42364P4272K61383
3602.9D76477737O17981Q73948P64312K90299k18735l52669J450N14793O94733L73115
3612.5D80036964q3541j29586L47290Q31490P05414k7962o81152o06804J08185Q12950
3622.2D81313248J087722J132279J267853J298370O95458n60341j642800j643829n83496
$$ plain form
3554.7 458971786 459677773 460500946 461212463 461695595 461964378 462135239 462389030 462869186 463524246 464042320
3564.3 464042320 464037323 463401222 462498665 461954079 462175598 463050537 464096680 464893761 465367813 465699730
3574 465699730 466048317 466412926 466731377 467014236 467324524 467665138 467971954 468251991 468665161 469368782
3583.6 469368782 470251617 470891953 470891380 470305939 469708099 469746895 470592041 471800766 472729416 473076363
3593.2 473076363 473054428 473104630 473501167 474203186 474983673 475621033 475999718 476142082 476216354 476477737
3602.9 476477737 477095718 477969666 478733978 479024277 478805542 478452873 478454323 478969116 479663849 480036964
3612.5 480036964 479953423 479823837 480171127 481002617 481708031 481680069 480998917 480392113 480500298 481313248
3622.2 481313248 482400970 483533249 484801102 486099472 486794930 486234589 484591789 482947960 482364464
3630.9D82364464N84106R88388O57196K39601J51139K47230K50855J76086J94397K99912
3640.5D86153374L57628M10652O75888J159210J466904J157989K19155r23691j782646
3649.2D88894463k057305j611366n16357P45162J379242R24492j82571r29756p35932
3657.9D85910072P668M92744M06571R1820n8556j7243J14403L84636P39594P34062
3667.5D88805771l7804j157989j496811m63982J045265J412506Q9303j701012k260857
3676.2D84234390j206093L00408R63096O28739R1057O561L26958O56128P74345O72150
3685.8D87447739L32145k58178r06258j241035j029625m10614K24762N52291N17502
3694.5D85228729L07274J78948K55508M10233L68118p439n11436p49741n25741l7499
$$ plain form
3630.9 482364464 482948570 483936958 484594154 484833755 484984894 485232124 485482979 485659065 485853462 486153374
3640.5 486153374 486511002 486921654 487597542 488756752 490223656 491381645 491600800 490677109 488894463
3649.2 488894463 486837158 485225792 484709435 485454597 486833839 487758331 487575760 486646004 485910072
3657.9 485910072 485917740 486410484 486817055 486908875 486850319 486833076 486947479 487332115 488071709 488805771
3667.5 488805771 488767967 487609978 486113167 485649185 486694450 488106956 488196259 486495247 484234390
3676.2 484234390 483028297 483328705 484291801 484920540 485011597 485018158 485345116 486001244 486775589 487447739
3685.8 487447739 487779884 487521706 486615448 485374413 484344788 483934174 484158936 484711227 485228729
3694.5 485228729 485536003 485714951 485970459 486380692 486748810 486741371 486229935 485480194 484954453 484916954
3704.1D84916954L42674M36249L43781J91421q2893o01387j233368j541062j147995
3712.8D81624374j74751P68623J097985P72972K63939K7618Q5373J49231M3259j43090
3722.5D84515533k94532m55437o67725p48939m49219J64681O66008P01332L47709o8664
3732.1D83710747l96576p18537j034851j126747q33626k96325K22549O27365Q91877
3740.8D81045876P79571K861j201057j942482j481247j39885Q71963O75202l91770
3749.5D78219032j227798j160164m77982J40686M15574N32112O19201M77944q4648
3758.2D77453957q24318j163102p74078J6480N09033L29666j99661m47693j97602J27411
3767.8D74830093J0605n00717q41446o21528p3891K83165K78511J72691J61743P5035
$$ plain form
3704.1 484916954 485259628 485695877 486039658 486231079 486148186 485546799 484313431 482772369 481624374
3712.8 481624374 481449623 482218246 483316231 484089203 484353142 484380760 484466133 484615364 484658623 484515533
3722.5 484515533 484221001 483765564 483097839 482348900 481899681 482064362 482730370 483431702 483779411 483710747
3732.1 483710747 483314171 482595634 481560783 480434036 479600410 479304085 479526634 480153999 481045876
3740.8 481045876 481825447 481828308 480627251 478684769 477203522 477063637 477935600 478610802 478219032
3749.5 478219032 476991234 475831070 475353088 475493774 475909348 476441460 477060661 477538605 477453957
3758.2 477453957 476629639 475466537 474692459 474708939 475217972 475547638 475347977 474900284 474702682 474830093
3767.8 474830093 474840698 474339981 473498535 472877007 472803116 473086281 473364792 473537483 473699226 473774261
3777.4D73774261k92930p42684q17337l91502J07536J69983k22816o16799o08406k32353
3787.1D70126953J55983K57073O7825j59302j56402Q6288K59361N8556l69644m58145
3796.7D69868546R9563P68623N92957o38466j883240j842651m59709R00421R27658
3805.4D68333702k06108j152611r78966o9465O15578P44361O99196O79856L26233n43862
3815.1D68447914j270714r75494J79672Q88100J58806j387902k104301j178169M61616
3823.7D63219528J257019P38182j73034m25949J4610M02832K58636j50413k96478l6507
3833.4D64808426L26843M31862J52016l86391q99048j086502q53577m38919k17437
3842.1D61837273l06893m56466l77083p5302K54478N57633Q98094J081466N81093q70285
$$ plain form
3777.4 473774261 473481331 472738647 471921310 471529808 471637344 471807327 471584511 470967712 470359306 470126953
3787.1 470126953 470282936 470540009 470607834 470448532 470292130 470378418 470637779 470696335 470326691 469868546
3796.7 469868546 469968109 470736732 471329689 470691223 468807983 466965332 466505623 467406044 468333702
3805.4 468333702 468127594 466974983 465996017 465926552 466542130 467286491 467985687 468665543 468991776 468447914
3815.1 468447914 467177200 466201706 466381378 467269478 467428284 466040382 463936081 462757912 463219528
3823.7 463219528 464476547 465214729 465041695 464615746 464630356 465033188 465291824 465141411 464844933 464808426
3833.4 464808426 465135269 465567131 465719147 465332756 464433708 463347206 462493629 462054710 461837273
3842.1 461837273 461530380 461073914 460696831 460621529 460876007 461433640 462331734 463413200 463994293 463124008
3851.7D63124008k648048l494377k631112n80673J247406J818848J287003N90896L91235
3860.4D59105186N03541L34320k82097q19245o57844J23176P02248L55873o97098j443596
3870D57224464j150627j92871L68614K4033n80025m32510N64613J383705J041146k19994
3879.7D58030548j153107r00154O3324N13001j13259j101341j292686l76358P91015
3888.3D54460983J108589L35541p63092j237907q04482P4806P43371Q67881N07965
3897D55293655q5220o25572q69599p36770m17023k51121l97759o43883o26449k47498
3906.7D50392761J99776L50342J57547r0256j07651R5406K57950J50985k13585o09321
3916.3D50583954p87697o51550k96860P8506K99530K79847K8572l39432o03828n46532
$$ plain form
3851.7 463124008 460475960 456981583 454350471 453769798 455017204 456836052 458123055 458713951 459105186
3860.4 459105186 459608727 459943047 459660950 458841705 458183861 458307037 459009285 459365158 458668060 457224464
3870 457224464 456073837 455880966 456249580 456273613 455693588 455261078 455825691 457209396 458250542 458030548
3879.7 458030548 456877441 455977287 456040611 456553612 456440353 455339012 454046326 453669968 454460983
3888.3 454460983 455569572 455905113 455142021 453904114 453099632 453174438 453917809 454785690 455293655
3897 455293655 455208435 454582863 453713264 452976494 452559471 452308350 451910591 451266708 450640259 450392761
3906.7 450392761 450592537 450942879 451100426 451010170 450902519 450997925 451255875 451406860 451193275 450583954
3916.3 450583954 449796257 449144707 448847847 448926353 449225883 449505730 449534302 449194870 448591042 448044510
3926D48044510j51329L00941M32053J13029m05044p30667o82450l90014j13640j7357
3935.6D46400032q3160j54610n7259K28386M86222M32090L6354l87382n02167l15475
3945.2D46083031j23787j15433j77498j40495n0583o8092j86043k34451j50948p1487
3954.9D44764214j02540j57966j21803n4818r2277k09732k52228j78299j13296j41449
3964.5D43339806k04735k56729l56942n03730n30777l35350r6360o0730j77345j92642
3974.2D40624466r1438j30005l56522m38957k00577j1062k62299o75240o54602k63786
3983.8D37539978k07405o88782j003914p26242n72777j223526j844406j198921j58157
3992.5D29915848j141548m034272m852485j605530j099091j5425300m7937737q3940849
$$ plain form
3926 448044510 447893181 448194122 448626175 448739204 448334160 447603493 446921043 446531029 446417389 446400032
3935.6 446400032 446316872 446162262 446105003 446333389 446819611 447251701 447288055 446900673 446398506 446083031
3945.2 446083031 445959244 445843811 445666313 445525818 445475235 445407143 445221100 444986649 444835701 444764214
3954.9 444764214 444661674 444503708 444381905 444327087 444234810 444025078 443772850 443594551 443481255 443339806
3964.5 443339806 443135071 442878342 442521400 442017670 441486893 441151543 441055183 440994453 440817108 440624466
3974.2 440624466 440533028 440403023 440046501 439607544 439406967 439395905 439133606 438458366 437803764 437539978
3983.8 437539978 437332573 436643791 435639877 434913635 434340858 433117332 431272926 430074005 429915848
3992.5 429915848 428774300 424740028 419887543 418282013 417182922 401757622 353819885 269879036
4000.2B69879036
$$ plain form
4000.2 269879036
##END=$$ End of the data block
