##TITLE=$$ Begin of the data block
##JCAMP-DX=5.00 $$ ACD/SpecManager v 10.08
##SPECTROMETER/DATA SYSTEM=Varian
##DATE=30 Apr 2013 14:38:06
##DATA TYPE=INFRARED SPECTRUM
##DATA CLASS=XYDATA
##ORIGIN=
##OWNER=
##NPOINTS=3735
##FIRSTX=399.26403809
##LASTX=4000.35498047
##MAXX=4000.35498047
##MINX=399.26403809
##MAXY=69.20126343
##MINY=13.84301376
##XFACTOR=1.0000000000
##YFACTOR=0.000000100000000
##FIRSTY=39.70742416
##DELTAX=0.96440572
##XUNITS=1/CM
##YUNITS=TRANSMITTANCE
##XYDATA=(X++(Y..Y))
399.3C97074242J21429023O3215065J2710572p939682o632805l668785q060646j3783532
407E54343452j3501930q690491n595321o311951p312660n162125o57921K928772L913727
415.7E13953552L733139N177193R542046J5101242J8257331J6780015J2175407Q372993
423.4F03092918P801285R230690R763870Q249474N982780M497300L807449L042831
431.1F55468597J881028O90689k55890j008225j504135j497268r74503k49863L93143
439.8F52943573P69577M83933q97065l030624m565659m288406k487793q10204o97517
448.4F37419815k211227m342232o048050o810455o613083n872879n345154n672684
456.2E94504051o830711q158264q994713r088211q288651o139106k240258K845154
$$ plain form
399.3 397074242 518503265 581718330 594428902 586489220 579856415 576187630 568126984 554343452
407 554343452 540841522 532151031 526555710 520243759 512931099 507768974 507111053 510039825 513953552
415.7 513953552 517686691 522863884 532405930 547507172 565764503 582544518 594719925 603092918
423.4 603092918 610894203 620124893 629888763 638138237 644121017 648618317 652425766 655468597
431.1 655468597 657349625 658040314 657784424 656776199 655272064 653774796 652800293 652550430 652943573
439.8 652943573 653713150 654197083 653300018 650269394 645703735 641415329 638927536 638117332 637419815
448.4 637419815 635208588 630866356 624818306 618007851 611394768 605521889 600176735 594504051
456.2 594504051 587673340 579515076 570520363 561432152 553143501 547004395 544764137 547609291
463.9E47609291P331581R259682Q019180M796562J424599j195717l455772n953140
471.6E67836266q425217j0079651j0791626j1395721j2497826j3404884j2854462j0872154
479.3D77514725r385872j0616379j4977989k0731430k5424729k7328071k5720177k0584602
487C22745476j2530232k797622P050590J5437489K0658493K0911407J5325775N448189
494.7C92249565m635811j0373955r420394k592011P340050J7407265K5310745K9585800
502.5D44871254K9862442K7117653K3180427J9546357J6592331J3951606J1469422
509.2E86591492R566002Q690147Q656120Q681145Q051186O675186N043678L761826
516.9F45716782L137741L085251L260726L256455K783356J836700P54700M4784J1750
$$ plain form
463.9 547609291 554940872 564200554 572219734 577016296 578440895 577245178 573789406 567836266
471.6 567836266 559411049 549331398 538539772 527144051 514646225 501241341 488386879 477514725
479.3 477514725 468128853 457512474 442534485 421803055 396378326 369050255 343330078 322745476
487 322745476 310215244 307417622 314468212 329905701 350564194 371475601 386801376 392249565
494.7 392249565 387613754 377239799 367819405 365227394 372567444 389974709 415285454 444871254
502.5 444871254 474733696 501851349 525031776 544578133 561170464 575122070 586591492
509.2 586591492 596157494 604847641 613503761 622184906 630236092 636911278 641954956 645716782
516.9 645716782 648854523 651939774 655200500 658456955 661240311 663077011 663831711 663876495 663888245
525.6F63888245M81643R03168P86057P4539q71887j608582j880875j645279r83123
534.3F59143906j21155N24902N25742j80893j096649j482849r87549L2654Q18481Q33740
543.9F58010330J06812r31015j806107k213058k053910j474151q65937o69097j010819
552.6F47093048j536102j666947j070938R9488J363220K229156K422562J983566J272736
561.3F52189789Q10089R18503J441726J861496J773301J233520O24847K41318P9575
570F61174164J221m1810k0752M273j42593n62592j095886j362992j012802p782J254959
580.6F58187408K103730K019272J060257j13678p40586n76553l9978K54288O8359l56293
590.2F61866226o67419p41654o47506m17405j8615M56009P07168M66232j85317q11310
$$ plain form
525.6 663888245 664369888 665273056 666059113 666133652 665261765 663653183 661772308 660127029 659143906
534.3 659143906 659022751 659547653 660073395 659892502 658795853 657313004 656325455 656358109 657176590 658010330
543.9 658010330 658117142 657186127 655380020 653166962 651113052 649638901 648772964 648103867 647093048
552.6 647093048 645556946 643889999 642819061 642918549 644281769 646510925 648933487 650917053 652189789
561.3 652189789 652999878 653918381 655360107 657221603 658994904 660228424 660853271 661094589 661174164
570 661174164 661175385 661133575 661112823 661117096 660974503 660411911 659316025 657953033 656940231 656932449 658187408
580.6 658187408 660291138 662310410 663370667 663256989 662516403 661939850 661899872 662154160 662222519 661866226
590.2 661866226 661198807 660457153 659809647 659392242 659373627 659829636 660536804 661003036 660817719 660006409
599.9F60006409r77326o16989n2872L01361K38419j70059o94809j091614j197586r89914
609.5F54755020o13556l15323k86407n18189p96585q52508n60608m2343M11224N57404
619.2F51738129L88870J15662m7837o3400k4109J7395P6981J00555o7215m80041r53141
629.8F50801849j278839j514740j819916k002258j633911r60236j374359m160690q356400
638.4F27700500j0424957p055778J289215J0007553J4039116J2040176O918106K606812
646.2F57120743P83691N72891N64118L49579K62985M23965N20096K90756j75781o26449
655.8F60086594q77381q40530n35507j63269l205j23443l14637m36096o85196j280288
665.4F54827042j908951j801911n67932J174469K234879J961365P96661k73209o69250
$$ plain form
599.9 660006409 659029083 658412094 658359222 658660583 658899002 658728943 658034134 656942520 655744934 654755020
609.5 654755020 654141464 653826141 653539734 653021545 652224960 651372452 650811844 650769501 651180725 651738129
619.2 651738129 652126999 652242661 652194824 652131424 652107315 652124710 652201691 652302246 652235031 651754990 650801849
629.8 650801849 649523010 648008270 646188354 644186096 642552185 641591949 640217590 636056900 627700500
638.4 627700500 617275543 610219765 611508980 621516533 635555649 647595825 654513931 657120743
646.2 657120743 657904434 658477325 659041443 659391022 659654007 660077972 660598068 660888824 660713043 660086594
655.8 660086594 659209213 658368683 657833176 657669907 657666702 657543259 657228622 656792526 656107330 654827042
665.4 654827042 652918091 651116180 650548248 651722717 653957596 655918961 656715622 656442413 655773163
674.1F55773163n55344m07638m80805p11746r60617j184235j389084j522445j466904
682.8F47094345j156998o98776l63388l94058p69425j220321j576691k075844l133697
691.5F35705147m662476n708351n039329k287484J507645M590225N775719N122223
699.2F35003319L515548J819420M61045m17786p38106n25398l9139L08418K08664l73916
708.8F39222069j239205k096176k700386k957001k960548k898216k858429k742806
716.6F18769302k399978j828652j195488o63643k97775j99547o51970j919212l754425
725.2F05858612n146179m783707k046623K299423O411896Q542595Q146095O055107
733F25337219L681832K026100J267128J041755R28231O85043K43988l28789q44612
$$ plain form
674.1 655773163 655217819 654810181 654329376 653617630 652657013 651472778 650083694 648561249 647094345
682.8 647094345 645937347 645238571 644875183 644481125 643711700 642491379 640914688 638838844 635705147
691.5 635705147 631042671 625334320 620294991 618007507 619515152 624105377 629881096 635003319
699.2 635003319 638518867 640338287 640799332 640381546 639643440 639118042 639078903 639387321 639595985 639222069
708.8 639222069 637982864 635886688 633186302 630229301 627268753 624370537 621512108 618769302
716.6 618769302 616369324 614540672 613345184 612681541 612383766 612184219 611532249 609613037 605858612
725.2 605858612 600712433 595928726 593882103 596181526 602593422 611136017 619282112 625337219
733 625337219 629019051 631045151 632312279 633354034 634282265 634967308 635211296 634882507 634037895
741.6F34037895j080208r60998o48804m17480m41361p19833j165352j682396k148323
750.3F24773140k400818k341194k056618j775703j653862j611824j404114q43163L2692
759F10718536R64737J607743J698989J191521K83432o97098j481437j975632k256393
767.7F10054398k545166l201828m542542o368561p583770o574784k463913L741112
775.4E80514946R370422J1813889J0341225O408004K294846n32189j957435k588120
783.1F15665588k966652l351860l900146m738007n834007o969986p936249q724136
790.8E71244545r507866j0492859j1810150j3480301j5389595j7332382j9186096k1051674
798.5D52993622k3089943k5093994k6248551k5420265k1752052j5027847n654469N408363
$$ plain form
741.6 634037895 632957687 631996689 631347885 630930405 630489044 629769211 628603859 626921463 624773140
750.3 624773140 622372322 620031128 617974510 616198807 614544945 612933121 611529007 610685844 610718536
759 610718536 611683273 613291016 614990005 616181526 616464958 615767860 614286423 612310791 610054398
767.7 610054398 607509232 604307404 599764862 593396301 585812531 579237747 576773834 580514946
775.4 580514946 589885368 601699257 612040482 618448486 620743332 620211143 618253708 615665588
783.1 615665588 612698936 609347076 605446930 600708923 594874916 587904930 579968681 571244545
790.8 571244545 561736679 551243820 539433670 525953369 510563774 493231392 474045296 452993622
798.5 452993622 429903679 404809685 378561134 353140869 331388817 316360970 310706501 316114864
806.2C16114864J6550732K5598869L0533600L0578804K6744080K1219787J6079865
813D83420601J2337112R940224Q400497P367745O781006O667137O855812O894379O328010
821.7E54992523N188675M177857M160652N312996O805687P477150O870498N564461
829.4F00550499M509811M162712M314957M607849M980278N571823O352539P014275
837.1F42064743P216644O845551O030350N004959M007873L245316K826843K681503
844.8F79923782K575226K277527J744690J152649P36389N93948O26374O58874N98908
853.5F90888367M79202L58887K32391N3787j71051l56598m25872l92685l43171l36990
863.1F89986267l53699l33404k46735j18942j907O2103N9814O256o5689j27563j70746
$$ plain form
806.2 316114864 332665596 358264465 388798065 419376869 446120949 467340736 483420601
813 483420601 495757713 505697937 514098434 521466179 528247185 534914322 541770134 548664513 554992523
821.7 554992523 560181198 564359055 568519707 573832703 580638390 588115540 594986038 600550499
829.4 600550499 605060310 609223022 613537979 618145828 623126106 628697929 635050468 642064743
837.1 642064743 649281387 656126938 662157288 667162247 671170120 674415436 677242279 679923782
844.8 679923782 682499008 684776535 686521225 687673874 688410263 689004211 689630585 690289459 690888367
853.5 690888367 691367569 691726456 691958847 692012634 691841583 691484985 691059113 690666428 690323257 689986267
863.1 689986267 689632568 689299164 689052429 688933487 688931580 688993683 689053497 689059753 688994064 688866501 688695755
873.8F88695755k00500k24915k51465k95944l66745m35715m30374k81906N722L34015
883.4F86547928N64575O17065N29328M31518M43879N74340P02668O76269M45481J17569
893F91650620j23749j61362k6169J48087K35519J91345M5090j45721l19290m08021
902.7F91086349l62091k01873l8224r918j72882m43039o55289o78863n00336k29263
912.3F87794571m3182r4986m04740q09631j052323r73968o53229l44543k68250m53033
922F82696686p55768j003342j098098j029053q41980o27976n23147o65436j098785
930.7F75053101j689454k160720k274628k043915j758423j746750k060470k397156
938.4F58921585k358017j801071r57413k44674J6861k43760q85849j697921k546006
$$ plain form
873.8 688695755 688495255 688270340 688018875 687722931 687356186 686920471 686490097 686208191 686213913 686547928
883.4 686547928 687112503 687729568 688258896 688690414 689134293 689708633 690411301 691087570 691533051 691650620
893 691650620 691526871 691365509 691339340 691487427 691722946 691914291 691959381 691813660 691494370 691086349
902.7 691086349 690724258 690522385 690484161 690474243 690301361 689858322 689203033 688524170 688023834 687794571
912.3 687794571 687751389 687656403 687251663 686442032 685389709 684415741 683762512 683417969 683149719 682696686
922 682696686 681940918 680937576 679839478 678810425 677968445 677340469 676817322 676151886 675053101
930.7 675053101 673363647 671202927 668928299 666884384 665125961 663379211 661318741 658921585
938.4 658921585 656563568 654762497 653805084 653560410 653577271 653333511 652447662 650749741 648203735
947.1F48203735l437805m433594n453567o143456n959854m464225j659966J824303
954.8F18475571M886093O481170O275254M845962L105927J436920m65775k721481m401588
963.4F37918053l972664q96492L356895O239472O232452L990479J444778n341l38821
972.1F53968811l00217m07638o81381j022873j488877k136230k801209l170547l069420
980.8F38890419k627678k186699k064590k354775k888908l367005l570175l497696
988.5F16332893l332405l293991l493728l863831m167976m094544l413582k114334
996.2E88558502m32243J247253K543831L232803L343010L122445K850761K640495K405320
1004.9F09512177K003860J364555N02015m81492j367492j924935k183761k524643l304749
$$ plain form
947.1 648203735 644765930 640332336 634878769 628735313 622775459 618311234 616651268 618475571
954.8 618475571 623361664 629842834 636118088 640964050 644069977 645506897 645041122 642319641 637918053
963.4 637918053 633945389 633048897 636405792 642645264 648877716 652868195 654312973 654307632 653968811
972.1 653968811 653668594 653260956 652579575 651556702 650067825 647931595 645130386 641959839 638890419
980.8 638890419 636262741 634076042 632011452 629656677 626767769 623400764 619830589 616332893
988.5 616332893 613000488 609706497 606212769 602348938 598180962 594086418 590672836 588558502
996.2 588558502 588126259 589373512 591917343 595150146 598493156 601615601 604466362 607106857 609512177
1004.9 609512177 611516037 612880592 613382607 612901115 611533623 609608688 607424927 604900284 601595535
1013.6F01595535m438476n624657p036591r274520j2063294j3179779r629326p24335
1021.3E39624557J0103455J7301636J7562942J2304650N896530J738510J66855m03061
1029F04296074j192398k197914k958489l370399l603058l660889l398437k871819k407036
1037.7E78635635k257347k316208k226066j709366p66335L69187J389847K058868K297020
1046.4E75475235K190132J924172J684761J571846J555786J490478J215668P04536
1054.1E87812614J25695k71683l62816k44484j34964j93786m31443p45697j010856
1062.8E84542580j144028j129379j013565q76542p98225q34618r91821j202507j336479
1071.5E75215416j285553j073647q73031q79288j153412j567459j904068j993790j788635
$$ plain form
1013.6 601595535 597157059 591532402 584495811 575221291 563157997 549978218 540348892 539624557
1021.3 539624557 549728012 567029648 584592590 596897240 602793770 604532280 604699135 604296074
1029 604296074 603103676 600905762 597947273 594576874 590973816 587312927 583914490 581042671 578635635
1037.7 578635635 576378288 574062080 571836014 570126648 569360313 569729500 571119347 573178215 575475235
1046.4 575475235 577665367 579589539 581274300 582846146 584401932 585892410 587108078 587812614
1054.1 587812614 587938309 587666626 587303810 587059326 586924362 586730576 586299133 585553436 584542580
1062.8 584542580 583398552 582269173 581255608 580379066 579580841 578746223 577754402 576551895 575215416
1071.5 575215416 573929863 572856216 571983185 571103897 569950485 568383026 566478958 564485168 562696533
1080.1E62696533j348648p86438k23121K37655N26390O24047N80215M95872M47884
1088.8E63250389M04854K28119k03552q53463j526832k028008k322578k549019k885361
1097.5E51514549l415603m090271m744110n100632m808388l608780j604004O21567
1105.2E24764328K252884K765312K268334J321907M09927l91197j266175k339477l622818
1113.9E26163025n167923o955071q440818q412323n760918p15065M774590Q191566
1121.6E03677063Q252602N697250K409248j27411j586837k382508k882576l125991
1129.3E09930840l059655k745590k266159j560097m88090R41009K471733L754197M577102
1138E11555290M955254N031509M928894M686394M299545L782425L182831K559433J966705
$$ plain form
1080.1 562696533 561347885 560561447 560338326 560575981 561102371 561726418 562306633 562802505 563250389
1088.8 563250389 563655243 563883362 563679810 562826347 561299515 559271507 556948929 554399910 551514549
1097.5 551514549 548098946 544008675 539264565 534163933 529355545 525746765 524142761 524764328
1105.2 524764328 527017212 529782524 532050858 533372765 533782692 533391495 532125320 529785843 526163025
1113.9 526163025 520995102 514040031 505599213 497186890 491425972 490710907 495485497 503677063
1121.6 503677063 511929665 517626915 520036163 519908752 518321915 515939407 513056831 509930840
1129.3 509930840 506871185 504125595 501859436 500299339 499811249 500752258 503223991 506978188 511555290
1138 511555290 516510544 521542053 526470947 531157341 535456886 539239311 542422142 544981575 546948280
1146.7E46948280J454201J055298P51839M69780J37214k48604o21261r09004j080590
1155.4E47957153j131515j069641r43604q61549r35059j189575j540565j858712k034492
1164E36392441k007599j797829j536178j405297j475753j612893j610412j415901j172524
1172.7E22358055j046295j113052j447297k151603l099480l679390l080330j085014
1180.4E05655594J450462L108330L036385J594200p7782j036491j101532o63567j82953
1189.1E11782646Q3885M6387l15704r32465j602821k089386k337723k595291l210640
1197.8D98828888m247894n367699o202660o802063p434578p811317o766739l205223
1205.5D50990715K403069P708206J0032768Q423462M230957j32942k799912l044052
$$ plain form
1146.7 546948280 548402481 549457779 550209618 550679398 550816612 550568008 549946747 549037743 547957153
1155.4 547957153 546825638 545755997 544812393 543950844 543015785 541826210 540285645 538426933 536392441
1164 536392441 534384842 532587013 531050835 529645538 528169785 526556892 524946480 523530579 522358055
1172.7 522358055 521311760 520198708 518751411 516599808 513500328 509820938 506740608 505655594
1180.4 505655594 507106056 510214386 513250771 514844971 514767189 513730698 512629166 511965599 511782646
1189.1 511782646 511866531 511912918 511597214 510664749 509061928 506972542 504634819 502039528 498828888
1197.8 498828888 494580994 489213295 483010635 476208572 468773994 460962677 454195938 450990715
1205.5 450990715 453393784 461101990 471134758 479558220 483789177 483656235 480856323 477812271
1213.2D77812271j029014K421608N878829P784272P401352N334358K924385J099510
1220.9E09627571j25694j154976k120667k805519l045616k962379k793808k658539
1228.6D91960373k551498k453194k334862k101478j633988r15375p8354O85921J237297
1237.3D81814842J520691J559525J452179J338386J303444J298523J179504Q43926
1245D92311020L32298j96075n74036p19490o70624n56602n26505o63452r33838j207809
1254.7D86594887j341019j248283r33571m75083J5717M43459P75795J058273J377869
1263.4D86268044J791992K272377K698021K906532K771645K281913J572228Q72764
1271.1E03435516L81928J38130p095k75307p94601j508790k231941k782020l079644
$$ plain form
1213.2 477812271 476783257 479204865 485083694 492867966 500269318 505603676 508528061 509627571
1220.9 509627571 509501877 508346901 506226234 503420715 500375099 497412720 494618912 491960373
1228.6 491960373 489408875 486955681 484620819 482519341 480885353 479969978 479891624 480577545 481814842
1237.3 481814842 483335533 484895058 486347237 487685623 488989067 490287590 491467094 492311020
1245 492311020 492643318 492447243 491873207 491153717 490483093 489926491 489399986 488736534 487802696 486594887
1254.7 486594887 485253868 484005585 483072014 482596931 482612648 483056107 483831902 484890175 486268044
1263.4 486268044 488060036 490332413 493030434 495936966 498708611 500990524 502562752 503435516
1271.1 503435516 503817444 503955574 503948479 503673172 502878571 501369781 499137840 496355820 493276176
1279.8D93276176l162422l144302l159294l301544l560448l802490l842888l565750
1287.5D65737038k987671k206993j308403l35160O54106J540947K188302K527275K590942
1296.2D68400383K457733K181511J777001J265296P08886J87797k62832o99234j246682
1304.8D74769859k008934k964744l936158m674148n001373m903756m503326l960304
1312.5D42817116l400765k909279k548332k348442k280159k250786k148132j912575
1320.3D23018646j580391j257209j018219p94030l76396M04244J439285K288551K440987
1328.9D24565468J707725M08173q27942j471672j374359p40776R8038R01603J594963
1337.6D24861221K218285K818565L359909L723870L798217L576355L167458K709160
$$ plain form
1279.8 493276176 490113754 486969452 483810158 480508614 476948166 473145676 469302788 465737038
1287.5 465737038 462749367 460542374 459233971 458898811 459552917 461093864 463282166 465809441 468400383
1296.2 468400383 470858116 473039627 474816628 476081924 476790810 476978607 476715775 476016541 474769859
1304.8 474769859 472760925 469796181 465860023 461185875 456184502 451280746 446777420 442817116
1312.5 442817116 439416351 436507072 433958740 431610298 429330139 427079353 424931221 423018646
1320.3 423018646 421438255 420181046 419162827 418368797 417992401 418396645 419835930 422124481 424565468
1328.9 424565468 426273193 426681366 425853424 424381752 423007393 422266617 422364655 423266258 424861221
1337.6 424861221 427079506 429898071 433257980 436981850 440780067 444356422 447523880 450233040
1345.3D50233040K285385J926918J656990J492653J395836J263580J002655O14662
1353.1D61871719J91765j69182m34875o20804p51381q66203j043549j362571j794014
1361.7D55020905k160302k268066k115975j941604k012215k360039k765159l016968
1369.4D36380577l145714l346290l686600l983727m013977l799934l608742l670997
1377.2D07124596l968468m318695m572296m624863m274597l240662j462707O37893
1384.9C81300201K321320L044205K835998K168427J487388Q96302K49519n31960j294212
1393.6C92477188j789894j927910j854744j790695j807442j798095j662903j481400
1401.3C78364105j447296j631813j870689j934090j774025j543961j372528j197548
$$ plain form
1345.3 450233040 452518425 454445343 456102333 457594986 458990822 460254402 461257057 461871719
1353.1 461871719 462063484 461894302 461459427 460838623 460087242 459221039 458177490 456814919 455020905
1361.7 455020905 452860603 450592537 448476562 446534958 444522743 442162704 439397545 436380577
1369.4 436380577 433234863 429888573 426201973 422218246 418204269 414404335 410795593 407124596
1377.2 407124596 403156128 398837433 394265137 389640274 385365677 382125015 380662308 381300201
1384.9 381300201 383621521 386665726 389501724 391670151 393157539 394053841 394303360 393771400 392477188
1393.6 392477188 390687294 388759384 386904640 385113945 383306503 381508408 379845505 378364105
1401.3 378364105 376916809 375284996 373414307 371480217 369706192 368162231 366789703 365592155
1409C65592155q70018l75099J32904N01519P00874P46879O02417K62681r2202j68152
1418.6C67033958J31302N10292N09682m6005q64487j469498j636810j525001j427651
1427.3C61215782j466026j526451j439362j173820q80967p88688j029854j516113j956597
1436C49437904k060699j794357j440888j352005j609382j953927k076034j949425j821937
1444.7C33379250j892624k072525k113076j917381j631012j424141j283378j100998
1452.4C19944115r12838r08356j137352j291027r18903P8048J219254J799583J495209
1461.1C19367733O12793k51904p46002r31778j023636j107578j184330j379280j909943
1469.7C11446075k776699l596744l903275l628864l197823l087348l370591l751468
$$ plain form
1409 365592155 364722137 364347038 364479942 364981461 365682335 366429214 367031631 367294312 367202110 367033958
1418.6 367033958 367165260 367675552 368185234 368139229 367274742 365805244 364168434 362643433 361215782
1427.3 361215782 359749756 358223305 356783943 355610123 354729156 353940468 352910614 351394501 349437904
1436 349437904 347377205 345582848 344141960 342789955 341180573 339226646 337150612 335201187 333379250
1444.7 333379250 331486626 329414101 327301025 325383644 323752632 322328491 321045113 319944115
1452.4 319944115 319031277 318122921 316985569 315694542 314775639 314853687 316072941 317872524 319367733
1461.1 319367733 319980526 319728622 318982620 318050842 317027206 315919628 314735298 313356018 311446075
1469.7 311446075 308669376 305072632 301169357 297540493 294342670 291255322 287884731 284133263
1477.5B84133263l977070m081574m210338m351292m363823m220123m088936m135780
1485.2B50704327m334412m534817m649410m677906m578476m254150l745003l351345
1492.9B16578808l418636l960400m578533m834595m656277m297466l936787l482265
1500.6A83413849k859249k366295k511406l428574m607257n339871n377941n018416
1508.3A51904840m588775m050017l143644j692266M37345L481751P474918J1677866
1516A61502018J4646511J5261135J3732338J1376572R337253P687569N829430L520393
1523.7B42893219J239185l85093j196823j467267j429691j060524k55585R75857K505150
1532.4B41818428M106255N391101N853672N194588L693237K174969J466274J772252
$$ plain form
1477.5 284133263 280156193 276074619 271864281 267512989 263149166 258929043 254840107 250704327
1485.2 250704327 246369915 241835098 237185688 232507782 227929306 223675156 219930153 216578808
1492.9 216578808 213160172 209199772 204621239 199786644 195130367 190832901 186896114 183413849
1500.6 183413849 180554600 178188305 175676899 172248325 167641068 162301197 156923256 151904840
1508.3 151904840 147316065 143266048 140122404 138430138 138867483 142349234 149824152 161502018
1516 161502018 176148529 191409664 205142002 216518574 225855827 233543396 239372826 242893219
1523.7 242893219 244132404 243747311 242550488 241083221 239653530 238593006 238337421 239313278 241818428
1532.4 241818428 245924683 251315784 257169456 262364044 266057281 268232250 269698524 271470776
1540.1B71470776K544574K986489K729053K045822J446419J131096R13372O10085L18946
1548.8B86196632K17991K31362J16157j46980l07522l08647n51510j384449k374325
1557.5B81688709k465706j093673J034450K533379K696476K065105J649418J854324
1565.2B89962482K312012K553597K523288K425080K330208K112693J646061R19247
1572.9C06784668O428r21955j574288j699180j359845r53388q46405j016712j128235
1581.6B97291088r29794m80423J4725M68273R44366J502838K121697K753792L362121
1590.3C07048683L869362M142513M090443L746796L212928K545968J753540Q89625
1598C31299858Q5869n46150j001473j338920j581879j705246j707916j652031j622544
$$ plain form
1540.1 271470776 274015350 277001839 279730892 281776714 283223133 284354229 285267601 285877686 286196632
1548.8 286196632 286414623 286645985 286762142 286615162 286307640 285998993 285447483 284063034 281688709
1557.5 281688709 279223003 278129330 279163780 281697159 284393635 286458740 288108158 289962482
1565.2 289962482 292274494 294828091 297351379 299776459 302106667 304219360 305865421 306784668
1572.9 306784668 306791096 305869141 304294853 302595673 301235828 300282440 299436035 298419323 297291088
1581.6 297291088 296361294 295880871 295895596 296363869 297308235 298811073 300932770 303686562 307048683
1590.3 307048683 310918045 315060558 319151001 322897797 326110725 328656693 330410233 331299858
1598 331299858 331385727 330839577 329838104 328499184 326917305 325212059 323504143 321852112 320229568
1606.7C20229568j682415j865825k161102k475491k670040k699719k695770k817116
1614.4C01162090k991142k886372k230186j142654o0883O91261J200524J787357K581921
1623.1B98111916L353061L760433L702240L381749L085518K958946K987957L142013
1630.8C24483833L517456M358025N902557Q114548J0503845J2297287J2938576J2499046
1638.5C94615173J1575241J0743332J0115662R423447Q446502P293892O307373N785713
1646.2D64306335N786210O053772O084671N416145M066658K700767K165375K714005
1653.9D99293938L732872M320755M103546L402939K696609K130051J632461J306382
1661.6E22619553J450080K159424L055992L522263L199120K260589J274529Q04748
$$ plain form
1606.7 320229568 318547153 316681328 314520226 312044735 309374695 306674976 303979206 301162090
1614.4 301162090 298170948 295284576 293054390 291911736 291850853 292542114 293742638 295529995 298111916
1623.1 298111916 301464977 305225410 308927650 312309399 315394917 318353863 321341820 324483833
1630.8 324483833 328001289 332359314 338261871 346376419 356880264 369177551 382116127 394615173
1638.5 394615173 406190414 416933746 427049408 436472855 444919357 452213249 458520622 464306335
1646.2 464306335 470092545 476146317 482230988 487647133 491713791 494414558 496579933 499293938
1653.9 499293938 503026810 507347565 511451111 514854050 517550659 519680710 521313171 522619553
1661.6 522619553 524069633 526229057 529285049 532807312 536006432 538267021 539541550 540346298
1669.4E40346298J030922J625633K023201J907540J465606J125260J076660J148186
1677.1E51749306J134529J059913R97811P81746J60560p12356j170655o42890O56623
1685.8E54014587J807709K034836J423302P52296O51817J001091J159516P43866J03225
1694.4E63692245m1503N74646J386184J566658R56040K72064L05061J012841J582756
1703.1E71306992J369361N79987n3558j12419J76086L66516L12958J76124Q5526k5635
1712.8E74181938k74467o44112r76257j062432p39631j0605Q46558J364250J225738
1721.4E73910980N79720m6997k19460J9760K55013J70860j31073l23868l00407l21655
1731.1E73592873o42853j069985j054229l24135O75430J133614O97937j66168o94047
$$ plain form
1669.4 540346298 541377220 543002853 545026054 546933594 548399200 549524460 550601120 551749306
1677.1 551749306 552883835 553943748 554941559 555723305 555883865 555171509 554000854 553357964 554014587
1685.8 554014587 555822296 557857132 559280434 560032730 560684547 561685638 562845154 563589020 563692245
1694.4 563692245 563650742 564225388 565611572 567178230 568134270 568406334 568711395 569724236 571306992
1703.1 571306992 572676353 573256340 573202782 573090363 573266449 573632965 573945923 574122047 574207573 574181938
1712.8 574181938 573907471 573263359 572287102 571224670 570485039 570474434 571320992 572685242 573910980
1721.4 573910980 574490700 574443703 574224243 574244003 574499016 574669876 574538803 574214935 573914528 573592873
1731.1 573592873 572950020 571880035 570825806 570501671 571177101 572310715 573008652 572842484 572148437
1739.8E72148437n90057j76353J26342K43493L32107M30069M14353K52189J00327J03454
1749.4E73384361K23046L37181M04281M20266K97241m2801m51279o06994l94288j18370
1759E73452644j79519n54848p74651m84047R6322M02107J70555l01170n72548n85442
1768.7E70669403o40449r09844j160469j040382n39589l7308R8343j50528n36003q47969
1778.3E64905205j040306j126862j109276j051292j098557j295013j421661j157036
1786E55605202m65927K53563N02510J65939l86124o69555n16854j39885J44768J88103
1795.7E54681740M2534j72425l81012n52520o55403o52009n45806m19045l90243n12543
1805.3E50443268p17201q79937r46540r67637j001815j023636r68476q49914p77283
$$ plain form
1739.8 572148437 571558380 571382027 571508369 571751862 572083969 572514038 572928391 573180580 573280907 573384361
1749.4 573384361 573607407 573944588 574348869 574769135 575066376 575023575 574572296 573965302 573571014 573452644
1759 573452644 573273125 572718277 571943626 571459579 571555901 571958008 572128563 571827393 571254845 570669403
1768.7 570669403 570028954 569119110 567958641 566918259 566378670 566341362 566439705 566289177 565753174 564905205
1778.3 564905205 563864899 562738037 561628761 560577469 559478912 558183899 556762238 555605202
1786 555605202 555139275 555392838 555895348 556061287 555675163 555005608 554488754 554348869 554493637 554681740
1795.7 554681740 554724274 554551849 554170837 553618317 552962914 552310905 551765099 551346054 550955811 550443268
1805.3 550443268 549726067 548846130 547899590 546931953 545930138 544906502 543938026 543088112 542310829
1814E42310829q34732r84955j122474j187630j192093j159325j112938j122894j270027
1822.7E32323761j510506j636696j484184j177292j056556j291161j632462j656188
1830.4E20878716j241494p16743n00260o78901j001930j213608j273575j258392j199189
1839.1E11794624j110420j102905j310196j674652j907883j756439j281586q11615
1846.8E00838928o18095o90994q33893r04503r14192r29985r61075r67980r38339r08241
1856.4D92171631r13162r49288r87587j010666j015396r87892r03702p71866o76689
1865.1D83955383p33642r69734j243783j326446j102638p01218m02260l96156o35376
1873.8D76444130r11064j056519j058769j007423r76601r77554r97849j043472j127701
$$ plain form
1814 542310829 541476097 540491142 539368668 538181038 536988945 535829620 534716682 533593788 532323761
1822.7 532323761 530813255 529176559 527692375 526515083 525458527 524167366 522534904 520878716
1830.4 520878716 519637222 518920479 518420219 517741318 516739388 515525780 514252205 512993813 511794624
1839.1 511794624 510684204 509581299 508271103 506596451 504688568 502932129 501650543 500838928
1846.8 500838928 500220833 499529839 498695946 497791443 496877251 495947266 494986191 494018211 493079872 492171631
1856.4 492171631 491258469 490309181 489321594 488310928 487295532 486307640 485403938 484632072 483955383
1865.1 483955383 483221741 482252007 481008224 479681778 478579140 477877922 477475662 477079506 476444130
1873.8 476444130 475533066 474476547 473417778 472410355 471433754 470456200 469458351 468414879 467287178
1882.5D67287178j231003j297760j295662j272621j333427j532822j794167j961402
1890.2D55568314j960564j892815j943588k187347k489128k588234k265358j450577
1897.9D38790703k61002R98574J903266K102166J557083N97305l10745q87566j155662
1906.6D43334122j277428j346054j352882j291733j213150j165123j146088j153374
1914.3D33388290j229171j399918j578865j611290j457863j287231j314087j541062
1922D21968803j720543j615486j267700r61342r27925j130218j347771j420746j361961
1930.7D10215111j262932j169357j081391j024246j046219j137771j205101j159172
1938.4D01128922j013604q66546p85942p45583o77986n70831m77219m44794m61578
$$ plain form
1882.5 467287178 466056175 464758415 463462753 462190132 460856705 459323883 457529716 455568314
1890.2 455568314 453607750 451714935 449771347 447584000 445094872 442506638 440241280 438790703
1897.9 438790703 438529701 439528275 441431541 443533707 445090790 445688095 445377350 444489784 443334122
1906.6 443334122 442056694 440710640 439357758 438066025 436852875 435687752 434541664 433388290
1914.3 433388290 432159119 430759201 429180336 427569046 426111183 424823952 423509865 421968803
1922 421968803 420248260 418632774 417365074 416403732 415475807 414345589 412997818 411577072 410215111
1930.7 410215111 408952179 407782822 406701431 405677185 404630966 403493195 402288094 401128922
1938.4 401128922 400115318 399248772 398462830 397717247 397039261 396468430 395991211 395546417 395084839
1947.1C95084839m87785n21203o03103p59239r52912j116333j214294j266213j303215
1955.8C86860542j334037j363183j417579j524620j657906j741714j734162j695175
1963.5C74392166j737366j904792k119904k263603k294045k266006k250061k263909
1971.2C57292480k289962k333260k425117k569771k714882k789192k773857k718850
1978.9C36677589k689857k696152k676697k560310k341843k098503j925220j857701
1986.6C17831306j870231j944580k113400k415523k805462l150788l336277l372993
1994.3B96822052l379498l462047l625946l802605l933124m004135m020215l989067
2002.1B66605415l940467l935452m014015m138317m217949m205780m155827m165001
$$ plain form
1947.1 395084839 394597054 394075851 393472748 392713509 391760597 390644264 389429970 388163757 386860542
1955.8 386860542 385526505 384163322 382745743 381221123 379563217 377821503 376087341 374392166
1963.5 374392166 372654800 370750008 368630104 366366501 364072456 361806450 359556389 357292480
1971.2 357292480 355002518 352669258 350244141 347674370 344959488 342170296 339396439 336677589
1978.9 336677589 333987732 331291580 328614883 326054573 323712730 321614227 319689007 317831306
1986.6 317831306 315961075 314016495 311903095 309487572 306682110 303531322 300195045 296822052
1994.3 296822052 293442554 289980507 286354561 282551956 278618832 274614697 270594482 266605415
2002.1 266605415 262664948 258729496 254715481 250577164 246359215 242153435 237997608 233832607
2009.8B33832607m264183m385223m439869m412651m361077m332389m302369m204673
2017.5A99130173m011841l779163l594895l494320l419475l269978k997227k647667
2025.2A71915607k311706k038002j799736j544705j256618r57928o62231l49579P915
2033.9A61003017M02871P89833J118450J365681J546115J702691J884002K112980K365456
2042.6A74291096K586899K734432K802524K812310K788734K754211K732335K736606
2050.3A96239147K758846K782765K811680K871589K980462L121299L255177L349228
2058B20170193L394088L411103L450622L563919L748246L932285M054470M138622M259110
2066.7B54122658M419937M542484M610176M743099N016003N235424N095921M691257
$$ plain form
2009.8 233832607 229568424 225183201 220743332 216330681 211969604 207637215 203334846 199130173
2017.5 199130173 195118332 191339169 187744274 184249954 180830479 177560501 174563274 171915607
2025.2 171915607 169603901 167565899 165766163 164221458 162964840 162006912 161344681 160995102 161003017
2033.9 161003017 161405888 162195721 163314171 164679852 166225967 167928658 169812660 171925640 174291096
2042.6 174291096 176877995 179612427 182414951 185227261 188015995 190770206 193502541 196239147
2050.3 196239147 198997993 201780758 204592438 207464027 210444489 213565788 216820965 220170193
2058 220170193 223564281 226975384 230426006 233989925 237738171 241670456 245724926 249863548 254122658
2066.7 254122658 258542595 263085079 267695255 272438354 277454357 282689781 287785702 292476959
2074.4B92476959M753189O117935Q824406J1838894J3827934J4243470J3624572J2914696
2082.1C78622055J2616005J2611389J2599068J2484588J2348404J2222634J2034073
2088.9D65538216J1727371J1339836J0937653J0542564J0142899R735794R319801Q863716
2096.6E48147850Q327141P710991P065658O451302N896339N400200M949074M518013
2104.3E98466568M076042L610535L149643K746086K432594K191658J972008J730652
2112F20375786J467209J223716J049347R57642R09042Q39882P13272N38750L52669
2120.7F28427315J89514P8049M3220Q7395J64909J98746J41296K2049p8697j01776
2130.3F29172020n6953n723q888q9721k32544l96500n34058o07986o08826n62477n21088
$$ plain form
2074.4 292476959 297230148 303348083 312172489 324011383 337839317 352082787 365707359 378622055
2082.1 378622055 391238060 403849449 416448517 428933105 441281509 453504143 465538216
2088.9 465538216 477265587 488605423 499543076 510085640 520228539 529964333 539284134 548147850
2096.6 548147850 556474991 564185982 571251640 577702942 583599281 588999481 593948555 598466568
2104.3 598466568 602542610 606153145 609302788 612048874 614481468 616673126 618645134 620375786
2112 620375786 621842995 623066711 624116058 625073700 625982742 626822624 627535896 628074646 628427315
2120.7 628427315 628616829 628694878 628738098 628825493 628990402 629189148 629330444 629352493 629273796 629172020
2130.3 629172020 629115067 629109344 629100456 629010735 628778191 628381691 627847633 627239647 626630821 626068344 625547256
2140.9F25547256n36651o28739p66868q86955r35975r07096q37174p75299p59888q18138
2150.6F17694473r54704j123619j224556j171112r84612q03566p70454q98666j061287
2159.3F08701897j114617j021232q49381o79817n41000m28696l46832k98806k53601
2167.9F03167915j57203N455J72577K49633J93291M2038j29547k69051l59764l99132
2177.6F02516212l92265l72467l95775m95796o37665p32078p09343n79262m20647l21312
2187.2E97459602l19709l97263n00336n74379n91850n69649n59272o10314p31125q83217
2196.9E91722488j014785j094742j114807j069451r54284p90062o39229n77889o33850
2205.5E83833389p51152q22830p73163o18858m60129m06609n04226p13272r42231j108360
$$ plain form
2140.9 625547256 625010605 624381866 623614998 622728043 621792068 620884972 620047798 619272499 618512611 617694473
2150.6 617694473 616739769 615616150 614391594 613220482 612235870 611432304 610661850 609763184 608701897
2159.3 608701897 607587280 606566048 605716667 605036850 604495850 604067154 603720322 603421516 603167915
2167.9 603167915 603010712 603016167 603188744 603438377 603631668 603673706 603544159 603275108 602915344 602516212
2177.6 602516212 602123947 601751480 601355705 600859909 600222244 599490166 598780823 598201561 597780914 597459602
2187.2 597459602 597139893 596742630 596242294 595667915 595076065 594506416 593947144 593336830 592605705 591722488
2196.9 591722488 590707703 589612961 588498154 587428703 586474419 585684357 585045128 584467239 583833389
2205.5 583833389 583082237 582259407 581486244 580867386 580407257 580000648 579496422 578783150 577840919 576732559
2215.2E76732559j180801j188736j197472j255989j357422j438026j420899j274681
2222.9E66418533j029434p45163m73175k48680j03836o7062j34125k52991l55301m11491
2232.5E62597275m47579n09109o09360p19414q05702q65707r22470r89457j048049
2241.2E55680428j062623j019554r46312q94775r01680r62524j041527j102791j127815
2249.9E46620827j112900j057625r68361q72078q09211q03833q34427q43544p85714
2258.6E38533134o70204n55572m97856m97361m98199m40636l17344j80207q7623n1079
2268.2E34737053l3379N455O8169J28555J67580J87569J93901J78604J30882N6496
2277.9E35820885k2850q9569j33934j52588j50490j56555k16790l46756m97741n87425
$$ plain form
2215.2 576732559 575551758 574363022 573165550 571909561 570552139 569114113 567693214 566418533
2222.9 566418533 565389099 564643936 564170761 563922081 563818245 563751183 563617058 563364067 563008766 562597275
2232.5 562597275 562149696 561640587 561031227 560311813 559506111 558640404 557717934 556728477 555680428
2241.2 555680428 554617805 553598251 552651939 551757164 550855484 549892960 548851433 547748642 546620827
2249.9 546620827 545507927 544450302 543481941 542609863 541800652 540996819 540162392 539318848 538533134
2258.6 538533134 537862930 537307358 536809502 536312141 535813942 535373306 535055962 534875755 534788132 534737053
2268.2 534737053 534703674 534709129 534777298 534905853 535073433 535261002 535454903 535633507 535764389 535820885
2277.9 535820885 535798035 535708466 535574532 535421944 535271454 535114899 534898109 534551353 534053612 533466187
2287.5E33466187n78957n21088m99572n56298o64444p75642q69064r49936j020165
2296.2E27031021j075477j120224j163140j183853j124077r35783o50749l81737k41165
2304.9E19154816k54708l53050m52537n31426o23131p49473q73261r37958r40551r48181
2314.5E12490540j032639j187134j325416j359749j273804j121864r66721q35419p31811
2323.2E02655983o69594o81610p90710r79615j194725j375274j481209j503220j447525
2331.9D92532501j323585j143456r26094o92596m53606k09274K6130K03743K59400
2340.6D88273163J66702k5520k16599l17726l01361k06184j02043n1384q2779j93406
2350.2D86942863l77769o42090r72252j280174j421127j314659j062928q95652r49059
$$ plain form
2287.5 533466187 532887230 532366142 531866570 531310272 530645828 529870186 529001122 528051186 527031021
2296.2 527031021 525955544 524835320 523672180 522488327 521364250 520428467 519777718 519395981 519154816
2304.9 519154816 518900108 518547058 518094521 517563095 516939964 516190491 515317230 514379272 513438721 512490540
2314.5 512490540 511457901 510270767 508945351 507585602 506311798 505189934 504223213 503387794 502655983
2323.2 502655983 501986389 501304779 500514069 499534454 498339729 496964455 495483246 493980026 492532501
2331.9 492532501 491208916 490065460 489139366 488446770 487993164 487783890 487810020 488013763 488273163
2340.6 488273163 488439865 488414345 488197746 487880020 487578659 487372475 487270432 487219048 487136269 486942863
2350.2 486942863 486565094 485923004 484950752 483670578 482249451 480934792 479871864 478976212 478027153
2358.9D78027153j098671j062851p04956k18697J9074k04964p35893j180077j229400
2367.6D71610718q84934m10347j00441p1792k27013l81927m29306l96119l69758l91464
2377.2D67947617m30108m46510m48265m65393m96254n09911n03120n25436o21643p64771
2386.8D62736206q70476q81462q22067p63054p50236p80144q27332q69446q87107q61130
2396.5D54423752p94029p26395p10869p64618q52318r17396r28688q93593q38127p85179
2406.1D46212540p47910p35168p49016p75185p82814p42073o55174n69191n48439o20537
2415.8D39287033p46384q50448q90351q89587r01909r45549r86709r87778r56574r33799
2425.4D30197945r40819r51424r27963q71544q22525q15277q39806q57277q46214q19969
$$ plain form
2358.9 478027153 476928482 475865631 475160675 474941978 474961052 474756088 474020195 472840118 471610718
2367.6 471610718 470725784 470315437 470214996 470143204 469916191 469534264 469104958 468708839 468339081 467947617
2377.2 467947617 467517509 467070999 466622734 466157341 465661087 465151176 464648056 464122620 463500977 462736206
2386.8 462736206 461865730 460984268 460162201 459399147 458648911 457868767 457041435 456171989 455284882 454423752
2396.5 454423752 453629723 452903328 452192459 451427841 450575523 449658127 448729439 447835846 446997719 446212540
2406.1 446212540 445464630 444729462 443980446 443205261 442422447 441680374 441025200 440456009 439907570 439287033
2415.8 439287033 438540649 437690201 436799850 435910263 435008354 434062805 433076096 432088318 431131744 430197945
2425.4 430197945 429257126 428305702 427377739 426506195 425683670 424868393 424028587 423171310 422325096 421505127
2435.1D21505127q03299q00819p99370p92923p93724q12149q36182q40187q16307p87621
2444.7D13422546p87391q27294q86840r30825r33075q91952q33397p99408q19512q86383
2454.3D04826469r57222r92927r92584r90982j019326j076431j135635j171723j173134
2463C95316505j139068j075783r94415r07669q18367p24564o38809n92957o14776o97861
2472.7C87112236q03261q97140r72939j036949j080513j081581j038818r87931r77478
2481.3C78235626j026459j107635j172409j190147j169587j145591j147080j164169
2489.1C69112549j159249j110038j046982j030083j079407j138458j128959j041604
2496.8C60377769r55505r53598j030006j102982j111717j080895j073570j105461j131058
$$ plain form
2435.1 421505127 420701828 419901009 419101639 418308716 417514992 416702843 415866661 415026474 414210167 413422546
2444.7 413422546 412635155 411807861 410921021 409990196 409057121 408165169 407331772 406532364 405712852 404826469
2454.3 404826469 403869247 402876320 401883736 400892754 399873428 398796997 397661362 396489639 395316505
2463 395316505 394177437 393101654 392107239 391199570 390381203 389656639 389017830 388424873 387810097 387112236
2472.7 387112236 386308975 385411835 384438896 383401947 382321434 381239853 380201035 379213104 378235626
2481.3 378235626 377209167 376101532 374929123 373738976 372569389 371423798 370276718 369112549
2489.1 369112549 367953300 366843262 365796280 364766197 363686790 362548332 361419373 360377769
2496.8 360377769 359422264 358468666 357438660 356335678 355223961 354143066 353069496 351964035 350832977
2505.5C50832977j113167j073761j066436j106758j160927j191521j198273j205978
2513.2C41716156j225166j241227j235961j204224j154709j102676j069374j071549
2520.9C32411270j100921j121293j099662j043396r96361r95217j029853j058579j052170
2529.6C22913818j019401r91516r90258j016464j056938j094227j111297j097660j059285
2538.2C13476772j020698j008816j031265j071873j110802j143436j177864j210156
2546C04701862j214504j162929j061173r55982q99601r04923r38301r57451r51499
2554.6B95655499r40552r41334r48582r47551r44615r62219j007748j051883j051178
2563.3B86859837r95369r21307q76598q72612q79612q65860q33149q05111p95326p94468
$$ plain form
2505.5 350832977 349719810 348646049 347579613 346472855 345311928 344120407 342922134 341716156
2513.2 341716156 340490990 339249763 338013802 336809578 335654869 334552193 333482819 332411270
2520.9 332411270 331310349 330189056 329089394 328045998 327049637 326054420 325024567 323965988 322913818
2529.6 322913818 321894417 320902901 319912643 318896179 317839241 316745014 315633717 314536057 313476772
2538.2 313476772 312456074 311447258 310415993 309344120 308233318 307089882 305912018 304701862
2546 304701862 303487358 302324429 301263256 300307274 299407673 298502750 297564449 296606998 295655499
2554.6 295655499 294714947 293773613 292825031 291877480 290932865 289970646 288962898 287911015 286859837
2563.3 286859837 285864468 284943161 284066563 283193951 282314339 281448479 280615330 279810219 279014893 278220425
2573B78220425p89681p83253p79838p66468p19147o31027n26180m37527l76473l25107
2582.6B72085724k54841j47686q850J32923K38609K91005L23238M00543N57804P52201
2592.2B74370670Q95729R37825R10759Q84590Q94603R20640R37461R57032J012878
2600.9B82722187J118336J261234J434383J648217J901741K152900K336960K417012
2608.6B96992970K411594K370243K329578K298127K268123K229958K172031K081852
2616.4C15154476J956406J810264J664639J527710J389656J242218J096954R78966
2624.1C26821289R00269Q38813P55883O36634N19677M81186N75676P75680R66034J010094
2633.7C34281235Q49075N50842K61116Q9913L6354J5526m1237j23520j74408j69716
$$ plain form
2573 278220425 277430744 276647491 275867653 275101185 274382038 273751011 273224831 272787304 272410831 272085724
2582.6 272085724 271830883 271683197 271674347 271807270 272045879 272336884 272660122 273060665 273618469 274370670
2592.2 274370670 275266399 276204224 277114983 277999573 278894176 279814816 280752277 281709309 282722187
2600.9 282722187 283840523 285101757 286536140 288184357 290086098 292238998 294575958 296992970
2608.6 296992970 299404564 301774807 304104385 306402512 308670635 310900593 313072624 315154476
2616.4 315154476 317110882 318921146 320585785 322113495 323503151 324745369 325842323 326821289
2624.1 326821289 327721558 328560371 329316254 329952888 330472565 330953751 331529427 332305107 333271141 334281235
2633.7 334281235 335130310 335681152 335942268 336032181 336068535 336084061 336042824 335919304 335744896 335575180
2643.4C35575180j44501j41143j51825j34812p9307k9679l3302p7095r6436m4822N9395
2654C34701653J56631K06223K07710J81236J42098J03149Q3923J02692J61018K38152
2663.6C36284485L03879L32870L12576K46773J59226Q3313L8643J3923k4376j01852
2673.3C37649460k09732l11241l75519m06189m42314n21965o44799p70568q51250q66814
2682.9C32249069q31413p75452p29675p21512p63397q36296q92372q92716q49228q16040
2692.5C24140968q32290q76580q90655q42438p59144p01027p04937p58400q18786q46291
2702.2C16110420q25977p67841o95019o29349n83706n60398n53799n49717n28297m81701
2711.8C09934616m30965m20132m75826n70889o38599o29215n61161n04132n14793n87483
$$ plain form
2643.4 335575180 335430679 335289536 335137711 335002899 334923592 334893913 334860611 334783516 334687080 334642258 334701653
2654 334701653 334858284 335064507 335272217 335453453 335595551 335698700 335782623 335885315 336046333 336284485
2663.6 336284485 336588364 336921234 337233810 337480583 337639809 337723122 337761765 337775688 337751312 337649460
2673.3 337649460 337439728 337128487 336752968 336346779 335904465 335382500 334737701 333967133 333115883 332249069
2682.9 332249069 331417656 330642204 329912529 329191017 328427620 327591324 326698952 325806236 324957008 324140968
2692.5 324140968 323308678 322432098 321541443 320699005 319939861 319238834 318533897 317775497 316956711 316110420
2702.2 316110420 315284443 314516602 313821583 313192234 312608528 312048130 311494331 310944614 310416317 309934616
2711.8 309934616 309503651 309083519 308607693 308036804 307398205 306768990 306207829 305703697 305188904 304601421
2721.5C04601421o64825o95610o76937o49300o55556p09476p93171q75473r27124r32331
2731.1B97021618q96759q45928q11749q10985q35934q65784q79669q60386p95574o88057
2740.8B88730793n70850m92096m72393m80767m61921l91617k99530k32506k08321k05345
2750.4B84915447j90811j51119r6703n0983l5496n3863q9665j22089j53504k07252
2760B83763962k89746l65657l88565l56827l24822l43933m07200m68921n08690n54180
2769.7B79755421o32801p20730p63493p42035o99329o94275p39384p93342q12588p93724
2779.3B72363720p70989p73563p96223q08887p88269p39765o90346o63471o61068o69823
2789B65001316o78654o89678p10258p39231p60670p52278p05394o40698o00586o16321
$$ plain form
2721.5 304601421 303936596 303240986 302564049 301914749 301259193 300549717 299756546 298881073 297953949 297021618
2731.1 297021618 296124859 295278931 294467182 293656197 292820263 291954479 291074810 290214424 289418850 288730793
2740.8 288730793 288159943 287667847 287195454 286714687 286252766 285861149 285561619 285329113 285120792 284915447
2750.4 284915447 284724636 284573517 284476814 284425831 284390335 284336472 284246807 284124718 283971214 283763962
2760 283763962 283474216 283108559 282719994 282363167 282038345 281694412 281287212 280818291 280309601 279755421
2769.7 279755421 279122620 278401890 277638397 276896362 276197033 275502758 274763374 273970032 273157444 272363720
2779.3 272363720 271592731 270819168 270022945 269214058 268425789 267686024 266995678 266332207 265671139 265001316
2789 265001316 264322662 263632984 262922726 262183495 261422825 260670547 259965153 259324455 258723869 258107548
2798.6B58107548o72531p12910o90708o14262n38711n06974n08804m98619m46835l63750
2808.3B52553444k76871j98498j25618o1931k5940l9959j07651k09255l12786l95451
2817.9B50799484m56009n07278n53036n74856n49965m85401m26483m16336m51126m82540
2827.6B45896454m71268m28104l98941m11740m47330m65298m46567m11549l94459m11873
2837.2B41609325m52957m96044n26466n36747n17845m61827l79715l10974k99358l50208
2846.8B37277184m19350m50516m25167l71532l24822k91481k51198j85337r2697J4954
2856.5B34480038J21078K05612K49787K50835K31152K24857K54765L19976L99762M65870
2866.1B37203732M98237M97570M84600M76265M63810M24366L57075L00198K98042L50590
$$ plain form
2798.6 258107548 257435017 256722107 256031399 255417137 254878426 254371452 253862648 253364029 252917194 252553444
2808.3 252553444 252276573 252078075 251952457 251890526 251864586 251824627 251716976 251507721 251194935 250799484
2817.9 250799484 250343475 249836197 249283161 248708305 248158340 247672939 247246456 246830120 246378994 245896454
2827.6 245896454 245425186 244997082 244598141 244186401 243739071 243273773 242827206 242415657 242021198 241609325
2837.2 241609325 241156368 240660324 240133858 239597111 239079266 238617439 238237724 237926750 237627392 237277184
2846.8 237277184 236857834 236407318 235982151 235610619 235285797 234994316 234743118 234557781 234465084 234480038
2856.5 234480038 234601116 234806728 235056515 235307350 235538502 235763359 236018124 236338100 236737862 237203732
2866.1 237203732 237701969 238199539 238684139 239160404 239624214 240048580 240405655 240705853 241003895 241354485
2875.8B41354485M12826M44012M45022M40140M37546M21848L82691L30982K80647K29588
2885.4B45179787J69067J05858N5809J9092k0027o1969p3033j9455Q0414J51901J25027
2896B45712471K575j34964j95465j49155m8446J6422r499j09978k18639k77424k80666
2906.6B44307232k69680k95410l86353n37643p14741q63743r32960r08890q27999p46079
2916.3B37823734o86302o23283n22232l81260k20108l8643J91860M79450P64675R52397
2925.9B37740288R94606R36355Q71144Q53576Q65193Q55007Q05759P47490P14970P01218
2935.6B46085606O56986N39741L62072J92509J02558J08948J61724J93596J73511J19458
2945.2B48696709O5689K8877O847n7J6003N2471Q1387O3400j5831j24760k03342k09122
$$ plain form
2875.8 241354485 241767311 242211323 242656345 243096485 243534031 243955879 244338570 244669552 244950199 245179787
2885.4 245179787 245348854 245454712 245510521 245529613 245509586 245447617 245374584 245355129 245435543 245587444 245712471
2896 245712471 245715046 245580082 245384617 245235462 245187016 245203438 245193939 245083961 244865322 244587898 244307232
2906.6 244307232 244037552 243742142 243355789 242818146 242103405 241239662 240306702 239397812 238569813 237823734
2916.3 237823734 237137432 236514149 235991917 235610657 235390549 235351906 235543766 236023216 236787891 237740288
2925.9 237740288 238734894 239671249 240542393 241395969 242261162 243116169 243921928 244669418 245384388 246085606
2935.6 246085606 246742592 247282333 247644405 247836914 247939472 248048420 248210144 248403740 248577251 248696709
2945.2 248696709 248762398 248791275 248798122 248798065 248814068 248866539 248947926 249011326 248995495 248870735 248667393 248458271
2956.8B48458271j49212p1773k1286p763j1139j4153j9016k8248k5768J4324R3823
2967.4B48218060J77707K28424K46887K68727L13492L50933L30639K46639J62296J56517
2977B50700321K40917L41187L65448K94018J94874J50470J72291J99471J77211J26438
2986.7B52962646J25180K18086L54633M26140L66688K17552R3823Q5029J84059K97757
2996.3B55331593L25660K37007Q3504m9991j11428j08681q0184n3463k8115N017M2057
3006.9B55592976P3909J02368J39522J85051K14768K07977J77574J59569J66645J63689
3016.6B57184048J07803J1330n6191m0436L0137O7615K1038o2046q3103O504J57337
3027.2B57344036K82135L48511L99818M85688N86795O24657N47600L96900K76794K57836
$$ plain form
2956.8 248458271 248309059 248237286 248216000 248208237 248197098 248182945 248163929 248135681 248109913 248124237 248218060
2967.4 248218060 248395767 248624191 248871078 249139805 249453297 249804230 250134869 250381508 250543804 250700321
2977 250700321 250941238 251282425 251647873 251941891 252136765 252287235 252459526 252658997 252836208 252962646
2986.7 252962646 253087826 253305912 253660545 254086685 254453373 254670925 254764748 254849777 255033836 255331593
2996.3 255331593 255657253 255894260 255977764 255927773 255816345 255707664 255627480 255574017 255545902 255550919 255592976
3006.9 255592976 255666885 255769253 255908775 256093826 256308594 256516571 256694145 256853714 257020359 257184048
3016.6 257184048 257291851 257303181 257246990 257206554 257236691 257304306 257325344 257263298 257180195 257186699 257344036
3027.2 257344036 257626171 257974682 258374500 258860188 259446983 260071640 260619240 261016140 261292934 261550770
3036.8B61550770L16658L72925L76339L49063L48912M06894N05639O10694O99711P64466
3046.5B66302071P96032P80963P13902O04973M76684L61576K90032K75955K98290L14904
3056.1B71215382L01971K79274K91042L57685M54255N37586N81932N80864N27382M15096
3065.7B75542469K68841J57871J50070K48528L79543M56734M57287M29782M33560M79965
3075.4B79004650N32322N48744N14832M48150L87021L72028M20666N02452N52140N29403
3085B83812408M63181M25167M55151N24292N78689N97592N89752N51929M69494L67832
3094.7B88835487L25299L96099N30452O10276N75924M93202M70390N30720O00319O14242
3104.3B93982410N95150O09799O69212P11575O77261N77011M73900M20570M29764M86908
$$ plain form
3036.8 261550770 261867428 262240353 262616692 262965755 263314667 263721561 264227200 264837894 265537605 266302071
3046.5 266302071 267098103 267879066 268592968 269197941 269674625 270036201 270326233 270602188 270900478 271215382
3056.1 271215382 271517353 271796627 272087669 272445354 272899609 273437195 274019127 274599991 275127373 275542469
3065.7 275542469 275811310 275969181 276119251 276367779 276747322 277204056 277661343 278091125 278524685 279004650
3075.4 279004650 279536972 280085716 280600548 281048698 281435719 281807747 282228413 282730865 283283005 283812408
3085 283812408 284275589 284700756 285155907 285680199 286258888 286856480 287446232 287998161 288467655 288835487
3094.7 288835487 289160786 289556885 290087337 290697613 291273537 291766739 292237129 292767849 293368168 293982410
3104.3 293982410 294577560 295187359 295856571 296568146 297245407 297822418 298296318 298716888 299146652 299633560
3114B99633560N63049O14586N95951N02110L91903L45440L92780M85268N45597N42717
3123.6C04612961N09872M96845N13001N22976M93870M33235L77350L48873L35865L16391
3133.3C08961239K97470L11661L68728M22898M03404K92454J55086Q2607J02387J58329
3142.9C11556263J80588J56517J19037Q1654K0638p4425j61076j89113j71338j77078
3152.5C11341667k41241l12729l17650k56977k04392k06031k15779j54285r194J51654
3162.2C09575043K61097L11622L32184L39146L36094L47118M06094N05581N86052N94730
3171.8C13594761N52635N39169O08941P38506Q52604R01127Q97426Q92754R21688R75571
3181.5C21475182J023025J049194J067925J096611J130791J154861J171684J200943
$$ plain form
3114 299633560 300196609 300811195 301407146 301909256 302301159 302646599 303039379 303524647 304070244 304612961
3123.6 304612961 305122833 305619678 306132679 306655655 307149525 307582760 307960110 308308983 308644848 308961239
3133.3 308961239 309258709 309570370 309939098 310361996 310765400 311057854 311212940 311295547 311397934 311556263
3142.9 311556263 311736851 311893368 312012405 312094059 312114697 312040272 311879196 311690083 311518745 311341667
3152.5 311341667 311100426 310787697 310470047 310213070 310008678 309802647 309586868 309432583 309423389 309575043
3162.2 309575043 309836140 310147762 310479946 310819092 311155186 311502304 311908398 312413979 313000031 313594761
3171.8 313594761 314147396 314686565 315295506 316034012 316886616 317787743 318685169 319577923 320499611 321475182
3181.5 321475182 322498207 323547401 324615326 325711937 326842728 327997589 329169273 330370216
3189.2C30370216J241150J253205J204071J125908J099548J167259J278763J341476
3196.9C40081596J315804J244621J194306J190757J216545J239472J229286J165276
3204.6C49877663J062278R84307R97696J094169J181259J169205J064530R58366R28841
3213.3C59318314R69696J014022J003457R27810Q16880P17964O72340O87409P21206
3222C66849098P14264O51436N82046N67971O12755O53686O28128N36156M33006L66898
3231.6C72595444L34205K95601K25868J44272R8000J23482K17361L37448M24004M28886
3241.3C75224571L42217K04200Q5335L9368O3705J09940J36146J45035J64719J99394
3250.9C76714630K11945J61323N1003o1875j05400m3220R4375K23771K65998K15836
$$ plain form
3189.2 330370216 331611366 332864571 334068642 335194550 336294098 337461357 338740120 340081596
3196.9 340081596 341397400 342642021 343836327 345027084 346243629 347483101 348712387 349877663
3204.6 349877663 350939941 351924248 352921944 354016113 355197372 356366577 357431107 358389473 359318314
3213.3 359318314 360288010 361302032 362305489 363233299 364050179 364768143 365440483 366127892 366849098
3222 366849098 367563362 368214798 368796844 369364815 369977570 370631256 371259384 371795540 372228546 372595444
3231.6 372595444 372929649 373225250 373451118 373595390 373693390 373816872 374034233 374371681 374795685 375224571
3241.3 375224571 375566788 375770988 375856323 375895691 375959396 376069336 376205482 376350517 376515236 376714630
3250.9 376714630 376926575 377087898 377138901 377077026 376971626 376928406 377022781 377246552 377512550 377728386
3260.5C77728386J54076J73759K81334L85704L94058L10250K20413J95007K21634K43340
3270.2C80307961K32391K11868K18544K67677L50571M40674M96559M80423L94440K93655
3279.8C83694763K45705K73666L44086M05807M32053M33006M43993N05905O33049P79533
3289.5C88191566Q49953P76940N96084M31061L83644M44412N19638N43442N41306N82924
3299.1C93860970O85958P90329Q28171Q01354P78541Q08907Q59489Q50640P54814O43234
3308.8D01662407O17447O92482P71484P48215O26717N19638N23109O16837O99386P11136
3318.4D08188858O98776P49054Q75931R88159R73549Q07457N85251M50363M82178O33201
3328.1D15432777P68624P76710O60095N26619M82903N34439N93300N77392M96140M27170
$$ plain form
3260.5 377728386 377882462 378056221 378337555 378723259 379117317 379427567 379647980 379842987 380064621 380307961
3270.2 380307961 380540352 380752220 380970764 381238441 381589012 382029686 382526245 383006668 383401108 383694763
3279.8 383694763 383940468 384214134 384558220 384964027 385396080 385829086 386273079 386778984 387412033 388191566
3289.5 388191566 389041519 389818459 390414543 390845604 391229248 391673660 392193298 392736740 393278046 393860970
3299.1 393860970 394546928 395337257 396165428 396966782 397745323 398554230 399413719 400264359 401019173 401662407
3308.8 401662407 402279854 402972336 403743820 404492035 405118752 405638390 406161499 406778336 407477722 408188858
3318.4 408188858 408887634 409636688 410512619 411500778 412474327 413281784 413867035 414317398 414799576 415432777
3328.1 415432777 416201401 416978111 417638206 418164825 418647728 419182167 419775467 420352859 420848999 421276169
3337.7D21276169M22973M56810M65470M29535L90815L97568M47731M98123N13535M90341
3347.3D25789070M33731L38402K07329Q3847L3073Q1787J84365K58979K59858K06413
3357D27876854J46294J08261R1552Q6937Q7052Q2435O6414N0316N9967J02997J48430
3367.6D28907509J56479J20887O9466K0104l8491j10359j55144j23443k9450M5433
3377.2D28862991M1657l624J297Q8081J90659K30522K11334K00005K26021K44255K07519
3387.8D30500717J42174J13449J30463J25618M7454n4931p2403L8452J99852K88544
3397.5D31459389K51617J38436L3073j7662j5183J5984M9210O1416M3259Q392k3956
3408.1D32003975n4588j00823j62544k03209j83830j10131l1738P095L205j7090l6354
$$ plain form
3337.7 421276169 421699142 422155952 422621422 423050957 423441772 423839340 424287071 424785194 425298729 425789070
3347.3 425789070 426222801 426561203 426768532 426852379 426885452 426967239 427151604 427410583 427670441 427876854
3357 427876854 428023148 428131409 428222961 428309898 428396950 428479385 428545799 428596115 428656082 428759079 428907509
3367.6 428907509 429063988 429184875 429254341 429274445 429235954 429125595 428970451 428847008 428817558 428862991
3377.2 428862991 428904648 428901024 428902321 428990402 429181061 429411583 429622917 429822922 430048943 430293198 430500717
3387.8 430500717 430642891 430756340 430886803 431012421 431059875 431004944 430932541 430970993 431170845 431459389
3397.5 431459389 431711006 431849442 431882515 431864853 431849670 431865654 431914864 431976280 432019539 432027931 432003975
3408.1 432003975 431949387 431848564 431686020 431482811 431298981 431188850 431157112 431164207 431167412 431150322 431113968
3418.7D31113968n6915q7204j30692j82457k26898k34032j76849o2637N6152J11771
3428.3D30124207O5650o8130k28004l30849l14255j87073l1013P1335J22680K03896
3438D29428444L65715N56869O89087P55310Q30307R39789R91211Q89435P01561O25229
3447.6D36772957P68661J002770J090889R46808P18002O09207O69289P80830Q21533
3456.3D44180946P79419P20444O89392O79550O69823O54259O36940O25381O36139O83518
3466D50955811P49282P81823P46460O71043O17752O08940O06537N78384N62096O26526
3475.6D57504654P73926R07516R20334Q05512O60209N85137O01425O62231P21016P63207
3485.2D64905167P85598P79114P41425O98242O88591P25593P75567P77282O91452N43747
$$ plain form
3418.7 431113968 431057053 430969849 430839157 430656700 430429802 430195770 430018921 429956284 430012436 430124207
3428.3 430124207 430189857 430121727 429893723 429562874 429248619 429061546 429030533 429101868 429224548 429428444
3438 429428444 429794159 430351028 431040115 431795425 432625732 433565521 434556732 435446167 436147728 436772957
3447.6 436772957 437541618 438544388 439635277 440582085 441300087 441909294 442578583 443359413 444180946
3456.3 444180946 444960365 445680809 446370201 447049751 447719574 448373833 449010773 449636154 450272293 450955811
3466 450955811 451705093 452486916 453233376 453904419 454522171 455131111 455737648 456316032 456878128 457504654
3475.6 457504654 458278580 459186096 460106430 460911942 461572151 462157288 462758713 463420944 464141960 464905167
3485.2 464905167 465690765 466469879 467211304 467909546 468598137 469323730 470099297 470876579 471568031 472111778
3494.9D72111778M23622M27857N74341P65381Q46405P24296M52004K05001J66092L98903
3504.5D77095680P88269J102448J151504R35517O43692M84237N04570N90554O28891
3513.2D83925362O24618O40984O72302O49605N66063N17540N75714O63414O26449M22173
3522.9D89884224J80473O2790J05477K30522L58391M58488N12886N10025M88739N24216
3532.5D93316231O26602O84662N76935L33976J35193J26839K80952M57726N67741O19126
3542.1D97725983O18896N08118K43606o6223j88446K9717M77180Q33626Q43391N46990
3551.8E01572838K33421J58272L21617N22461N95551N38902M27933K94151J57204J23558
3561.4E04945908L15971O53305P96394M47731k63595p88803o38733J35536R75876J327476
$$ plain form
3494.9 472111778 472535400 472963257 473537598 474302979 475149384 475873680 476325684 476530685 476696777 477095680
3504.5 477095680 477883949 478986397 480137901 481073418 481717110 482201347 482705917 483296471 483925362
3513.2 483925362 484549980 485190964 485863266 486512871 487078934 487596474 488172188 488835602 489462051 489884224
3522.9 489884224 490064697 490127487 490232964 490463486 490821877 491280365 491793251 492303276 492792015 493316231
3532.5 493316231 493942833 494627495 495204430 495538406 495673599 495800438 496081390 496539116 497106857 497725983
3542.1 497725983 498344879 498852997 499096603 499030380 498841934 498871651 499348831 500182457 501025848 501572838
3551.8 501572838 501806259 501964531 502286148 502808609 503404160 503943062 504370995 504665146 504822350 504945908
3561.4 504945908 505261879 505915184 506711578 507159309 506895714 506106911 505468178 505603714 506579590 507907066
3571.1E07907066J099854O39839L33786K88200L70102M45443M96940N41153N43976
3579.7E12666359M92477M96712O96182J009636J070786N52788l94555j118011r85947
3588.4E14486427R461J192779J766434J453857O50025J4839n9853L26424P65419Q97675
3598.1E21503487O60400K85034R0599K45476O62003J071586J201897R38873L95317
3606.8E27054672j35498l43704j19514L32870O32553N66521L20396L04489O75927J074981
3616.4E30363693R62715K66343m28658m62379J65710Q24547J034050R92660J119995
3625.1E34838676J251641P02629p05719k016754j959267l96156J388321K008972J359787
3633.8E36472130M73862K10838M53758N91126L83606Q6135m7874j5183J49498M79050
$$ plain form
3571.1 507907066 509006920 509646759 509980545 510268745 510638847 511084290 511581230 512122383 512666359
3579.7 512666359 513158836 513655548 514351730 515361366 516432152 516984940 516590385 515472374 514486427
3588.4 514486427 514495888 515688667 517455101 518908958 519558983 519573822 519513969 519840393 520605812 521503487
3598.1 521503487 522163887 522448921 522539520 522784996 523446999 524518585 525720482 526659355 527054672
3606.8 527054672 526919174 526575470 526455956 526788826 527421379 527987900 528308296 528612785 529288712 530363693
3616.4 530363693 531326408 531592751 531164093 530701714 530867424 531691971 532726021 533718681 534838676
3625.1 534838676 536090317 536792946 536087227 534070473 532111206 531715050 533103371 535112343 536472130
3633.8 536472130 536945992 537156830 537610588 538201714 538585320 538671455 538623581 538608398 538757896 539236946
3643.4E39236946Q25844P69539L6239j069679j871948j942215j338425k98156R73434
3652.1E35321579K079315K351189J434479o3897r22889n27687M69741R32885N21660
3660.8E41596375j05172k68707j6594K47269M29191O09589M77371m38881j786384k236328
3670.4E38507729r18923J168327J876145K83470k083092k821045j233177J098747K219010
3679.1E38097191J741142P34482K16827K84920N38902P21054P11251L17650n08767
3687.8E42854652j361007j620941j083069j48201O29158J000824J008224P58019L92761
3696.4E42430420J37634J26496J93710M4403l31688n75600l81813J14937M93775N01937
3706.1E42754211K29760j30577n28603r85565j370850j376037p74651K78015J233330
$$ plain form
3643.4 539236946 540062790 540832329 540868568 539798889 537926941 535984726 534646301 534348145 535321579
3652.1 535321579 537400894 539752083 541186562 541122665 540199776 539672089 540141830 541074715 541596375
3660.8 541596375 541491203 541222496 541205902 541453171 541882362 542491951 542969322 542530441 540744057 538507729
3670.4 538507729 537588806 538757133 540633278 540916748 538833656 536012611 534779434 535878181 538097191
3679.1 538097191 539838333 540572815 540789642 541074562 541613464 542334518 543045769 543363419 542854652
3687.8 542854652 541493645 539872704 538789635 538641434 539270592 540271416 541279640 542037659 542430420
3696.4 542430420 542568054 542694550 542888260 542932663 542600975 542025375 541643562 541758499 542252274 542754211
3706.1 542754211 542983971 542853394 542324791 541339226 539968376 538592339 537817688 538095703 539329033
3714.8E39329033J536484J107673M13666k2163j42556k70042n43900o92062m87633
3723.4E40228500j95503k50130n62057n18341J91269J040878J221428N59120m00238
3732.1E41314926j115455j491051j574059j239357m58336L90778Q60176R79309J080551
3740.8E38747482J087532M57001r03587k038002j780052j91384J268006J210136k63634
3749.5E37593498j782188k146454j303406k5711R74312J461639J479721J086083L73344
3758.2E37710838l81584p71599n68618p782L29666O6414n17960p35703k94532K81944
3767.8E35111084K43683m40178r88884p39975P8888P06978P85484O03638M64248K20757
3777.4E36045723l29857q79631q43277j48659N45426N67245k3918n79834o12984k09083
$$ plain form
3714.8 539329033 540865517 541973190 542386856 542364693 542222137 541952095 541408195 540716133 540228500
3723.4 540228500 540032997 539782867 539220810 538702469 538893738 539934616 541156044 541715164 541314926
3732.1 541314926 540199471 538708420 537134361 535895004 535436668 535827446 536687622 537666931 538747482
3740.8 538747482 539835014 540292015 539388428 537350426 535570374 535378990 536646996 537857132 537593498
3749.5 537593498 535811310 533664856 532361450 532335739 533310051 534771690 536251411 537337494 537710838
3758.2 537710838 537329254 536557655 535989037 535981255 536310921 536377335 535859375 535123672 534829140 535111084
3767.8 535111084 535354767 534914589 533925705 533185730 533264618 533971596 534757080 535360718 535824966 536045723
3777.4 536045723 535715866 534836235 533992958 533844299 534389725 534956970 534933052 534353218 533740234 533531151
3787.1E33531151K24457L85971K47612R460l9825K06375M34913J57090o13060j120682
3796.7E33423462o88248K41471L67622q63037k259369k044144k4986J933174J923523
3805.4E32009468J48239j399956j271438n951Q96072Q72994N99251O24275N09224l12233
3815.1E32669945j337700j389237k40326P86744K97470j369248k363472j437568N95054
3823.7E26211662J805229J298790K518o44340l01934K18621J87835k40326m69932k97356
3833.4E27770767n0163q9912m47312r03549j197891j130410o69250n5428L43056L96881
3843E23966789L36647M09127N43632N27382L92189L30467K13280m48685j795006l054084
3852.7E21421738l074150j511612O99958K177544K280922J455879N96543K34146K50053
$$ plain form
3787.1 533531151 533755608 534141579 534389191 534398651 534358826 534565201 535000114 535157204 534544144 533423462
3796.7 533423462 532735214 532976685 533344307 532481270 530221901 528177757 528152771 530085945 532009468
3805.4 532009468 532157707 530757751 529486313 529480362 530376434 531249428 531848679 532472954 532982178 532669945
3815.1 532669945 531332245 529943008 529702682 530489426 530786896 529417648 527054176 525616608 526211662
3823.7 526211662 528016891 529315681 529318199 528673859 528371925 528590546 528778381 528538055 528068123 527770767
3833.4 527770767 527720604 527630692 527183380 526279831 525081940 523951530 523282280 523226852 523569908 523966789
3843 523966789 524303436 524712563 525256195 525783577 526175766 526506233 526719513 526270828 524475822 521421738
3852.7 521421738 518347588 516835976 517535934 519713478 521994400 523450279 524046822 524280968 524531021
3861.3E24531021J60561l35884r74160j102333m18701M88930O10886l19558j352348
3870E21288414j316643k18391P17964N24483l16429m84963M89731J569328J407891
3878.7E23661385l1205j372947j350670j81694P33833L87344p68699j390648p48634
3887.4E18938065N03997J070252L81965q77800j536903j059303R8648J053924J241036
3896.1E19813881O83136k02026r26781j176148r50851n45044l04565l25318l80363
3904.7E15685921j70479L43628Q66623J029739P32918K43034n0506J487J87264J69907
3914.4E19039536j70746o39763r34830q87108n17387L0632N24292O80771L48396k83508
3924E17190285p43866o71616j62353L23143M01153P6370l53889o11496o06689l90702
$$ plain form
3861.3 524531021 524691582 524355698 523381538 522279205 521860504 522349434 522960320 522640762 521288414
3870 521288414 519971771 519753380 520471344 520995827 520679398 520194435 520684166 522253494 523661385
3878.7 523661385 523630180 522257233 520906563 520724869 521458702 521846046 521077347 519686699 518938065
3887.4 518938065 519442062 520512314 520894279 520016479 518479576 517420273 517518921 518572845 519813881
3896.1 519813881 520497017 520294991 519368210 518192062 517241211 516696167 516391602 516066284 515685921
3904.7 515685921 515515442 515859070 516725693 517755432 518488350 518731384 518680878 518682365 518869629 519039536
3914.4 519039536 518868790 518229027 517294197 516407089 515889702 515920334 516444626 517125397 517473793 517190285
3924 517190285 516446419 515774803 515612450 515935593 516336746 516413116 516059227 515447731 514841042 514450340
3933.7E14450340p1258K03056K87743J61171k5597j03722r4871j74675l86391m92630
3943.3E13753166k40974K44980M94957K01225m01459p77397o61812k68097M8561J47972
3953E12541122Q1406r6245l21769m28582k75345K1325J62696K9221j81465k42767j71891
3963.6E11117706j08146p3510j9798q316j23482k63290k51045j50986k05574m11072
3973.2E09502487m61387k52572j23863l29399n67131m42314j67503k42310n37186m10194
3982.8E05968628J27258J88523n81360j203652q32329l10745r21211j968040j563187
3991.5D98903885j66016q57086m287300n855103k277755r15795j6760521n5027771
3999.2D12756538r8408279
$$ plain form
3933.7 514450340 514379082 514582138 514869881 515031052 515005455 514901733 514806862 514632187 514245796 513753166
3943.3 513753166 513512192 513757172 514252129 514453354 514051895 513274498 512612686 512344589 512393150 512541122
3953 512541122 512622528 512526283 512204514 511775932 511500587 511521912 511684608 511713829 511532364 511289597 511117706
3963.6 511117706 511009560 510936050 510916252 510907936 510784454 510521164 510270119 510119133 509913559 509502487
3973.2 509502487 509041100 508788528 508664665 508335266 507768135 507325821 507158318 506916008 506378822 505968628
3982.8 505968628 506095886 506284409 505703049 504499397 503667068 503356323 502435112 500467072 498903885
3991.5 498903885 498737869 497880783 493593483 487738380 485460625 484544830 467784309 412756538
3999.2 412756538 314348259
4000.2C14348259
$$ plain form
4000.2 314348259
##END=$$ End of the data block
