##TITLE=$$ Begin of the data block
##JCAMP-DX=5.00 $$ ACD/SpecManager v 10.08
##SPECTROMETER/DATA SYSTEM=Varian
##DATE=30 Apr 2013 10:34:24
##DATA TYPE=INFRARED SPECTRUM
##DATA CLASS=XYDATA
##ORIGIN=
##OWNER=
##NPOINTS=3735
##FIRSTX=399.26403809
##LASTX=4000.35498047
##MAXX=4000.35498047
##MINX=399.26403809
##MAXY=86.72925568
##MINY=35.43645477
##XFACTOR=1.0000000000
##YFACTOR=0.000000100000000
##FIRSTY=48.97224045
##DELTAX=0.96440572
##XUNITS=1/CM
##YUNITS=TRANSMITTANCE
##XYDATA=(X++(Y..Y))
399.3 489722404 639100571 730383377 765154572 770604630 773765640 784269943 797011871 805158539
407 805158539 807840958 807912369 807030869 805104675 802930298 802839508 806172028 811277390 814869385
415.7 814869385 815064163 812661819 809853363 808384781 808914413 811276093 814667892 817763519 819268265
424.3 819268265 818723984 816764984 814581833 813223801 813283005 814802399 817143173 819062958 819366684
433 819366684 817781601 815212708 813107758 812588425 814048843 817167969 820905457 823558960 823388672
441.7 823388672 819776154 813964233 808499908 805670319 806178207 809004593 812277832 814334488 814375687
450.4 814375687 812633896 810145111 808207245 807730713 808807373 810706635 812223892 812206116 810156708
459.1 810156708 806718140 803604050 802689743 804688492 808477478 811796036 812832870 811378403 808646851
467.7 808646851 806138840 804668121 804241791 804498062 805003967 805172729 804195709 801407242 796895981
476.4 796895981 791671906 786952362 782995911 778577652 771871948 762277451 751689072 743930817
484.1 743930817 742555923 748643112 760245209 773723755 785725708 794359589 799186707 800692291
491.8 800692291 799950790 798485870 797889328 799119415 801993866 805404510 808130798 809548645 809723053
500.5 809723053 809043121 807955475 807024918 806973724 808303604 810693817 812864304 813315735 811483231
509.2 811483231 808306503 805664520 805103073 806856842 809823914 812337036 813091431 811712418 808820648
517.9 808820648 805692825 803668060 803517838 805079498 807371140 809125214 809404449 807975082 805324783
526.6 805324783 802420120 800334625 799831696 801003952 803133469 804934998 805162506 803311615 799987717
535.2 799987717 796631775 794685745 794706345 796036530 797280426 797223740 795535812 792814102 790090485
543.9 790090485 788246536 787681122 788250351 789344864 790061569 789524918 787313309 783755569 779844894
552.6 779844894 776747055 775183563 775067215 775603790 775770950 774855728 772750397 769902496 767043915
561.3 767043915 764891968 763913269 764134903 765040817 765692444 765148773 762970657 759388046 754919510
570 754919510 749773026 743666000 736360855 728465424 721660767 717968674 718579025 723199615 730412369
578.6 730412369 738610306 746651077 753819351 759463348 762931595 763962326 763069916 761414566 760176163
587.3 760176163 759926758 760460129 761070938 760966644 759565048 756671066 752584610 748060226 744010162
596 744010162 741041260 739124756 737656326 735866928 733289108 730003738 726568222 723722382 722019730
604.7 722019730 721544876 721837387 722067871 721384048 719263611 715741653 711474152 707624435 705547028
613.4 705547028 706288681 710079651 716127090 722927475 728985062 733519669 736723175 739441299 742543259
622 742543259 746410141 750823517 755223389 759081802 762154388 764535370 766585007 768803558 771651917
630.7 771651917 775320435 779543533 783629456 786785736 788580551 789232483 789502869 790253220 791964417
639.4 791964417 794508286 797268600 799481430 800593262 800487061 799518204 798364792 797737961 798055954
648.1 798055954 799230728 800691605 801650925 801492767 800077362 797818527 795495453 793887863 793392639
656.8 793392639 793810806 794440308 794467697 793455582 791628265 789757156 788728867 789084015 790802536
665.4 790802536 793381653 796077347 798156281 799118118 798880692 797847290 796739960 796211624 796454697
674.1 796454697 797077789 797345657 796592331 794526138 791273575 787221069 782806473 778316269 773695755
682.8 773695755 768412247 761516571 752039413 739623260 725038452 710165024 697312927 688189468
690.5 688189468 683113480 680941849 679720078 677630844 673693008 667916183 660985184 653783875
698.2 653783875 647024307 641094360 636094704 631989746 628795280 626714020 626146927 627569847 631335945
706.9 631335945 637503128 645748367 655386505 665504074 675191879 683811264 691153488 697381973
714.6 697381973 702776566 707448730 711193771 713521576 713812103 711561050 706727219 700110321 693502121
723.3 693502121 689326248 689764786 695792694 706718063 720526962 734816437 747755127 758589401
731 758589401 767560196 775406876 782771988 789789124 796031647 800819550 803697662 804785767 804789810
739.7 804789810 804682083 805261002 806822357 809072952 811284027 812620316 812525482 811014328 808704910
748.4 808704910 806528549 805239563 804996490 805234756 804874039 802708206 797801132 789797211 779127579
757.1 779127579 767042923 755345764 745805664 739491653 736421509 735778656 736542816 738088379
764.8 738088379 740376892 743718109 748366318 754231262 760816345 767360916 773124924 777726517
772.5 777726517 781355820 784699402 788560638 793404312 799109879 805059586 810452728 814654160
780.2 814654160 817449493 819153900 820514069 822382050 825268021 829030914 832931747 836041794
787.9 836041794 837751312 838076706 837628250 837310333 837909088 839738770 842477493 845289383 847215958
796.6 847215958 847665558 846732483 845152969 843918533 843773422 844869843 846735458 848523331 849385986
805.3 849385986 848814316 846832581 843985825 841113510 838964310 837816010 837326355 836734390 835323257
814 835323257 832872925 829832382 827132187 825769806 826371689 828909607 832649231 836362228 838757935
822.6 838757935 839012909 837170944 834207611 831669769 831007538 832896805 836907272 841735077 845905914
831.3 845905914 848549423 849773407 850433350 851503143 853489075 856219482 859027176 861126328 861974258
840 861974258 861514435 860234756 858988266 858601837 859452972 861263123 863247299 864518509 864519806 863276062
849.6 863276062 861384888 859757156 859197464 859995804 861750793 863561554 864500198 864083939 862477493
858.3 862477493 860350037 858510132 857519913 857438202 857792511 857794571 856715775 854227905 850508041
867 850508041 846053696 841329956 836439209 830967484 824101028 815069885 803845673 791757889
874.7 791757889 781507950 776278305 778249741 787398605 801395798 816701126 830136795 839979019
882.4 839979019 846101761 849416351 851172180 852490387 854132385 856370239 858949127 861235580
890.2 861235580 862573547 862672806 861792984 860611420 859872360 860021439 861006012 862311707 863213348
898.8 863213348 863118668 861836700 859629211 857044296 854662628 852923355 852071609 852163315 853055725
907.5 853055725 854421463 855864410 857129288 858251343 859499588 861124420 863103333 865084305
915.2 865084305 866560822 867146759 866781616 865773621 864680557 864077377 864293137 865237732 866433716
923.9 866433716 867263336 867292557 866475525 865139694 863794022 862905502 862744370 863311768 864338303
932.6 864338303 865357971 865882416 865634689 864722900 863622131 862932358 863046341 863920593 865101318
941.3 865101318 865972214 866080856 865354691 864115601 862908020 862241898 862368240 863171310 864216919
949.9 864216919 864938126 864889450 863968582 862487488 861034164 860162048 860073471 860500793 860882416 860722504
959.6 860722504 859885330 858634338 857440109 856737213 856782684 857606049 858980560 860419922 861302490
968.3 861302490 861161728 859991608 858313904 856910782 856378555 856810989 857795258 858674088 858877335
976.9 858877335 858151627 856627808 854741898 853060455 852057266 851919861 852468491 853240738 853720322
985.6 853720322 853597107 852909775 851990967 851270828 851070786 851483536 852336884 853205261 853522186 852854767
995.3 852854767 851232834 849221573 847522964 846328354 845031891 842717743 839108963 835118713
1003 835118713 832401352 832214813 834559860 838299942 842038651 844922104 846764374 847650070 847596512
1011.7 847596512 846610870 844948959 843179474 841925278 841511383 841797943 842274475 842301559 841377640
1020.3 841377640 839361420 836558380 833557968 830832214 828350372 825571823 821924133 817451706
1028.1 817451706 813090744 810278320 810141068 812848129 817565155 822958221 827823181 831440659
1035.8 831440659 833577423 834332199 834023437 833138046 832244644 831815796 832037125 832733841 833476715
1044.5 833476715 833816147 833512115 832646866 831571198 830722351 830418930 830733261 831477127 832281342
1053.1 832281342 832728500 832509689 831566925 830150833 828717728 827683258 827171936 826931152 826473007
1061.8 826473007 825345459 823357925 820657272 817647476 814817276 812542877 810937500 809807816
1069.5 809807816 808758621 807393188 805501328 803134079 800540314 798021011 795779953 793831100
1077.2 793831100 791994705 789981232 787527466 784536285 781167450 777864761 775298615 774209137
1085 774209137 775150986 778233185 783008575 788625488 794184418 799096069 803230362 806792526 810050735
1093.6 810050735 813091049 815740204 817669601 818612595 818568039 817866058 817045212 816596298 816726913
1102.3 816726913 817291946 817923889 818264847 818152695 817664185 817029648 816507263 816290817 816461334 816959229
1112 816959229 817578583 818023529 818046341 817605667 816914902 816323776 816110458 816339035 816861954 817422409
1121.6 817422409 817754898 817658768 817072296 816138992 815187454 814579849 814511566 814908600 815485611 815893097
1131.2 815893097 815853653 815259094 814239731 813161545 812472916 812432175 812903290 813404312 813393173 812582474
1140.9 812582474 811069794 809244614 807564545 806322098 805508347 804848175 803994675 802726440 800973663
1149.6 800973663 798689194 795797882 792349472 788634109 784926758 780976639 775906219 769007339
1157.3 769007339 760936661 754054871 751185074 753578568 759831924 766763916 771501465 772999191
1165 772999191 771955261 769634247 766891327 764067459 761366653 759020920 757095032 755317154 753232498
1173.7 753232498 750517883 747111435 743084335 738474426 733254776 727381287 720771408 713213882
1181.4 713213882 704349136 693811798 681450958 667507706 652678223 638076134 625108376
1188.1 625108376 615243797 609699821 609130325 613444366 621835175 633022423 645623245 658500671
1195.9 658500671 670940094 682591858 693268967 702776489 710893326 717484436 722617874 726581421
1203.6 726581421 729790192 732638092 735356140 737934036 740156250 741750717 742579346 742744217 742537689
1212.3 742537689 742278824 742162476 742208176 742301102 742265015 741922760 741155930 739958878 738461533 736878510
1221.9 736878510 735398254 734076996 732807007 731374283 729560547 727236176 724406433 721209335
1229.6 721209335 717868423 714611130 711577682 708766403 706045532 703233032 700197525 696927795
1237.3 696927795 693536606 690205536 687096329 684274445 681681290 679178772 676639786 674036484
1245 674036484 671460724 669072342 667012939 665346451 664042130 662987442 662013855 660943756 659660187
1253.7 659660187 658173599 656633224 655256424 654215317 653555832 653196716 652994461 652824173 652633057
1262.4 652633057 652462997 652438965 652727585 653471527 654724426 656422424 658417435 660557938 662781296
1271.1 662781296 665169220 667929535 671298370 675401688 680151138 685235672 690220566 694703674
1278.8 694703674 698452225 701473389 703989410 706318054 708690643 711094284 713247604 714729843
1286.5 714729843 715163574 714299316 711981735 708150330 703016586 697337418 692469711 689974136 690911331
1295.2 690911331 695301361 702153549 710044174 717807159 724885941 731218338 736874084 741770782
1302.9 741770782 745639954 748185196 749267044 748956375 747435379 744880524 741493607 737707367
1310.6 737707367 734364319 732592316 733332291 736810379 742371750 748820572 755010452 760259094
1318.3 760259094 764370728 767388916 769364014 770303955 770277176 769504929 768307648 766900558 765195465
1327 765195465 762844849 759613190 755854340 752654037 751374435 752843704 756798859 762031097 767092133
1335.7 767092133 770989685 773408966 774488831 774514618 773794861 772671585 771484680 770444107 769536743
1344.4 769536743 768572083 767324600 765654984 763542404 761067200 758378525 755645905 752985687
1352.1 752985687 750396423 747755814 744896622 741695633 738124313 734228058 730074081 725713577
1359.8 725713577 721189651 716568909 711946564 707388611 702853775 698187485 693236084 688007507
1367.5 688007507 682720337 677663727 672976074 668544388 664121246 659554138 654922104 650486069
1375.2 650486069 646522598 643193512 640526505 638464546 636919594 635797691 635012283 634497719 634210320
1383.9 634210320 634118195 634191017 634408607 634770317 635277328 635885963 636482544 636935349 637214661 637483749
1393.6 637483749 638065109 639290009 641355209 644295502 648065720 652616730 657883987 663739700
1401.3 663739700 670004654 676524658 683214340 689996872 696712494 703129120 709066391 714505463
1409 714505463 719555588 724329529 728866882 733160019 737184677 740851135 743944855 746204758 747534561
1417.7 747534561 748155289 748500061 748917618 749444504 749835815 749794312 749168625 747971725 746268921
1426.3 746268921 744086838 741426926 738344879 734987030 731493912 727817612 723608017 718328629
1434.1 718328629 711586533 703412857 694220428 684434586 674121780 662947769 650461044 636421928
1441.8 636421928 620998344 604963760 590035439 579079590 575601234 582316780 599513779 624412689
1449.5 624412689 652180405 677999649 698818054 713793488 723579483 729342804 732223129 733245697
1457.2 733245697 733297958 732963333 732374039 731300583 729443283 726696014 723221130 719365540 715526047
1465.9 715526047 711999817 708842010 705819092 702563171 698876190 694940643 691226273 688148117
1473.6 688148117 685781784 683870926 682076187 680202408 678224869 676164474 673988724 671608963
1481.3 671608963 668919449 665793228 662043686 657414093 651634293 644512177 636010780 626240959
1489 626240959 615327492 603223038 589733315 575010338 560384827 548816414 544137459 549062843
1496.7 549062843 563170891 582521439 601517143 615772820 623845673 626697388 625785866 621738358
1504.5 621738358 614620094 604992256 594237213 583696938 573660660 563385963 552072372 539609718
1512.2 539609718 526329460 512287140 497133865 480762405 463809471 447242317 431468239
1518.9 431468239 416109924 400818024 386189346 373663788 364450378 358661842 355538406 354364548
1526.6 354364548 354987831 357496567 361673088 366986656 373073845 380002861 387957916 396791954
1534.3 396791954 406097641 415814362 426689644 440007973 456739769 476836853 499242363 522527809
1542.1 522527809 545564537 567716980 588557472 607545738 624092751 637937241 649338303
1548.8 649338303 658759155 666328583 671731415 674724045 675649109 675164948 673312683 668998642 660751038
1557.5 660751038 648226700 632942924 617347031 603046188 589925957 576969032 563875732
1564.2 563875732 551909065 543321838 540085945 543010483 551653976 564708977 580478821 597363129
1572 597363129 614322929 631077385 647828064 664696655 681384964 697330322 712103424 725580750
1579.7 725580750 737759552 748507767 757570419 764795837 770290146 774322739 777109528 778710785
1587.4 778710785 779116745 778383942 776672897 774174042 771018906 767265778 762951431 758153152 753018799
1596.1 753018799 747769470 742682877 738047714 734068069 730737839 727764511 724605408 720601425
1603.8 720601425 715087967 707388229 696734772 682286224 663396454 640117569 613742447 587099075
1611.5 587099075 564304199 549798508 546800613 555785904 573902817 595952835 616633759 632818069
1619.2 632818069 644500122 653951263 663849411 675708237 689434128 703879852 717688522 729866333
1626.9 729866333 739973526 748080215 754589691 759963913 764467163 768111343 770858994 772891464
1634.6 772891464 774661789 776659317 779103851 781842728 784537506 786951523 789097824 791142273
1642.4 791142273 793181229 795111618 796739502 798054428 799397583 801278610 803908768 806853790
1650.1 806853790 809220123 810327072 810313263 810095673 810675354 812398834 814816284 817190094 819100647
1658.8 819100647 820616531 822015305 823473511 825032654 826739731 828663712 830732422 832634048
1666.5 832634048 833998642 834732666 835148163 835720444 836695328 837924957 839069138 839921112 840537415
1675.1 840537415 841104660 841758423 842544708 843475418 844500198 845382385 845708084 845187378 844040680
1683.8 844040680 843020630 842901611 843841553 845250778 846348572 846863708 847164307 847716293 848502731
1692.5 848502731 849063644 849077530 848780289 848716354 849117889 849651642 849830399 849604492 849439926 849807892
1702.1 849807892 850674820 851564255 852077484 852269058 852503967 853023682 853724518 854332581 854703751 854907303
1711.8 854907303 855066223 855181427 855128479 854788132 854179001 853494339 853029327 853020477 853472977 854132385
1721.4 854132385 854667969 854936905 855054779 855190048 855320816 855263824 854946823 854558868 854334946 854209518
1731.1 854209518 853807220 852875214 851688232 850923386 851067200 851967545 852997894 853643570 853891449
1739.8 853891449 854080505 854465179 854979706 855381088 855529785 855495758 855444336 855473862 855563812 855642319
1749.4 855642319 855686340 855770645 856018677 856481552 857050858 857519684 857764130 857860870 857987442 858197784
1759 858197784 858345795 858269348 858028641 857896881 858087311 858531113 858960876 859195175 859275665 859319305
1768.7 859319305 859307251 859095764 858638306 858126984 857864304 858001480 858423996 858876419 859158173 859203339
1778.3 859203339 859040756 858742981 858412323 858146820 857968140 857794952 857535477 857216568 856996689 857016754
1788 857016754 857242966 857479706 857549973 857455292 857353592 857399750 857622833 857942047 858265305 858541489
1797.6 858541489 858740158 858828735 858801041 858715134 858673248 858742142 858898697 859057541 859142303 859123611 859002228
1808.2 859002228 858785782 858497925 858199921 857973175 857872009 857895966 858007889 858168335 858344803 858504028
1817.9 858504028 858621674 858701782 858767929 858825607 858850479 858836823 858847427 858969727 859198456 859383087 859343567
1828.5 859343567 859058533 858720932 858583450 858744888 859087448 859405136 859560547 859531937 859371948 859173965
1838.1 859173965 859057770 859110947 859290771 859403229 859247513 858810806 858303604 857979584 857920609 858007355
1847.8 858007355 858086243 858119202 858167191 858259583 858328323 858278427 858086853 857816467 857541656 857287292 857030792
1858.4 857030792 856739502 856388092 855962143 855469971 854950943 854452515 853986588 853524704 853059235 852672577
1868 852672577 852524414 852741013 853301620 854031296 854712372 855217819 855553360 855791321 855973434 856075974
1877.7 856075974 856059418 855932770 855765228 855631866 855559311 855526199 855504456 855476456 855410233 855235901 854890060
1888.3 854890060 854399414 853910141 853600311 853546600 853671188 853823242 853905792 853925171 853932800 853951492 853963852
1898.9 853963852 853958206 853953247 853971405 853999405 853990326 853905716 853751450 853573380 853424759 853337021 853311310
1909.5 853311310 853326492 853357162 853390427 853420639 853426666 853367310 853213425 852999649 852824860 852774582 852832718
1920.1 852832718 852882614 852816544 852647934 852510071 852539139 852759018 853071899 853333511 853434143 853325729
1929.7 853325729 853026199 852619705 852233582 851962891 851791382 851598587 851261444 850758514 850156479 849507904
1939.4 849507904 848786545 847947006 847039795 846238861 845735245 845605927 845783005 846136856 846567841 847021713
1949 847021713 847453918 847812424 848062439 848205032 848259354 848234940 848137817 848001938 847893906 847871323 847933731
1959.6 847933731 848024597 848079453 848063736 847967529 847780991 847497635 847147369 846809540 846577911 846503754
1969.3 846503754 846574936 846749878 847005081 847344131 847768402 848244400 848705521 849086380 849351120 849500504
1978.9 849500504 849560089 849562454 849536209 849499054 849456940 849407730 849350052 849283447 849204025 849102173 848975601
1989.5 848975601 848847885 848767090 848774948 848863602 848965225 848990479 848893814 848708878 848525162 848423462 848423157
2000.1 848423157 848481293 848530197 848517761 848425598 848266602 848079147 847920914 847847137 847879181 847982407 848080063
2010.7 848080063 848097763 848003616 847818222 847594604 847392197 847261581 847232513 847297287 847401123 847460861
2020.4 847460861 847410049 847240219 847005157 846783600 846634293 846571960 846571808 846586990 846569138 846487885 846346817
2031 846346817 846183929 846049881 845977631 845966415 845988922 846007156 845980225 845872726 845667877 845391464 845117569
2041.6 845117569 844935379 844891357 844952316 845023346 845012436 844889984 844697723 844505539 844358902 844253845
2051.2 844253845 844157944 844042969 843899918 843727264 843517914 843268356 843005371 842796173 842713928 842778549
2060.9 842778549 842926559 843045197 843054886 842969437 842883606 842898178 843044357 843271713 843494720 843652954
2070.5 843652954 843734665 843759232 843750992 843733063 843735886 843794250 843921890 844088974 844232330 844297409 844280243
2081.1 844280243 844226303 844194260 844217148 844292526 844396973 844498367 844556732 844531479 844407425 844223785 844068756
2091.7 844068756 844026413 844114838 844269714 844388733 844400787 844301453 844136810 843962402 843821259 843745117
2101.4 843745117 843758621 843866959 844035110 844189072 844249725 844180374 844011688 843826141 843709946 843706436
2111 843706436 843793640 843899612 843943481 843881912 843734665 843573074 843476257 843486023 843592606 843751297 843909683
2121.6 843909683 844023132 844058304 844002762 843880920 843756714 843697281 843718948 843760529 843725128 843560104 843303909
2132.3 843303909 843061295 842925797 842928391 843040771 843213577 843393784 843518677 843526077 843394928 843183136
2141.9 843183136 843006287 842952194 843010254 843082352 843070068 842950821 842778397 842620773 842505722 842426071
2151.5 842426071 842369766 842336044 842315750 842276001 842175446 842002258 841793060 841615295 841526260 841538391 841615829
2162.1 841615829 841693573 841711197 841644821 841515198 841370468 841253510 841181107 841149445 841155167 841202240 841292953
2172.8 841292953 841417236 841552505 841678009 841781464 841855087 841892090 841895981 841888657 841902542 841954117 842025146
2183.4 842025146 842076340 842084503 842065430 842061844 842101898 842175217 842245026 842281799 842286377 842281189 842284546 842295990
2194.9 842295990 842305679 842308502 842309723 842314682 842316513 842298813 842247772 842165909 842074356 842003174 841973953 841987076
2206.5 841987076 842017441 842027817 841991196 841910248 841815338 841742783 841709518 841705704 841712875 841722488 841739578 841762924
2218.1 841762924 841771622 841735535 841649323 841551437 841502991 841536942 841623993 841690445 841679230 841590958 841473236
2228.7 841473236 841370392 841291199 841219635 841152878 841111526 841111069 841131973 841127548 841065826 840958939 840849609
2239.3 840849609 840768127 840705872 840632019 840532379 840426559 840346603 840299072 840251541 840160980 840021133 839877014 839794006
2250.9 839794006 839798431 839850464 839876556 839828491 839716263 839585342 839471512 839383774 839324188 839307938 839348907
2261.5 839348907 839427567 839489136 839481201 839398651 839286499 839197998 839153137 839131393 839098282 839031677 838930435
2272.1 838930435 838811798 838706818 838655319 838686523 838795166 838932343 839029160 839039307 838972092 838887634 838858261
2282.7 838858261 838920288 839050293 839185562 839269485 839289398 839281540 839297104 839362411 839461594 839552841 839604340
2293.3 839604340 839615021 839602280 839575119 839522858 839434738 839331970 839267502 839292221 839411240 839578934 839732895
2303.9 839732895 839834518 839879227 839880447 839855194 839818802 839783630 839753036 839722061 839690018 839666595 839653015
2314.5 839653015 839625931 839558640 839477692 839491119 839724045 840203018 840797501 841289749 841519165 841477814
2324.2 841477814 841293640 841134796 841112900 841230469 841381226 841410675 841226196 840884247 840566864 840442505
2333.8 840442505 840531845 840704498 840810928 840810547 840776672 840798416 840891037 840987778 840985260 840785751 840336914
2344.4 840336914 839679413 838971634 838440170 838257980 838441696 838856888 839320450 839712448 840021057 840313110
2354.1 840313110 840666656 841101151 841540070 841846313 841921310 841790390 841579056 841389008 841200867 840911407
2363.7 840911407 840466766 839936523 839444275 839041290 838667221 838237915 837745590 837260056 836846390 836502609
2373.3 836502609 836180954 835845261 835495911 835147324 834808121 834485550 834194870 833945389 833719482 833479080
2383 833479080 833205185 832926559 832702026 832570801 832516861 832482376 832416382 832307205 832177277 832052612
2392.6 832052612 831940918 831840744 831758041 831708374 831695175 831696167 831678848 831633530 831583710 831561279 831569824 831579132
2404.2 831579132 831553040 831485748 831404495 831343002 831313705 831297302 831253052 831147232 830981293 830802689 830679932
2414.8 830679932 830645905 830662766 830647354 830541687 830360565 830172043 830028534 829928589 829836349 829730759
2424.5 829730759 829622345 829525452 829430466 829310226 829153748 828987579 828859940 828803177 828807068 828823547 828796844
2435.1 828796844 828696899 828535309 828355484 828207550 828126984 828125458 828184967 828253326 828255386 828135910 827914047
2445.7 827914047 827696838 827614517 827721863 827950745 828161316 828250122 828211594 828113632 828028641 827993774 828021851
2456.3 828021851 828120193 828279877 828449631 828542252 828481140 828253860 827920609 827574463 827291107 827102509
2465.9 827102509 826999588 826946030 826890717 826783447 826599808 826360855 826130829 825986404 825970154 826064606
2475.6 826064606 826199722 826289368 826270752 826131973 825909500 825669174 825477295 825372162 825350037 825366440
2485.2 825366440 825357590 825274353 825110779 824910202 824744186 824673233 824714127 824833603 824971313 825072784
2494.8 825072784 825108719 825079269 825007401 824935455 824913864 824977264 825115738 825262527 825326843 825250702 825051727
2505.5 825051727 824816284 824649277 824616394 824715042 824881134 825020447 825048447 824927292 824683533 824398346
2515.1 824398346 824167252 824053116 824055939 824118195 824158173 824112015 823966446 823764191 823579712 823475800
2524.7 823475800 823466721 823514633 823559494 823555298 823486176 823357620 823184433 822997055 822845840 822785568 822836761
2535.4 822836761 822955093 823046265 823022995 822856827 822588120 822291870 822034302 821852646 821755981 821726685
2545 821726685 821720276 821676331 821548462 821337967 821098862 820902634 820791321 820752258 820730667 820665359 820518799
2555.6 820518799 820289917 820012207 819739227 819520950 819379425 819296570 819231033 819141998 819006577 818815155
2565.2 818815155 818567352 818280411 818003311 817806549 817736053 817770081 817823868 817810669 817706146 817556686
2574.9 817556686 817425156 817334595 817263336 817190170 817126312 817099304 817106628 817098694 817016068 816845856 816638718
2585.5 816638718 816468887 816376419 816342392 816315308 816254501 816154556 816034241 815911179 815788803 815662994
2595.1 815662994 815536118 815420380 815321579 815223999 815096664 814921341 814719696 814544983 814439621 814398651
2604.8 814398651 814376907 814339218 814298401 814294128 814331665 814348221 814259567 814045563 813789520 813617706 813588715
2615.4 813588715 813639755 813639984 813501053 813244629 812974319 812788010 812713470 812702637 812673645 812558823 812330170
2626 812330170 812005997 811636658 811280289 810974579 810728989 810530090 810356522 810183945 809984894 809731750
2635.6 809731750 809412842 809041672 808650513 808271637 807915955 807565994 807183228 806730728 806202393 805645523
2645.3 805645523 805148849 804790878 804581451 804452209 804309006 804112473 803909683 803795013 803835526 804024277
2654.9 804024277 804295654 804574356 804817200 805020752 805198135 805354767 805474319 805531311 805515976 805454483
2664.6 805454483 805395660 805370026 805352249 805264893 805030212 804632034 804135132 803641052 803219604 802864685
2674.2 802864685 802512436 802100067 801613846 801092148 800591278 800151291 799797211 799556351 799456787 799491882
2683.9 799491882 799586105 799614182 799476013 799169617 798788071 798443985 798182678 797969589 797748718 797507706
2693.5 797507706 797284470 797117844 797003250 796903687 796800537 796725922 796741180 796875687 797088470 797285309
2703.1 797285309 797382355 797361679 797277374 797213898 797233124 797349014 797534103 797740936 797915802 798011017 798001251
2713.8 798001251 797908249 797805405 797785950 797903519 798127441 798349380 798449554 798370590 798150253 797892456
2723.4 797892456 797700958 797619247 797619781 797630157 797578430 797430725 797205734 796964035 796777496 796689682 796691666
2734 796691666 796726685 796726379 796649780 796496429 796288986 796049042 795796890 795567780 795416946 795387268 795460892
2744.6 795460892 795543213 795508041 795278778 794883575 794439163 794078674 793880386 793838501 793884506 793926544
2754.3 793926544 793886414 793725357 793461380 793161240 792904587 792735825 792638702 792556839 792438202 792266617
2763.9 792266617 792053146 791812897 791559448 791316528 791123199 791008224 790953751 790888138 790725708 790421143
2773.5 790421143 789996414 789523163 789083176 788735046 788496399 788338623 788191681 787972412 787633057 787196579
2783.2 787196579 786751709 786399765 786186981 786074677 785961456 785744400 785375748 784888687 784375763 783940430
2792.8 783940430 783642349 783470993 783358765 783222198 783003464 782692566 782322845 781954193 781649704 781450806
2802.5 781450806 781355591 781319580 781279373 781190643 781046753 780869827 780688705 780527573 780407181 780342255
2812.1 780342255 780320587 780289536 780174103 779932556 779597549 779262772 779019318 778895187 778844070 778783493
2821.8 778783493 778639908 778370819 777968216 777463379 776929703 776464691 776141281 775954971 775812607 775582962
2831.4 775582962 775177460 774606018 773970718 773404846 773006973 772798004 772719345 772655258 772472916 772075195
2841.1 772075195 771453247 770702972 769979172 769400711 768976288 768611984 768193741 767673492 767090073 766523285
2850.7 766523285 766041107 765685806 765482559 765435944 765506287 765606918 765640182 765551453 765350037 765086594
2860.3 765086594 764817276 764585419 764416504 764306793 764203644 764018860 763683472 763208237 762692032 762262192
2870 762262192 761990128 761851883 761753769 761598129 761336594 760979843 760568848 760141983 759719315 759316864
2879.6 759316864 758961945 758686371 758491516 758322754 758090897 757740936 757306976 756901093 756635056 756536407
2889.3 756536407 756532211 756506653 756378632 756138992 755827560 755487747 755142441 754805222 754496536 754234390
2898.9 754234390 754005508 753751831 753396378 752905655 752325974 751759872 751297531 750956192 750676880 750367584
2908.6 750367584 749952850 749396133 748701401 747909317 747088928 746316986 745639038 745044403 744470825 743841858
2918.2 743841858 743107529 742268753 741377945 740521545 739788513 739230957 738834000 738517609 738176117 737736664
2927.8 737736664 737198410 736626434 736104584 735680771 735341873 735033875 734706421 734341049 733939819 733494415
2937.5 733494415 732977524 732377472 731732941 731122894 730603638 730152130 729673004 729067535 728296204 727384872
2947.1 727384872 726380539 725316086 724209900 723081665 721950302 720813599 719646606 718429489
2954.8 718429489 717182541 715961227 714810562 713721695 712630234 711460114 710175858 708804092
2962.6 708804092 707416077 706089172 704870605 703759003 702718582 701708984 700717545 699765091 698882446
2971.2 698882446 698080521 697349472 696682053 696095200 695613632 695228577 694873352 694447937 693878555 693160477
2980.9 693160477 692347946 691504135 690654602 689776611 688821640 687745056 686523743 685156479 683657303
2989.6 683657303 682045441 680339813 678557816 676711197 674793472 672766266 670565033 668138885
2997.3 668138885 665501022 662746658 660006485 657367325 654816589 652253494 649555664 646651230
3005 646651230 643552551 640339890 637111816 633924484 630753212 627504730 624072609 620403786 616523094
3013.7 616523094 612499771 608394279 604235306 600041161 595848045 591705360 587641411 583638840
3021.4 583638840 579655724 575682297 571787910 568119354 564854889 562137909 560038643 558563309
3029.1 558563309 557698479 557455978 557882233 559031029 560923691 563528061 566756210 570471153 574497414
3037.8 574497414 578640747 582729034 586646843 590341110 593796616 597016296 600028877 602909279
3045.5 602909279 605761414 608657227 611580849 614438667 617135544 619649277 622032814 624345284
3053.2 624345284 626583595 628677673 630551453 632184944 633627739 634962616 636262589 637573433
3060.9 637573433 638916321 640285034 641633224 642868805 643888016 644635773 645147018 645528641 645885620
3069.6 645885620 646256943 646611786 646907654 647149124 647392426 647695160 648062210 648430023 648690033 648724442
3079.2 648724442 648435516 647769547 646735611 645403442 643868256 642201843 640423737 638511696 636432838
3087.9 636432838 634167747 631720314 629126663 626456528 623796349 621207619 618696365 616229095
3095.6 616229095 613789139 611410980 609153099 607036171 605024338 603082695 601253853 599663658
3103.4 599663658 598436470 597597694 597060051 596708603 596503143 596509666 596845856 597596474 598766670 600291214
3113 600291214 602079697 604062119 606213875 608545532 611065254 613740501 616490746 619221916 621869125
3121.7 621869125 624407845 626821556 629070244 631093941 632850990 634347992 635623283 636700592
3129.4 636700592 637563400 638175240 638527336 638658142 638624458 638448830 638097916 637509880 636643448 635503960
3139 635503960 634126129 632544823 630785599 628879776 626874046 624808311 622681198 620447044 618055763
3147.7 618055763 615496368 612802467 610011635 607131042 604155426 601122055 598148575 595413017
3155.4 595413017 593093910 591319733 590158043 589622269 589681129 590259552 591246262 592514839 593941536
3164.1 593941536 595413818 596830101 598109818 599206352 600110283 600832596 601378326 601732330 601866722
3172.8 601866722 601754303 601380577 600744209 599858742 598754654 597478828 596084900 594614067 593077927
3181.5 593077927 591454353 589710884 587836990 585867157 583866768 581886635 579924355 577930756
3189.2 577930756 575862236 573731117 571599846 569515953 567444725 565261765 562819519 560033035
3196.9 560033035 556919594 553568497 550076103 546501732 542869453 539205856 535573349 532074852
3204.6 532074852 528827324 525927391 523431435 521362228 519721489 518487320 517591438 516907959 516278801
3213.3 516278801 515574112 514729347 513723869 512515717 511003036 509057465 506607666 503690987 500430603
3222 500430603 496965027 493400764 489817467 486297150 482930756 479794197 476924896 474328804 472009697
3230.7 472009697 469993401 468325882 467053490 466200714 465760956 465706253 466010132 466670303 467708092
3239.3 467708092 469142761 470962563 473117065 475535698 478151360 480912590 483788071 486768303
3247 486768303 489858208 493042984 496252670 499374084 502323380 505124664 507905693 510789375 513773041
3255.7 513773041 516714478 519451866 521950684 524347382 526855011 529615021 532618904 535744286
3263.4 535744286 538856659 541893806 544883385 547902184 551023026 554283180 557688751 561227188
3271.2 561227188 564866829 568545799 572172241 575661163 578990784 582227097 585487785 588865547
3278.9 588865547 592362289 595886993 599305191 602505417 605447197 608175697 610797043 613426628
3286.6 613426628 616122780 618853149 621517563 624018822 626327057 628489876 630584946 632661781
3294.3 632661781 634720459 636731682 638667412 640513611 642264786 643916626 645469894 646933365
3302 646933365 648321533 649645157 650907822 652106934 653233719 654267960 655180283 655952682 656609573
3310.7 656609573 657221222 657867355 658574524 659282455 659872589 660242844 660374908 660347214 660287857 660302658
3320.3 660302658 660420151 660582428 660679703 660616760 660371399 660017014 659681625 659472504 659411392 659435120
3330 659435120 659447174 659383087 659232025 659012451 658739395 658417206 658057327 657686310 657321548 656938171
3339.6 656938171 656472244 655870590 655152664 654422379 653803787 653352814 653016357 652679062 652255936 651748199
3349.3 651748199 651220016 650729523 650285110 649865265 649462891 649099808 648796997 648540649 648288345 648004990
3358.9 648004990 647688065 647356949 647028122 646709366 646412201 646155167 645940018 645723648 645424347 644968414
3368.6 644968414 644341278 643601456 642848587 642166290 641584473 641080627 640608521 640128708 639614868 639041672
3378.2 639041672 638385353 637648773 636888123 636193924 635618744 635116653 634561996 633854065 633011169 632163811
3387.8 632163811 631449585 630913696 630499496 630120163 629718513 629266853 628731346 628073692 627303619 626510620
3397.5 626510620 625820084 625294876 624872246 624407997 623795471 623052750 622301102 621660919 621158447 620726204
3407.1 620726204 620278702 619780846 619256516 618745461 618270340 617837868 617450066 617101059 616765976 616413689
3416.8 616413689 616034966 615652275 615290451 614943695 614586334 614220161 613896446 613675690 613562660 613493805
3426.4 613493805 613397331 613258133 613117828 613015022 612938881 612849731 612734566 612626495 612565308 612548828
3436.1 612548828 612533455 612488632 612449608 612507629 612748566 613181534 613716049 614202347 614511948 614612427
3445.7 614612427 614591255 614610138 614809570 615226669 615780106 616332092 616777649 617096825 617339134 617575912
3455.3 617575912 617861786 618225670 618672676 619179306 619696655 620181046 620628700 621079330 621572189 622100639
3465 622100639 622619781 623107681 623604469 624181557 624864540 625598297 626294098 626905441 627457962 628012505
3474.6 628012505 628618774 629305649 630092049 630974045 631891747 632733536 633407440 633927422 634416885 635009613
3484.3 635009613 635729065 636468849 637093887 637570839 638003960 638545189 639267082 640112305 640952911 641690903
3493.9 641690903 642309189 642845993 643344955 643840103 644369431 644976883 645679855 646439590 647182846 647863846
3503.6 647863846 648501205 649146347 649822235 650502853 651153793 651779861 652414398 653070602 653722382 654345398
3513.2 654345398 654968033 655663223 656483154 657411041 658376541 659306793 660154800 660888062 661485443 661963043
3522.9 661963043 662393036 662869720 663440094 664071655 664699249 665303268 665932465 666656570 667501907 668431168
3532.5 668431168 669370193 670243988 671003494 671650925 672256241 672933960 673771515 674758148 675781403
3541.2 675781403 676699829 677425842 677960892 678381729 678817215 679417572 680291519 681420746 682631836
3549.9 682631836 683685379 684441910 684963760 685466690 686159821 687114639 688249435 689402466 690426025
3558.5 690426025 691259460 691974716 692763214 693831558 695223007 696707764 697879486 698443298 698475342
3567.2 698475342 698415222 698765717 699740829 701150742 702607040 703840485 704855957 705831757 706909332
3575.9 706909332 708083878 709255066 710342789 711347504 712334976 713395309 714595490 715923996
3583.6 715923996 717251511 718370514 719141846 719643707 720168839 721034622 722355423 723967438 725569916
3592.3 725569916 726944046 728070145 729078369 730112076 731228638 732387314 733501892 734502945
3600 734502945 735381927 736207504 737108383 738208237 739532623 740955582 742256165 743274765 744036026
3608.7 744036026 744700546 745378189 746018677 746542587 747079086 747984695 749515152 751461716 753196793
3617.4 753196793 754181671 754438477 754496384 754887543 755756149 756954880 758377151 760009842 761643906
3626 761643906 762720337 762704239 761691208 760550232 760323257 761405411 763287888 765063858 766165161
3634.7 766165161 766658859 766968002 767416153 768032684 768692093 769340363 770057602 770929718 771896973 772749329
3644.4 772749329 773289185 773492050 773488159 773394547 773216858 772968826 772849121 773179321 774069061 775182800
3654 775182800 775958481 776119995 775942917 775956497 776413269 777095184 777614822 777805557 777793655 777804565
3663.6 777804565 778017578 778551559 779391479 780228043 780520706 779961777 778945007 778392792 778911819
3672.3 778911819 780101852 780834732 780317383 778861923 777571106 777304230 778000793 778949738 779564590
3681 779564590 779828720 780096054 780633621 781399765 782148819 782623749 782669067 782272720 781594772 780926208
3690.6 780926208 780548019 780564117 780857010 781210937 781494598 781748505 782098465 782572403 782989502 783071976
3700.3 783071976 782720032 782193832 781961136 782300110 783047562 783767090 784152679 784218216 784084015 783695679
3709.9 783695679 782886200 781721115 780650482 780202713 780525284 781291428 782046890 782563400 782836380
3718.6 782836380 782868805 782619629 782169647 781791382 781729202 781938782 782144852 782178268 782170639 782365189
3728.3 782365189 782785797 783173981 783235321 782877808 782196350 781319962 780367355 779522476 779042892 779131317
3737.9 779131317 779805832 780891724 782062149 782857437 782794647 781699066 780043335 778818741 778806229
3746.6 778806229 779831467 780811920 780691147 779397278 777878876 777204666 777671051 778748703 779732590
3755.3 779732590 780295258 780463638 780308914 779869843 779335709 779076538 779333649 779926682 780398331 780479126
3764.9 780479126 780325470 780253067 780311432 780238953 779837189 779274445 778943024 779058228 779478378 779908676
3774.5 779908676 780179977 780274658 780167847 779787979 779176865 778604736 778401260 778640823 779033890 779181137
3784.2 779181137 778947144 778575211 778428345 778622513 778920441 778992386 778775101 778538361 778562851 778775711
3793.8 778775711 778792877 778387833 777856827 777770081 778291397 778856506 778691177 777683182 776600342 776331100
3803.5 776331100 776951370 777662430 777652664 776900711 776086807 775857391 776321030 777177658 778061142 778624344
3813.1 778624344 778505783 777562637 776223145 775350647 775482101 776202011 776480408 775746994 774535446
3821.8 774535446 773939972 774476013 775597305 776345825 776328964 775963364 775862122 776161804 776497116 776494827
3831.4 776494827 776153717 775757141 775536880 775477371 775400543 775168533 774801941 774445648 774231110 774153824
3841.1 774153824 774077835 773884430 773623734 773498459 773680573 774161835 774798737 775452423 776002502 776213837
3850.7 776213837 775719299 774309311 772309341 770576553 769952621 770615768 771959000 773135071 773727036
3859.4 773727036 773892136 773936081 773879776 773526535 772883072 772341232 772313766 772726135 773004456 772662125
3869.1 772662125 771856079 771261902 771364670 771953278 772390060 772350998 772167511 772367783 772960815 773329773
3878.7 773329773 772910309 771888199 771087112 771120758 771734848 772076874 771607895 770671844 770125809 770448837
3888.3 770448837 771268082 771750259 771396179 770456848 769663010 769616089 770382156 771513672 772369461 772500610
3898 772500610 771905670 771014862 770366516 770188370 770235977 770077820 769553680 768948898 768699493 768960419
3907.6 768960419 769480972 769877319 769970245 769853210 769705353 769598389 769474030 769239273 768853683 768363647
3917.3 768363647 767896271 767614899 767630081 767914047 768298035 768568344 768589325 768378754 768096848 767954865
3926.9 767954865 768067474 768341446 768515549 768363342 767892609 767341537 766969452 766861343 766926880 767047424
3936.6 767047424 767176132 767308197 767410965 767418289 767281494 767011032 766691284 766458130 766418915 766535492
3946.2 766535492 766607513 766446991 766101990 765844574 765879745 766104965 766225052 766087112 765809937 765564194
3955.8 765564194 765347366 765065689 764761429 764600754 764627686 764674911 764601288 764502487 764548645 764674911
3965.5 764674911 764609375 764235687 763756027 763406754 763164215 762890320 762646484 762604980 762642288 762334061
3975.1 762334061 761525421 760669479 760299988 760291214 760033646 759356308 758802795 758721848 758534927 757495651
3984.8 757495651 755966568 755103455 755047150 754353027 752018890 749371490 748401794 748165283 744940567
3993.5 744940567 737640839 731264725 730390396 726492310 694461670 608437271 466586723
4000.2 466586723
##END=$$ End of the data block
