##TITLE=TEG01 $$ Begin of the data block
##JCAMP-DX=5.00 $$ ACD/SpecManager v 10.08
##SPECTROMETER/DATA SYSTEM=Alpha
##DATE=22 Aug 2014 09:29:00
##DATA TYPE=INFRARED SPECTRUM
##DATA CLASS=XYDATA
##ORIGIN=
##OWNER=
##NPOINTS=1765
##FIRSTX=399.76428223
##LASTX=3997.64306641
##MAXX=3997.64306641
##MINX=399.76428223
##MAXY=1.01936758
##MINY=0.32943362
##XFACTOR=1.0000000000
##YFACTOR=0.000000010000000
##FIRSTY=0.85688698
##DELTAX=2.03961372
##XUNITS=1/CM
##YUNITS=ARBITRARY UNITS
##XYDATA=(X++(Y..Y))
399.8 85688698 85665238 85985011 86063790 85671943 85279673 85417593 85802263 85746330 85095292 84511483
420.2 84511483 84620190 84959823 84797072 84135026 83647442 83730364 83992183 83812642 83189338 82716954
440.6 82716954 82791328 83061332 82880622 82285291 81916684 82087547 82382256 82216787 81631738 81285048
461 81285048 81435871 81679672 81542850 81047243 80662411 80684286 80814266 80599248 80064267 79662597
481.3 79662597 79680204 79847980 79666066 79076910 78538537 78435659 78554201 78347224 77698147 77076471
501.7 77076471 76911670 76990330 76757276 76109642 75555122 75511217 75718391 75590652 75034893 74566591
522.1 74566591 74600613 74954462 75094718 74857390 74681401 75003749 75609100 75889283 75647920 75343227
542.5 75343227 75475532 75887376 75981086 75590473 75199527 75274444 75654417 75780815 75461751 75097579
562.9 75097579 75130135 75484461 75685811 75503957 75270039 75415850 75888807 76191622 76043546 75781518
583.3 75781518 75892848 76378560 76772523 76716435 76445925 76512903 77006412 77418399 77354997 77066785
603.7 77066785 77085453 77528191 77945018 77902824 77585125 77546692 77994531 78494155 78540277 78243262 78145826
626.2 78145826 78525388 79024422 79108971 78821486 78724289 79137945 79710680 79857773 79553908 79369295
646.6 79369295 79706860 80285245 80499345 80241036 80053049 80389738 80992818 81271148 81127971 80911440
667 80911440 81144899 81723440 82012993 81815195 81535029 81768614 82428443 82829541 82658213 82381070
687.3 82381070 82570690 83193642 83655453 83557212 83247697 83367789 83981538 84497643 84463155 84159756
707.7 84159756 84221190 84808236 85380632 85403544 85089034 85084945 85628653 86238909 86335123 86021245 85954922
730.2 85954922 86459559 87119561 87308788 87019515 86888045 87331975 88001806 88239914 87955159 87745458
750.6 87745458 88109511 88793766 89121139 88886607 88626868 88909936 89571452 89921999 89685649 89362693
771 89362693 89532721 90108836 90448874 90176785 89698696 89665145 90096885 90365720 90022415 89387083
791.4 89387083 89132690 89387119 89570260 89174968 88439423 88019603 88120729 88199925 87646925 86605507
811.8 86605507 85779810 85553485 85567057 85206127 84404409 83708680 83583486 83867317 84022540 83924299
832.2 83924299 84102118 85022670 86423248 87594163 88218206 88658231 89371920 90243661 90667742 90349442
852.6 90349442 89734393 89406914 89297682 88738000 87356007 85641289 84359086 83647835 82918388
870.9 82918388 81624150 79888648 78175479 76620448 74965823 73117226 71555823 70977283 71612620
889.3 71612620 73061538 74776518 76606154 78714550 81015986 82901710 83717650 83473551 82797110
907.6 82797110 82151341 81336010 79898220 77887022 75927764 74546468 73631191 72634858 71217889
926 71217889 69544804 67974108 66691267 65748984 65395558 66186684 68578517 72386068 76720095
944.3 76720095 80591047 83631355 86091715 88177013 89670146 90349144 90516108 90760708 91299993
962.7 91299993 91787291 91808474 91451359 91192192 91281211 91437185 91211069 90586710 90006495 89791834
983.1 89791834 89757603 89469135 88822955 88195932 87952906 87990505 87872678 87380970 86775202 86399806
1003.5 86399806 86181617 85685241 84649545 83303648 82035249 80874127 79478335 77599603 75409871
1021.8 75409871 73303473 71475363 69818991 68221366 66837567 65962410 65628219 65425450 64780736
1040.2 64780736 63385630 61302280 58695918 55627269 52153033 48505279 45061255 42112622
1056.5 42112622 39707518 37725216 36081076 34815657 33977455 33482450 33157280 32943362 33013228
1074.9 33013228 33641756 34962589 36850512 39031979 41272393 43380466 45077378 46003836 45993519
1093.2 45993519 45289388 44355860 43509519 42749146 41886416 40800679 39555803 38293871 37128660
1111.6 37128660 36193028 35719204 35970584 37022769 38630524 40353385 41876185 43191701 44435686
1129.9 44435686 45639095 46754119 47902060 49476978 51910895 55341280 59516412 64006507
1146.3 64006507 68507820 72879046 76933259 80368358 82976335 84876722 86423522 87835884
1162.6 87835884 89017242 89785242 90204310 90573972 91085088 91614175 91912997 91943836 91941279 92124271
1183 92124271 92418635 92550611 92409045 92189592 92120695 92154890 92024118 91576111 90951651 90377796
1203.4 90377796 89864087 89176035 88124061 86826283 85609126 84672815 83946759 83288831 82727820
1221.7 82727820 82426018 82437009 82578164 82589269 82380688 82036161 81581837 80865991 79751861 78420216
1242.1 78420216 77377689 77084208 77591497 78564751 79633832 80677104 81739104 82776183 83613920
1260.5 83613920 84142971 84463203 84766603 85101140 85318506 85270810 85013235 84735686 84523338 84277266
1280.9 84277266 83878458 83373082 82932985 82654756 82454664 82192355 81873059 81669921 81729001 81996405
1301.3 81996405 82275802 82441574 82550991 82711864 82905269 82998866 82918733 82746786 82635677 82658184
1321.7 82658184 82756734 82860291 83007556 83304596 83754802 84190691 84390312 84193754 83436501 81805825
1342.1 81805825 78891659 74825495 70937538 68981314 69602621 71954024 74597389 76515913 77581656
1360.4 77581656 78287357 79154301 80261850 81375635 82323319 83142734 83885455 84467345 84834933
1378.8 84834933 85050797 85239458 85445642 85547984 85448104 85257477 85092616 84986281 84909964 84749073
1399.2 84749073 84516948 84353876 84315211 84369242 84420061 84423393 84483814 84712261 85042131 85288942 85410374
1421.6 85410374 85516489 85684264 85913068 86062241 86028582 85857171 85510987 84987575 84412330 83688688
1442 83688688 82763636 81704360 80505180 79292107 78280693 77611440 77270371 77322870 77760810 78285170
1462.4 78285170 78702098 79082823 79625404 80386376 81385374 82657242 84241211 86076587 87953246
1480.8 87953246 89596671 90862668 91906190 92950386 94013971 94914746 95598567 96090627 96461135
1499.1 96461135 96832067 97204322 97499847 97596556 97613871 97752845 97965258 98106498 98126519 98150033
1519.5 98150033 98272949 98411798 98464155 98414618 98371702 98453724 98609507 98720145 98772418 98757344 98724663
1542 98724663 98762304 98793989 98756278 98686528 98685670 98806232 98975515 99013066 98798037 98647696 98676652 98766148
1566.4 98766148 98778164 98657286 98549366 98567134 98612553 98550111 98404485 98258513 98195928 98200595 98153502
1588.9 98153502 97981369 97762704 97609365 97518820 97390544 97145087 96822774 96542054 96337026 96102965
1609.3 96102965 95762658 95388478 95024568 94636756 94302130 93958181 93485397 93036944 92723113 92463535
1629.7 92463535 92221582 91933817 91518742 91187656 91042870 90943927 90841025 90722615 90686011 90846759
1650.1 90846759 91044790 91083443 91183990 91479981 91902488 92350936 92741078 93118745 93584859 94127786
1670.5 94127786 94639748 95086282 95456541 95816630 96254873 96742690 97130603 97339213 97541589 97820431
1690.9 97820431 98133266 98423493 98626453 98780930 98932940 99070841 99182159 99214202 99209547 99279493
1711.3 99279493 99434125 99591351 99631488 99563968 99558806 99655718 99761051 99802178 99812734 99873281 99999422
1733.7 99999422 100085676 100098753 100072503 100053072 100105798 100197339 100243425 100208199 100148451 100157475 100229967 100275147
1758.2 100275147 100254261 100212431 100218403 100288248 100357461 100376260 100350559 100334799 100378990 100444829 100466669 100453997
1782.6 100453997 100468719 100533903 100620627 100671959 100645232 100607586 100646257 100724137 100747681 100704598 100671887
1805.1 100671887 100699317 100757861 100777459 100733614 100686622 100697374 100752580 100793540 100789344 100759315 100763297 100812697
1829.6 100812697 100831008 100786233 100728035 100714815 100765133 100836802 100851536 100782847 100723410 100727677 100750995 100736809
1854 100736809 100684977 100648165 100661504 100697017 100705600 100677979 100641441 100619757 100611436 100587606 100529063 100470006
1878.5 100470006 100453985 100474381 100486302 100458169 100400686 100352335 100338387 100325024 100266385 100184441 100133777
1900.9 100133777 100129640 100135136 100101674 100021160 99936897 99893373 99878514 99833494 99732876 99629277 99570060
1923.4 99570060 99539816 99486631 99381685 99257046 99168211 99122620 99074876 98993176 98892379 98821568 98811275
1945.8 98811275 98822492 98800063 98752397 98737764 98784643 98855436 98891646 98891175 98922396 99028301 99156988 99235249
1970.3 99235249 99262220 99297059 99385053 99498141 99567413 99577105 99583358 99635166 99718642 99777919 99774575 99742961
1994.8 99742961 99751079 99800861 99833143 99818432 99792647 99808210 99868411 99922168 99928910 99906915 99904490 99936944
2019.2 99936944 99972987 99977773 99953973 99941367 99967873 100010800 100023258 99994433 99960679 99956352 99972171 99967581
2043.7 99967581 99924535 99872524 99853641 99869937 99880725 99853462 99805063 99779648 99790096 99802816 99778968 99724352
2068.2 99724352 99685538 99692243 99718988 99712086 99657440 99606442 99606889 99629360 99611050 99544358 99486381 99489653 99531639
2094.7 99531639 99540269 99486458 99419653 99403059 99433261 99448472 99406630 99345040 99335533 99377918 99403471 99369758
2119.2 99369758 99306172 99279302 99310595 99344683 99324799 99271417 99254370 99298954 99353147 99357319 99318653 99300337
2143.7 99300337 99337941 99391139 99403793 99379700 99375004 99420971 99485713 99521035 99515486 99508190 99544168 99611205
2168.1 99611205 99651819 99643517 99633312 99670082 99737757 99781817 99778038 99760473 99780041 99839109 99886602 99883282
2192.6 99883282 99855179 99860823 99915117 99974436 99990386 99970770 99968052 100004578 100048876 100057411 100028801 100013149
2217.1 100013149 100046134 100101757 100126183 100102460 100072861 100083423 100122666 100140560 100117207 100087667 100099432
2239.5 100099432 100148511 100178206 100157893 100123119 100122857 100156784 100179732 100158954 100118530 100114739 100162256 100213373
2264 100213373 100217760 100183749 100165987 100193810 100237322 100245368 100208461 100179338 100207973 100265825 100281382 100243330
2288.5 100243330 100211525 100228822 100268197 100273728 100239122 100211430 100229347 100280035 100307846 100287664 100258732 100258172
2312.9 100258172 100275481 100276816 100244880 100203645 100199950 100241804 100277185 100255930 100198066 100173473 100193441 100206113
2337.4 100206113 100192273 100167906 100162709 100205934 100261819 100278533 100250292 100207806 100194120 100206506 100197303 100158989
2361.9 100158989 100139570 100167966 100217879 100241041 100231409 100231791 100267053 100300622 100296450 100267911 100244522 100244963 100263798
2388.4 100263798 100271630 100256252 100234830 100221968 100219619 100213909 100185621 100144601 100123477 100129604 100134337 100113285
2412.9 100113285 100072205 100038683 100028098 100015819 99978209 99934936 99904293 99884224 99874228 99858135 99822176 99780965
2437.4 99780965 99749023 99727458 99705869 99665874 99613827 99580330 99572361 99564999 99535799 99491286 99451196 99422354
2461.8 99422354 99400932 99375373 99337459 99302465 99287027 99279505 99263257 99235690 99202794 99181724 99178976 99172741
2486.3 99172741 99148774 99123132 99114245 99120206 99123132 99108738 99088925 99086595 99094206 99088830 99069238 99049479 99044764
2512.8 99044764 99059010 99074548 99072886 99056387 99044627 99051839 99065369 99064106 99048078 99037647 99050260 99074447
2537.3 99074447 99083656 99075586 99067420 99065852 99067736 99065042 99049002 99025488 99010259 99006575 99001932 98983264 98947895
2563.8 98947895 98914319 98897862 98881030 98846251 98799968 98760551 98739892 98727673 98708659 98680645 98646492 98618102
2588.3 98618102 98600471 98578584 98548436 98518026 98497891 98496437 98495173 98467976 98420268 98374492 98342174 98316664
2612.8 98316664 98278588 98225439 98179668 98157448 98144418 98110747 98055899 98006821 97978795 97962105 97930306 97875428
2637.2 97875428 97825909 97803199 97793424 97773671 97734946 97686911 97648871 97622967 97590250 97536993 97473705 97423697
2661.7 97423697 97386676 97340769 97274166 97190255 97103107 97022301 96936536 96825236 96685344 96531194 96369314
2684.1 96369314 96197873 96012384 95816594 95632648 95473373 95328736 95185918 95044857 94922322 94834232
2704.5 94834232 94769365 94697481 94606459 94506323 94403255 94296515 94183540 94058281 93926597 93809253
2724.9 93809253 93713319 93622535 93520480 93410730 93307990 93225241 93167299 93122470 93079472 93039620 93014258
2747.4 93014258 93008113 92999119 92960888 92891318 92805547 92706174 92580026 92417037 92221326 92014694 91809040
2769.8 91809040 91587406 91330826 91047025 90758961 90472883 90170616 89834219 89471418 89111793 88772607
2790.2 88772607 88436443 88077557 87690538 87290031 86891770 86494857 86084193 85647810 85200620 84768504
2810.6 84768504 84347892 83912367 83444220 82944953 82427955 81889522 81301016 80646592 79930896 79152441
2831 79152441 78301841 77359223 76299566 75122702 73844129 72472513 71010315 69455624 67819726
2849.3 67819726 66132897 64433104 62755233 61120105 59546655 58071935 56747025 55610108
2865.7 55610108 54674238 53952712 53469545 53227508 53191084 53312820 53550214 53868634 54246944 54656976
2886.1 54656976 55057889 55430889 55782193 56124622 56466067 56793004 57077885 57305837 57483810 57615358
2906.5 57615358 57695508 57733315 57752424 57786447 57873702 58034647 58257550 58522910 58826238 59169167 59536803
2928.9 59536803 59897131 60236996 60571963 60918027 61287862 61697412 62158018 62694007 63355881 64186621
2949.3 64186621 65190393 66359001 67706001 69241321 70946354 72782272 74703962 76663923
2965.6 76663923 78620535 80547661 82409120 84146070 85722828 87152004 88445646 89585400
2981.9 89585400 90550995 91345483 92000365 92551368 93012500 93380266 93659663 93880022 94069237 94233310
3002.3 94233310 94361907 94438845 94471312 94493145 94522566 94543803 94535506 94503343 94473249 94452244 94424111 94376940
3026.8 94376940 94312322 94241196 94170552 94097126 94014639 93919086 93817520 93723387 93633431 93525851 93396938
3049.2 93396938 93271524 93159384 93042070 92905831 92753452 92598766 92454684 92311996 92154998 91984349
3069.6 91984349 91808301 91635418 91469610 91296315 91097748 90885162 90677607 90477788 90277898 90063727
3090 90063727 89834982 89600617 89364642 89126658 88873225 88599288 88322890 88061249 87810546 87547314
3110.4 87547314 87257135 86949956 86643815 86343825 86036462 85710013 85368413 85024893 84687167 84344387
3130.8 84344387 83981305 83607364 83235806 82855105 82456869 82049960 81638896 81224859 80813897 80401689
3151.2 80401689 79974622 79526329 79063898 78600806 78136444 77658087 77166253 76673794 76183897 75692040
3171.6 75692040 75193256 74681932 74155611 73623067 73096824 72567546 72020704 71469539 70928627 70392543
3192 70392543 69854695 69310468 68755734 68196636 67643780 67094594 66537935 65969497 65400600 64847970
3212.4 64847970 64305991 63760185 63207525 62650841 62097424 61550617 61008978 60469836 59939039 59426069
3232.8 59426069 58913863 58386612 57858145 57346112 56851524 56365138 55879831 55387694 54895300 54415786
3253.2 54415786 53948718 53491211 53032577 52568054 52117574 51694232 51291913 50897962 50490576 50065285
3273.6 50065285 49641865 49231887 48832369 48438844 48052695 47676727 47311214 46955830 46606079 46255305
3294 46255305 45902252 45546108 45194432 44864434 44560677 44261694 43938065 43590111 43239835 42904967
3314.4 42904967 42596579 42313635 42042729 41774571 41507077 41236198 40967643 40716800 40485880 40267602
3334.8 40267602 40059918 39855552 39647707 39442980 39238802 39047185 38894174 38750756 38581458 38408735
3355.2 38408735 38265407 38151565 38048905 37959298 37900022 37860194 37806922 37729022 37651467 37603891 37583241
3377.6 37583241 37578794 37584734 37593782 37621918 37696013 37809405 37910673 37971678 38040125 38170725 38338926
3400 38338926 38468817 38560611 38688141 38863367 39054134 39252871 39452600 39656064 39877111 40104067
3420.4 40104067 40339395 40610451 40912035 41222861 41529071 41841432 42173854 42498159 42792711 43084398
3440.8 43084398 43414572 43778515 44131336 44482154 44865352 45262331 45660070 46072114 46496385 46902052
3461.2 46902052 47303158 47752514 48229957 48675537 49081352 49495763 49950215 50445139 50942963 51396549
3481.6 51396549 51854426 52370733 52897441 53407073 53932399 54472315 55012107 55566841 56144524 56705642
3502 56705642 57239360 57797289 58378619 58959597 59566170 60190266 60799611 61416823 62065369 62715465
3522.4 62715465 63332993 63932300 64545351 65198654 65885055 66565669 67225605 67886841 68569487 69257027
3542.8 69257027 69912863 70532107 71175057 71850914 72517383 73187077 73872781 74557996 75251806 75966561
3563.2 75966561 76629663 77192169 77777100 78453141 79137945 79793823 80435425 81069148 81716478 82386333
3583.6 82386333 83013672 83544791 84084147 84698546 85312170 85888577 86454797 87007564 87542778 88093650
3604 88093650 88655919 89180058 89665258 90157366 90667641 91179770 91644782 92052335 92477065 92955369
3624.4 92955369 93442178 93843472 94172269 94536233 94919926 95286721 95643115 95991409 96343094 96713871
3644.8 96713871 97079152 97375256 97588015 97809011 98075926 98332071 98550659 98758757 98962206 99177146
3665.2 99177146 99417496 99633574 99794644 99967718 100143564 100259173 100352192 100456655 100569844 100698924
3685.6 100698924 100841689 100945902 100984430 101004505 101044583 101112401 101193178 101255667 101291251 101340711 101415884
3708 101415884 101466405 101455879 101432645 101433063 101453578 101483572 101507449 101529229 101538527 101546896 101581848 101621127 101638079
3734.5 101638079 101624906 101603067 101626372 101695108 101727009 101713490 101732206 101745963 101703572 101663375 101658678 101665151
3759 101665151 101662612 101669097 101691794 101710165 101702666 101672554 101655829 101665187 101686704 101698363 101692986 101691532 101694167
3785.5 101694167 101694691 101697898 101700163 101711512 101733065 101752388 101775169 101777327 101765537 101775706 101770186 101737189 101733339
3812 101733339 101782739 101827490 101842070 101859117 101839828 101798964 101787162 101796329 101815021 101831865 101847517 101863599
3836.5 101863599 101856017 101829183 101810205 101799452 101794195 101814985 101880169 101936758 101896966 101831853 101808655 101808381
3861 101808381 101805675 101806831 101834869 101855898 101838720 101821423 101806366 101795530 101800370 101792800 101772690 101745474 101714969
3887.5 101714969 101702416 101697993 101684511 101675773 101686883 101699793 101690984 101648521 101583469 101531327 101500976 101489305
3912 101489305 101490569 101486015 101465976 101436043 101404870 101366150 101315367 101281238 101276720 101272559 101253366 101225889 101197636
3938.5 101197636 101180446 101170194 101150572 101125777 101106429 101089382 101069140 101050639 101036716 101026809 101023912 101006138
3962.9 101006138 100959611 100914919 100891173 100879645 100868809 100847805 100818360 100792956 100766528 100734258 100706911
3985.4 100706911 100686383 100670373 100661910 100661862 100665438 100665283
3997.6 100665283
##END=$$ End of the data block
