##TITLE=TEG01 $$ Begin of the data block
##JCAMP-DX=5.00 $$ ACD/SpecManager v 10.08
##SPECTROMETER/DATA SYSTEM=Alpha
##DATE=22 Aug 2014 09:29:00
##DATA TYPE=INFRARED SPECTRUM
##DATA CLASS=XYDATA
##ORIGIN=
##OWNER=
##NPOINTS=1667
##FIRSTX=599.64648438
##LASTX=3997.64306641
##MAXX=3997.64306641
##MINX=599.64648438
##MAXY=0.94204694
##MINY=0.82616603
##XFACTOR=1.0000000000
##YFACTOR=1.000000000000000e-9
##FIRSTY=0.85852212
##DELTAX=2.03961372
##XUNITS=1/CM
##YUNITS=ARBITRARY UNITS
##XYDATA=(X++(Y..Y))
599.6H58522117k90692O1631J59562p4506q0824K19703M42743N49257N75543L12090
620H60396624j2458J6093J90020Q1122j15514J6570K82944K78413K7299j30892j23978
642.5H60906243j71363j20997K85446N62668K53499q1361L0756K22504K00749J58191
662.9H62246335l18349j230061j64330J675963J154781K73943o139J49369M86493O61194
683.3H64929199N62906M20750K50816J42813L01003N30005M48227L16083N01871O55294
703.7H69058967M60982K47300L12447M38452M21703K54929N2988Q5652L40224M55439
724.1H72129083M69982M98593M51207M46380L92079J94728J03116K51293M29571M41909
744.5H75807941M28081M76181M75109L67939K19941K30551M00126M72367L78191K18630
$$ plain form
599.6 858522117 858231425 858293056 858452618 858378112 858297288 858516991 858959734 859508991 860084534 860396624
620 860396624 860384166 860400259 860590279 860671401 860555887 860572457 860855401 861133814 861161113 861030221 860906243
642.5 860906243 860734880 860613883 860899329 861461997 861715496 861634135 861664891 861887395 862088144 862246335
662.9 862246335 861927986 860697925 860533595 862209558 863364339 863638282 863632143 863781512 864268005 864929199
683.3 864929199 865492105 865912855 866163671 866306484 866607487 867137492 867585719 867901802 868403673 869058967
703.7 869058967 869519949 869767249 870079696 870518148 870939851 871194780 871247768 871333420 871673644 872129083
724.1 872129083 872599065 873097658 873548865 873995245 874387324 874582052 874685168 874936461 875366032 875807941
744.5 875807941 876236022 876712203 877187312 877555251 877775192 878005743 878405869 878878236 879256427 879475057
764.9H79475057K08557L27825K30313J30057L49224L82185j0074k54094j75774r5427
785.3H80567849j01507j46031k52664l77059m08412m09185m49658m44710m95076o25372
805.6H76858175p16806q54432r47118q81672p20143o01173n75423m33087k46764k01523
826H70680034j76370K7478M56869R64821J465618J827836J891494J644075J161456
844.4H79943311P60675N13613J34766k65896n83589r93908j471937j929938k252817
862.8H73854280k329588k206445j881600j541733j593769j962840k254308k309501
879.1H57774496k074361j501918o61313J66237Q98063J729608K604067L252566L490031
897.4H65677476L255308K487182J361430K84374o33836j339376j649022j669347j680315
$$ plain form
764.9 879475057 879683614 880011439 880241752 880371809 880721033 881103218 881093144 880839050 880663276 880567849
785.3 880567849 880466342 880320311 880067647 879690588 879282176 878872991 878423333 877978623 877483547 876858175
805.6 876858175 876141369 875286937 874339819 873458147 872738004 872136831 871561408 871128321 870881557 870680034
826 870680034 870503664 870531142 870988011 871952832 873418450 875246286 877137780 878781855 879943311
844.4 879943311 880703986 881217599 881352365 881086469 880502880 879508972 878037035 876107097 873854280
862.8 873854280 871524692 869318247 867436647 865894914 864301145 862338305 860083997 857774496
879.1 857774496 855700135 854198217 853536904 853703141 854601204 856330812 858934879 862187445 865677476
897.4 865677476 868932784 871419966 872781396 873065770 872431934 871092558 869443536 867774189 866093874
915.8H66093874j646221j392007j077771r28581r28223j083076j188159r16302l24070
934.1H56609464N64992J681090K671599L488779M199028M467010M188061L690422K984702
952.5H84545147K086342J380861R78708O26564L10361P0393k71499o04749p71582q86440
972.9H87464106r89258j102925j267075j398683j432538j425981j370669j176834r87530
991.3H76312613r30190q68916q12829p52031p28906r47475j260340j534522j857340
1009.6H66620064k093554k138436k176523k273917k337575k392352k382457k149045
1025.9H48676205j768828j316368q16048n25414m27187m45843p16805j063526j412392
1044.3H40183794j821160k113223k205253k051591j697839j415729j193762q62598
$$ plain form
915.8 866093874 864447653 863055646 861977875 861049294 860121071 859037995 857849836 856933534 856609464
934.1 856609464 857174456 858855546 861527145 865015924 869214952 873681962 877870023 881560445 884545147
952.5 884545147 886631489 888012350 888991058 889617622 889927983 889998376 889726877 889122128 888350546 887464106
972.9 887464106 886474848 885371923 884104848 882706165 881273627 879847646 878476977 877300143 876312613
991.3 876312613 875382423 874513507 873700678 872948647 872219741 871272266 870011926 868477404 866620064
1009.6 866620064 864526510 862388074 860211551 857937634 855600059 853207707 850825250 848676205
1025.9 848676205 846907377 845591009 844774961 844249547 843822360 843376517 842659712 841596186 840183794
1044.3 840183794 838362634 836249411 834044158 831992567 830294728 828878999 827685237 826822639
1060.6H26822639m95613j60992J74105M71890O48320Q09967J134873J496851J699150
1079H32601190J826405J931191J842439J463949R38297L58343k44260o69002q10266
1097.3H39238286o79791m79698m58241n48780p12633r12487r95279q93175n98133j91450
1117.7H32768619J60158L99768O53863R75370J216472J290619J216233J091480J106262
1136.1H40878844J322449J763105K469897L363073M295647N099118N630434N797982
1152.4H70620549N665660N371153M875243M171908L447294K778470K123654J600564
1168.7I00654495J284063J029670P94649O17325M18723K20120P4446o7890j80184k65182
1189.1I04580235m36604o65545q47459j078546j398325j677036j821578j859665j919806
$$ plain form
1060.6 826822639 826327026 826166034 826340139 826812029 827460349 828270316 829405189 830902040 832601190
1079 832601190 834427595 836358786 838201225 839665174 840603471 840961814 840717554 840048552 839238286
1097.3 839238286 838558495 838078797 837620556 837071776 836359143 835446656 834451377 833558202 832960069 832768619
1117.7 832768619 832928777 833328545 833982408 834957778 836174250 837464869 838681102 839772582 840878844
1136.1 840878844 842201293 843964398 846434295 849797368 854093015 859192133 864822567 870620549
1152.4 870620549 876286209 881657362 886532605 890704513 894151807 896930277 899053931 900654495
1168.7 900654495 901938558 902968228 903762877 904380202 904798925 905019045 905093491 905025601 904845417 904580235
1189.1 904580235 904143631 903478086 902630627 901552081 900153756 898476720 896655142 894795477 892875671
1207.5H92875671k057910k229511k354682k357065k142430j717269j261235q69929
1223.8H77885640n14150k38240j15096r1791k16067o10590j065016j265466j157284
1242.1H72611940q04782l08990J92284N89550Q39293R74536J044869J040697Q78811
1260.5H77058208O08444M06206L00348J78396j8298k13623l74914n25593o31750o63400
1280.9H76124024n82039m25696k83838j26481K5571N7041M7863J87337M84884Q25763
1301.3H76334429J077771J164973J081645Q16703M77553J10507k70725n18381p27356
1319.6H79547119r65953r35852m78030J27614M85897N01871L95537L01182m6730j090706
1340H77841949k662539m019678m578530l787637j725972O17206K242625K726912K378285
$$ plain form
1207.5 892875671 890817761 888588250 886233568 883876503 881734073 880016804 878755569 877885640
1223.8 877885640 877371490 877133250 877018154 876926363 876710296 876099706 875034690 873769224 872611940
1242.1 872611940 871807158 871498168 871690452 872280002 873119295 874093831 875138700 876179397 877058208
1260.5 877058208 877666652 878072858 878373206 878551602 878533304 878319681 877944767 877419174 876787424 876124024
1280.9 876124024 875541985 875116289 874832451 874705970 874731541 874788582 874836445 875023782 875508666 876334429
1301.3 876334429 877412200 878577173 879658818 880475521 880953074 881063581 880792856 880274475 879547119
1319.6 879547119 878581166 877645314 877167284 877294898 877780795 878282666 878678203 878979385 878932655 877841949
1340 877841949 875179410 871159732 866581202 862793565 861067593 861684799 863927424 866654336 869032621
1358.4H69032621J854182J267254O67214O61850J024723J123131J135885R12726L87609
1376.7H78067195K03669K69115L29078N00440M53830j01626l05891J68979L36409j29879
1397.1H79791319o37054q85010o08861l71695n35309m82261k60890r9420K82585Q02398
1417.5H76995802M51386m54307m00722m2438J38700J84357j36852r5666J78635p58469
1437.9H76060426j665354j371562r59814p92265j018583j407683j045466K95818J845420
1456.3H69940937J057922o95347L755J195430R33350O69062J747429K825499K521097
1474.7H80199134K193094K502739K733350K589047K565265L155946L571987K903641
1491I02414203K311289K990842L200233J621902O93858J591324L097296K059758q96275
$$ plain form
1358.4 869032621 870886803 872154057 872821271 873483121 874507844 875630975 876766860 877679586 878067195
1376.7 878067195 878270864 878539979 878869057 879369497 879823327 879721701 879415810 879584789 879921198 879791319
1397.1 879791319 879154265 878269255 877660394 877288699 876753390 876271129 876010239 875910819 876193404 876995802
1417.5 876995802 877447188 876992881 876592159 876549721 876688421 876872778 876735926 876640260 876818895 876060426
1437.9 876060426 874395072 873023510 872063696 871271431 870252848 868845165 867799699 868095517 869940937
1456.3 869940937 870998859 870303512 870307267 871502697 872436047 873105109 874852538 877678037 880199134
1474.7 880199134 882392228 884894967 887628317 890217364 892782629 895938575 899510562 902414203
1491 902414203 904725492 907716334 910916567 912538469 913232327 914823651 917920947 919980705 919084430
1509.3I19084430r88543J78516J032114J172959J062036O86467m01199p35343n33342
1527.7I20558095k05159N12779N11288K87712J479029K016366l35932j762092j425445
1546I21636641n86152L7134L33666Q90136J850724J865387j462042k637565j103044
1564.4I20824885j1026M05728k59339n85676L01302J0907j232147j029670m16875k46048
1584.8I17762041l24011l88622m13716m70459n80490o78539o81758o56069o79433p56383
1605.2I12132561q66055j040817j110911o83546k30491j115740j917541j242339r93371
1623.5I02931750j465261j604974j569689r39965K94626Q9109j827896k125442j108229
1641.9H92674029J44601Q83519r6559l74675J199842K74598k029717j123190N13435
$$ plain form
1509.3 919084430 918095887 918274403 919306517 920479476 921541512 922227979 921826780 921091437 920558095
1527.7 920558095 920352936 920865715 921377003 921664715 923143744 925160110 924824178 923062086 921636641
1546 921636641 921050489 921087623 921421289 922311425 924162149 926027536 924565494 921927929 920824885
1564.4 920824885 920813859 921219587 920960248 920374572 920675874 920686781 919454634 918424964 918008089 917762041
1584.8 917762041 917438030 917049408 916635692 916165233 915584743 914906204 914224446 913568377 912888944 912132561
1605.2 912132561 911266506 910225689 909114778 908431232 908200741 907085001 905167460 903925121 902931750
1623.5 902931750 901466489 899861515 898291826 897351861 897646487 897735596 895907700 893782258 892674029
1641.9 892674029 892818630 893702149 893605590 893230915 894430757 894705355 892675638 891552448 892065883
1660.3H92065883J202523Q33333J003921K048373K060890J358509J469732J206875
1676.6I03250039J001119J971960L176332K416789J71006J51634R31979J563847K437234
1694.9I17071939K463221J790166M97818n21779o5386O5326m2379M74751J191795J692593
1715.3I24618065R33051q54551r96471j89304J69217M73261R38177J355470J073777
1733.7I27520692l29733m50551J47939k39k9027L88324O41704K13265n30362l82721
1754.1I27189291J21176J37210K03311J02878j79351J61231O45995Q79467L97086o04511
1774.5I29053783o13451l576J97888J3351p1764M0829N17130R42409L35932m54486
1794.9I29958045j99377K19643K5928l42250k53081O1691K43127J21295j62541j65701
$$ plain form
1660.3 892065883 893268406 894101739 895105660 897154033 899214923 900573432 902043164 903250039
1676.6 903250039 904251158 906223118 909399450 911816239 911987245 912138879 913070858 914634705 917071939
1694.9 917071939 919535160 921325326 921823144 921301365 921235979 921301305 921258926 921733677 922925472 924618065
1715.3 924618065 925551116 924696565 923700094 923510790 923680007 924153268 925091445 926446915 927520692
1733.7 927520692 927190959 926740408 926888347 926888108 926859081 927247405 927889109 928102374 927572012 927189291
1754.1 927189291 927310467 927447677 927650988 927753866 927574515 927735746 928381741 929261208 929658294 929053783
1774.5 929053783 928440332 928436756 928634644 928647995 928576231 928617060 929134190 930076599 930412531 929958045
1794.9 929958045 929758668 929978311 930004239 929661989 929408908 929470599 929713726 929835021 929672480 929506779
1815.3I29506779n1678k8610J64271M42207L31640J53899O5267l71754m56810j26302
1835.7I29628909m2558P2122N61893O54637j99794p13885m92573j94907n4419m9174
1856.1I29170251p3314q3506p0453Q7083M15623L09527m27961o91891l42250j32561
1876.5I28160548j27136j49608j62006r0956Q4638J23918k09987l98218k58744k29299
1896.9I26743150k16842j44839j89901k60770k34246k14696k67089k66015q5175k1458
1917.3I24842119l24726m80592m64857n14030m37260l87728m11630l46958l04521l14772
1937.7I20855045j64926m470j88530m28319l61800j62601k8670M4882J06931J37210
1958.1I19804752J26898J32263K03192L05832L01063K33650K94328M10139L84271K65837
$$ plain form
1815.3 929506779 929455101 929426491 929590762 930032969 930364609 930518508 930583775 930212021 929755211 929628909
1835.7 929628909 929586351 929658473 930220366 930875003 930675209 929961324 929468751 929273844 929219425 929170251
1856.1 929170251 929096937 929013431 928942978 929030061 929445684 929755211 929327250 928635359 928293109 928160548
1876.5 928160548 928033412 927883804 927721798 927630842 927715480 927839398 927629411 927231193 926972449 926743150
1896.9 926743150 926526308 926381469 926191568 925930798 925696552 925481856 925214767 924948752 924863577 924842119
1917.3 924842119 924517393 924036801 923571944 923057914 922620654 922232926 921821296 921474338 921169817 920855045
1937.7 920855045 920690119 920685649 920497119 920068800 919707000 919544399 919515729 919560611 919667542 919804752
1958.1 919804752 919931650 920063913 920267105 920572937 920874000 921107650 921401978 921812117 922196388 922462225
1978.5I22462225K29835K35916K27689K44499K84016K95937J66535p510k9325N9008
1998.8I24168825J44959J91152J95920J36972O2287N2690P7188J12772J05500K8551
2019.2I25276816M3273J35839J17481L1769Q762M1008Q0824K6822r7454j09851n9843
2041.7I25495446n9545o5685r4175j53422j55509q2373j0014n3704j97112k00868n0187
2064.1I24372852J609q1479j82331k27869k03609j74165j61886j27971r3281j49966
2084.5I22971904k25842j35183l457k7657j29580j83940j84417j44899r7692p1227
2104.9I21768010j0610N543p7545j11342j00851j11461o3121J848m8280j16527j10030
2127.3I21025634j16170j19984n2213P748l576K4795R3341L3856p6950l6061O3896
$$ plain form
1978.5 922462225 922692060 922927976 923155665 923400164 923684180 923980117 924146652 924139142 924109817 924168825
1998.8 924168825 924313784 924504936 924700856 924837828 924900115 924952805 925029993 925142765 925248265 925276816
2019.2 925276816 925320089 925455928 925573409 925605178 925613940 925654948 925735772 925762594 925665140 925555289 925495446
2041.7 925495446 925435901 925370216 925276041 925122619 924967110 924884737 924874723 924821019 924623907 924423039 924372852
2064.1 924372852 924374461 924292982 924110651 923882782 923679173 923505008 923343122 923215151 923121870 922971904
2084.5 922971904 922746062 922610879 922607422 922579765 922450185 922266245 922081828 921936929 921839237 921768010
2104.9 921768010 921757400 921762943 921685398 921574056 921473205 921361744 921298623 921300471 921252191 921135664 921025634
2127.3 921025634 920909464 920789480 920737267 920745015 920741439 920766234 920859575 920893431 920816481 920780420 920844316
2149.8I20844316Q2076N2750K7836O2704J23739J15096N0784M2796J18971J70409J81437
2172.2I21872914J29819L7372O8605J56700J64986J14024O2942P7427J01328J10387
2192.6I22896504J75894J92940Q5652P15L5405Q4102O6281N5134Q0943J26004J26243
2215I23925817L9518L457M9591N7697M9413O6399O7771P5876O9857j4126p7844j6451
2239.5I24296975O3121L2366k1279J848N722k8312J1146R6678Q8454k3842m5359L3140
2264I24510658K1398j8895K3842M3154M4882J00851Q1003J8418L5643q404j13845j06811
2288.5I24631894p2658j43052k37107l20852l57091l32117l41118l88026n07951o72221
2308.9I21259701o50942m25339l38435n58138q04424q61645p46369n48721n08487o10649
$$ plain form
2149.8 920844316 920926392 920979142 921006978 921069682 921193421 921308517 921359301 921402097 921521068 921691477 921872914
2172.2 921872914 922002733 922040105 922108710 922265410 922430396 922544420 922607362 922684789 922786117 922896504
2192.6 922896504 923072398 923265338 923350990 923351705 923387110 923471212 923537493 923592627 923673570 923799574 923925817
2215 923925817 923965335 923968792 924018383 924076080 924125493 924191892 924259663 924335539 924405396 924391270 924313426 924296975
2239.5 924296975 924360096 924392462 924371183 924373031 924378753 924350441 924361587 924458265 924546719 924522877 924477518 924510658
2264 924510658 924532056 924513161 924537003 924580157 924625039 924725890 924806893 924825311 924860954 924852550 924738705 924631894
2288.5 924631894 924559236 924416184 924179077 923858225 923501134 923169017 922827899 922439873 921931922 921259701
2308.9 921259701 920608759 920183420 919844985 919286847 918482423 917620778 916874409 916325688 915817201 915206552
2329.3I15206552m29929q166k0384l59536l71456k18332J25707J064479J365364K23755
2349.7I16578054j339376k175033j888394j193762n03182K07484P37965J077890J435220
2368I12936866J760781J852572J638830J425981J440466J492917J323879R40800N15163
2386.4I25328255K02715O5267j8835j00434p9930L2008Q4520j6153j37985j67251j41442
2408.8I25050735p5399k8074q8752j43051r4056q6069j28508j10030q0585q0109r3758
2431.2I24042344j43289k17081k28226j71125j16586j12296j67846j74105j60456j92821
2451.6I22358513j54674j06037j52886k13980j89484j24812j39951k06411j91987j27196
2472I20751095j09554q1837n9962j22368j62900j27017q1539j02818j84358j70767
$$ plain form
2329.3 915206552 914776623 914768457 914748073 914388537 914017081 913798749 913924456 914988935 916354299 916578054
2349.7 916578054 915238678 913063645 911175251 909981489 909478307 909685791 910423756 911501646 912936866
2368 912936866 914697647 916550219 918189049 919615030 921055496 922548413 923872292 924813092 925328255
2386.4 925328255 925530970 925596237 925577402 925476968 925397038 925429046 925513566 925497413 925359428 925192177 925050735
2408.8 925050735 924975336 924947262 924858510 924715459 924621403 924535334 924406826 924296796 924216211 924136102 924042344
2431.2 924042344 923899055 923681974 923453748 923282623 923166037 923053741 922885895 922711790 922551334 922358513
2451.6 922358513 922203839 922097802 921944916 921730936 921541452 921416640 921276689 921070278 920878291 920751095
2472 920751095 920641541 920559704 920499742 920377374 920214474 920087457 920005918 919903100 919718742 919547975
2492.4I19547975n9724j6629o6340o2526K7120L4154l6180r0361j33395j01686J8061
2514.9I19060469Q3565M471j13130j14202k9445N007J0490J2279k3961n2691m5836
2537.3I18797016k622M7683N3883N1558K8670m9889o8367l4094k7001R239L1710l9041
2561.8I18798745j67787k23577j78159j58071j42575p9810q2135j44482j14739l7730
2582.2I17469680o4552j50442j61111j01209q2373j01090p8082l8504n3406r9302r8109
2604.6I16441500j19030j72079j26660n5253j10925j95622j50382r9600j86264l12150
2625I14913535l10778k33770k79605l52145l11136k88963l14534l05831k88785k45273
2645.4I11982715j86324j96993k46585k72691k58207k23577j85192j94788l18706m04119
$$ plain form
2492.4 919547975 919488251 919471622 919405282 919342756 919369876 919404030 919367850 919277489 919144094 919042408 919060469
2514.9 919060469 919144034 919148505 919035375 918921173 918891728 918896735 918907225 918919504 918895543 918842852 918797016
2537.3 918797016 918794394 918842077 918895960 918947518 918976188 918926299 918857932 918823838 918796837 918806076 918837786 918798745
2561.8 918798745 918630958 918407381 918229222 918071151 917928576 917848766 917766631 917622149 917507410 917469680
2582.2 917469680 917405128 917254686 917093575 916992366 916909993 916808903 916730821 916692317 916638911 916539609 916441500
2604.6 916441500 916322470 916150391 916023731 915968478 915857553 915661931 915511549 915411949 915225685 914913535
2625 914913535 914602757 914368987 914089382 913737237 913426101 913137138 912822604 912516773 912227988 911982715
2645.4 911982715 911796391 911599398 911352813 911080122 910821915 910598338 910413146 910218358 909899652 909495533
2665.8I09495533l40581k71917k75492l64602n10752n96941n97000n56827n79118p42972
2686.2I04659331q22723o67632n89668o83308o91652n59450m11391l50892l40164l71099
2706.6H99171352m16696m03046l79384l21686k91169l63707m00484l95477m02391l26574
2727H95470738j85668j40965k08616k46764k02477j60694j61767j60992j62601j72913
2747.4H93667281j62661j46449j63138k44677k97666k80618l63410n54740o19590n22256
2767.8H90312076m99785o28889p37667p44641p57336p59960o97732p25031q92937j026809
2788.2H82841289r66966q08001p80046r03725r62794q72910q23319q66294r08375r38296
2808.6H74010563r02176p99716p93576q91924r11116q84056r07183r23157r64701j068771
$$ plain form
2665.8 909495533 909154952 908883035 908607543 908242941 907732189 907135248 906538248 905981421 905402303 904659331
2686.2 904659331 903836608 903168976 902579308 901896000 901204348 900644898 900233507 899882615 899542451 899171352
2706.6 899171352 898754656 898351610 897972226 897650540 897359371 896995664 896595180 896199703 895797312 895470738
2727 895470738 895285070 895144105 894935489 894688725 894486248 894325554 894163787 894002795 893840194 893667281
2747.4 893667281 893504620 893358171 893195033 892950356 892652690 892372072 892008662 891453922 890834332 890312076
2767.8 890312076 889812291 889183402 888445735 887701094 886943758 886183798 885486066 884761035 883868098 882841289
2788.2 882841289 881874323 881066322 880286276 879382551 878419757 877546847 876723528 875857234 874948859 874010563
2808.6 874010563 873108387 872308671 871515095 870623171 869712055 868827999 867920816 866997659 866032958 864964187
2828.9H64964187j165867j241624j314879j384913j409710j322508j281619j362145
2845.3H54480922j376271j325190j244664j190782j163602j032710q94129p87795o80566
2863.6H44785213n62489l89635k22743j15513O973J92821K50995J96040L18170M65333
2884H44925165L80218K77341L28600L93391L98755L98934L82602K99632J94788J33038
2904.4H48112464J16587J27315P2003m7446o8843l219R3818J64449J14978J22249K09987
2926.8H49014342K09629K18988K24054J45793J50740K83897L50117L07680L45289M81606
2947.2H51732135O16550P91073R74596J172423J431406J583099J646876J868844K173484
2965.6H63990486K297580K353191K553225K672374K598584K586067K549052K370596
$$ plain form
2828.9 864964187 863798320 862556696 861241817 859856904 858447194 857124686 855843067 854480922
2845.3 854480922 853104651 851779461 850534797 849344015 848180413 847147703 846253574 845465779 844785213
2863.6 844785213 844222724 843833089 843610346 843494833 843501806 843694627 843945622 844141662 844459832 844925165
2884 844925165 845305383 845582724 845911324 846304715 846703470 847102404 847485006 847784638 847979426 848112464
2904.4 848112464 848229051 848356366 848428369 848380923 848312080 848308861 848402679 848567128 848682106 848804355 849014342
2926.8 849014342 849223971 849442959 849667013 849812806 849963546 850247443 850597560 850905240 851250529 851732135
2947.2 851732135 852348685 853139758 854114354 855286777 856718183 858301282 859948158 861817002 863990486
2965.6 863990486 866288066 868641257 871194482 873866856 876465440 879051507 881600559 883971155
2981.9H83971155K251088K124250J810014J441718J219451J070738Q13901O30141O33537
3000.3H95965993N22852L01659J50562O2883j1206j15275j47343q2016k1756k0921
3020.7H96605432n1677r3281j72258k14815j95563k73526m64320n17726l88324k69473
3041.1H93964469k80022l75509m05789l40700k97725l66032m54247m71890l96133k97248
3061.5H90279174l26634m70817n59151m97758m90904n06044m13417m43697n48244n25176
3081.9H85497332m62711n13971o28829o40690n38409m40896m24027m71413n74291o22451
3102.2H80179644n01335l98219m85718o31809o57261o03914n81205n29706m92513n62132
3122.6H74735832o40213o39379n87225n71192n56886n24699n33104n05031m64618n34177
$$ plain form
2981.9 883971155 886222243 888346493 890156507 891598225 892817676 893888414 894702315 895332456 895965993
3000.3 895965993 896488845 896790504 896941066 897003949 896992743 896877468 896730125 896648109 896626353 896605432
3020.7 896605432 896553755 896460474 896288216 896073401 895877838 895604312 895139992 894622266 894233942 893964469
3041.1 893964469 893684447 893308938 892903149 892562449 892264724 891898692 891444445 890972555 890576422 890279174
3061.5 890279174 889952540 889481723 888922572 888424814 887933910 887427866 887014449 886570752 886022508 885497332
3081.9 885497332 885034621 884520650 883891821 883251131 882712722 882271826 881847799 881376386 880802095 880179644
3102.2 880179644 879678309 879280090 878794372 878162563 877505302 876901388 876320183 875790477 875297964 874735832
3122.6 874735832 874095619 873456240 872869015 872297823 871740937 871216238 870683134 870178103 869713485 869179308
3143H69179308o49988o90341o16133m61519m14908n35011n85258n20111n08487n59389
3163.4H63638163n92888n57005m11451l22342m62174o20187o06060n14030m05133l67105
3183.8H58779788m55260n17726n30541m59314k79486k58922l96967m33505l89516l61562
3204.2H54696989l76821m56154m62532l38077k63811k74121k62201l26455m33147l60071
3224.6H51143599k07901j83225k63870l25680l21805k60770k39552k75135k30550k07782
3245H48627329k68102k81334k25961j67549j68681k03252j83403j37150j64688j91092
3265.4H46636117j40310j24335k08259k26795j51277j17183j13129j60694j81199j36375
3285.8H45076561j46210j94311q8275J47462Q9526j83940k74360j94609m5419j9431
$$ plain form
3143 869179308 868529320 867838979 867222846 866761327 866346419 865811408 865226150 864706039 864197552 863638163
3163.4 863638163 863045275 862488270 862076819 861754477 861292303 860672116 860066056 859552026 859146893 858779788
3183.8 858779788 858324528 857806802 857276261 856816947 856537461 856278539 855881572 855448067 855058551 854696989
3204.2 854696989 854320168 853864014 853401482 853063405 852799594 852525473 852263272 851936817 851503670 851143599
3224.6 851143599 850935698 850752473 850488603 850162923 849841118 849580348 849340796 849065661 848835111 848627329
3245 848627329 848359227 848077893 847851932 847684383 847515702 847312450 847129047 846991897 846827209 846636117
3265.4 846636117 846495807 846371472 846163213 845936418 845785141 845667958 845554829 845394135 845212936 845076561
3285.8 845076561 844930351 844736040 844647765 844795227 844884753 844700813 844426453 844231844 844186425 844166994
3306.2H44166994j80364k75313j95444r9480j23263j06394J7405n424j31905j18256
3326.6H42948556l4332m4048j07706j65641j69575o3718k9564j77919k53439q4401
3347H41818213K2591j01805j43707k5868M8756k9504j74880j15335J27554J60336m2379
3369.4H41543972j94966j98901p1466R716n2810p6890m2677n6922q643J51753J63496
3391.9H41165662k4438p7009K5510N6685k5571j30713j15096K503J08600J68264J24514
3414.3H41278911m1902n1499J50383J77085N5313L0816P3731R4235J56045K27391J07706
3436.7H42258215o3181k742J64509K68340K86281J31309M6432J49310J51813J38164
3457.1H43528450K59399L28422K31385J64449K30074J64151N0485J74284K95043K85506
$$ plain form
3306.2 844166994 843986630 843711317 843515873 843416393 843293130 843186736 843204141 843198717 843066812 842948556
3326.6 842948556 842914224 842870176 842762470 842596829 842427254 842363536 842333972 842156053 841902614 841818213
3347 841818213 841840804 841738999 841595292 841569424 841618180 841588676 841413796 841298461 841426015 841586351 841543972
3369.4 841543972 841349006 841150105 841078639 841088355 841035545 840958655 840915978 840859056 840850413 841002166 841165662
3391.9 841165662 841141224 841064215 841089725 841146410 841120839 840990126 840875030 840877533 840986133 841154397 841278911
3414.3 841278911 841237009 841185510 841335893 841512978 841568291 841599107 841672838 841767073 841923118 842150509 842258215
3436.7 842258215 842195034 842192292 842356801 842625141 842911422 843042731 843089163 843238473 843390286 843528450
3457.1 843528450 843787849 844116271 844347656 844512105 844742179 844906330 844956815 845131099 845426142 845711648
3477.5H45711648K58685J63495J55986K61127K26677J72257K57671M03047M90427M10199
3497.9H48511219L59893M01080K69532J64449L02076L70264L58701M15862M11212M20332
3518.3H51984620N71013P48932O89447M95732M74930M62770L77297M14789N43654N70118
3538.7H57333302N19097O40810R52780R85742O30319M89235O30677O68287P03394Q29578
3559.1H64383221R09567J026988J348555J433372O76453J25587M77195Q86083Q93295
3577.5H72160316Q06987Q73446J094759J525581J721620J025081M99546Q70645J231492
3595.8H81809473J182139J151800J143515J197160J596450J964808J778841J435637
3612.1H93259823J218617J231075J462876J004100L65675Q92579K119303K637804J263618
$$ plain form
3477.5 845711648 845970333 846133828 846289814 846550941 846777618 846949875 847207546 847610593 848101020 848511219
3497.9 848511219 848871112 849272192 849541724 849706173 850008249 850378513 850737214 851153076 851564288 851984620
3518.3 851984620 852555633 853304565 853994012 854489744 854964674 855427444 855804741 856219530 856763184 857333302
3538.7 857333302 857852399 858493209 859445989 860431731 861062050 861551285 862181962 862850249 863553643 864383221
3559.1 864383221 865292788 866319776 867668331 869101703 869778156 869903743 870380938 871267021 872160316
3577.5 872160316 872967303 873840749 874935508 876461089 878182709 879207790 879707336 880577981 881809473
3595.8 881809473 882991612 884143412 885286927 886484087 888080537 890045345 891824186 893259823
3612.1 893259823 894478440 895709515 897172391 898176491 898542166 899434745 901554048 904191852 905455470
3630.5I05455470K12908O67274J114428J202702J243771J334786J776278K606928K575040
3648.8I18189585Q05259j16646M78327P01010M31061O09815R30369J284361J869202
3667.2I25182343K011477J426161J396715J250923r9063o47247j37865N45859J248658
3685.6I32177961J602530Q78096l80397o76334k26974L22520P20442N23090k9802K41518
3706I35152650J139581J353085J85430r81986p57754L7372L84748K06113j7524j68443
3726.4I36533272O6221Q73745J417338Q04365m73857r15706L3259J212180R34720O7055
3746.7I40552592L60847m3690j346589j134753r6142L4511n31971l59655K56896M33266
3767.1I38125312J08779n42224o99460j04368N02885L73244k12193k43783j26362k08675
$$ plain form
3630.5 905455470 905668378 906335652 907450080 908652782 909896553 911231339 913007617 915614545 918189585
3648.8 918189585 918994844 918878198 919356525 920057535 920488596 921098411 922028780 923313141 925182343
3667.2 925182343 927193820 928619981 930016696 931267619 931168556 930521309 930383444 930929303 932177961
3685.6 932177961 933780491 934658587 934278190 933601856 933374882 933697402 934417844 934940934 934911132 935152650
3706 935152650 936292231 937645316 937830746 936848760 936091006 936128378 936513126 936719239 936701715 936533272
3726.4 936533272 936599493 937473238 938890576 939694941 939221084 938305378 938338637 939550817 940485537 940552592
3746.7 940552592 940913439 940869749 939523160 938388407 938292265 938326776 937794805 937435150 937692046 938125312
3767.1 938125312 938234091 937691867 936992407 936888039 937390924 937764168 937551975 937308192 937181830 936973155
3787.5I36973155k3365L05593M87089M62413O53803J061618L46482p11381n29647n76139
3807.9I38449621q74817j68562Q63254Q73446M06564L39865l03387o63340l07024j50263
3828.3I38465357p987K13682N73457Q49187L00348n06580p88689q13841l78192O79791
3848.7I38586533J875579J584828j126110k078891p98702L03805M14133k8372J27852
3867.1I38860655L39031j80304n34594n57602k54452K53260K36154R7394j88828n45382
3887.5I37525332k27809j16885l73959l6419N02467N57781K02060m27545j002371r33111
3907.9I35669541m93168j73808P2658K17498P4029j73211k56539k43067k26439o8128
3928.3I34399366L3915k12013m49539m02212k00689J34528J99258k17258l78192j52290
$$ plain form
3787.5 936973155 936949790 937255383 937742472 938204885 938858688 939920306 940266788 939555407 939025760 938449621
3807.9 938449621 937574804 937406242 938269496 939142942 939549506 939889371 939585984 938922644 938615620 938465357
3828.3 938465357 938457370 938671052 939244509 940093696 940394044 939887464 939098775 938284934 937906742 938586533
3848.7 938586533 940462112 942046940 940920830 938841939 938043237 938347042 938761175 938732803 938860655
3867.1 938860655 939199686 939019382 938484788 937927186 937672734 937925994 938162148 938259542 938070714 937525332
3887.5 937525332 937297523 937180638 936806679 936770260 937272727 937830508 938032568 937605023 936602652 935669541
3907.9 935669541 935176373 935002565 935075223 935292721 935366750 935193539 934937000 934693933 934467494 934399366
3928.3 934399366 934433281 934221268 933771729 933369517 933168828 933303356 933502614 933285356 932907164 932754874
3948.7I32754874k7418q0466j15931o1810l2604o5744k17438l01718j21951O8306J6928
3971.1I31815028k23160l16679j59443p0333j62423k68578k46525j24335r3103p7963
3991.5I30072486J3173k5868j53423
3997.6I29906368
$$ plain form
3948.7 932754874 932727456 932646990 932531059 932469249 932436645 932370901 932153463 931851745 931729794 931798100 931815028
3971.1 931815028 931591868 931275189 931115746 931045413 930882990 930614412 930367887 930243552 930150449 930072486
3991.5 930072486 930085659 930059791 929906368
3997.6 929906368
##END=$$ End of the data block
