##TITLE=TEG01 $$ Begin of the data block
##JCAMP-DX=5.00 $$ ACD/SpecManager v 10.08
##SPECTROMETER/DATA SYSTEM=Alpha
##DATE=22 Aug 2014 09:29:00
##DATA TYPE=INFRARED SPECTRUM
##DATA CLASS=XYDATA
##ORIGIN=
##OWNER=
##NPOINTS=1520
##FIRSTX=899.46972656
##LASTX=3997.64306641
##MAXX=3997.64306641
##MINX=899.46972656
##MAXY=0.87994444
##MINY=0.79994833
##XFACTOR=1.0000000000
##YFACTOR=1.000000000000000e-9
##FIRSTY=0.83031845
##DELTAX=2.03961372
##XUNITS=1/CM
##YUNITS=ARBITRARY UNITS
##XYDATA=(X++(Y..Y))
$$ plain form
899.5 830318451 831118703 831104100 830413938 829291344 828079522 826896250 825624168 824387848 823410451
917.8 823410451 822722852 822219729 821724415 821245492 820886374 820631862 820635021 821175158 822383940 824277401
938.2 824277401 826637566 829132557 831635714 834110081 836355269 838054121 839082658 839632511 839884579
956.6 839884579 839797556 839469194 839079261 838573813 837890089 837058008 836156487 835253656 834309340 833313942
977 833313942 832279027 831176817 830045223 828945220 827933967 826990962 826053143 825202107 824528635
995.3 824528635 823972106 823378086 822670341 821887910 821017206 820033789 819002450 817918241 816655576
1013.7 816655576 815237701 813837349 812500060 811231196 810130119 809235811 808503151 807981133 807705998
1032 807705998 807531476 807287335 806855619 806207478 805386484 804366052 803180754 802017272 801081419
$$ packed form
899.5H30318451Q00252j4603o90162j122594j211822j183272j272082j236320r77397
917.8H23410451o87599n03123m95314m78923l59118k54512L159N40137J208782J893461
938.2H24277401K360165K494991K503157K474367K245188J698852J028537N49853K52068
956.6H39884579q7023l28362l89933n05448o83724q32081r01521r02831r44316r95398
977H33313942j034915j102210j131594j100003j011253r43005r37819q51036o73472
995.3H24528635n56529n94020p07745p82431q70704r83417j031339j084209j262665
1013.7H16655576j417875j400352j337289j268864j101077q94308p32660n22018k75135
1032H07705998j74522k44141m31716o48141q20994j020432j185298j163482r35853
$$ plain form
1050.4 801081419 800469756 800099909 799948335 800166726 800731003 801484883 802427590 803562224 804844320
1068.8 804844320 806267262 807768703 809337556 811083078 812972009 814829350 816456020 817631006
1085.1 817631006 818244338 818284094 817803681 817037225 816268325 815614641 815083921 814640701 814195991 813663125
1105.5 813663125 813022673 812334955 811749160 811502695 811735868 812376559 813340068 814609230 816048682
1123.8 816048682 817502022 818991721 820494056 821948528 823390961 824856758 826556504 828807473
1140.1 828807473 831783056 835546851 839991689 844819844 849678397 854223192 858223498 861638784
1156.5 861638784 864415944 866471052 867900550 868821323 869282186 869429886 869393468 869177103 868807137
1174.8 868807137 868381262 867927372 867358088 866623640 865831077 865099192 864339471 863392830 862223744
$$ packed form
1050.4H01081419o11663l69847j51574K18391N64277P53880R42707J134634J282096
1068.8H04844320J422942J501441J568853J745522J888931J857341J626670J174986
1085.1H17631006O13332L9756m80413p66456p68900o53684n30720m43220m44710n32866
1105.5H13663125o40452o87718n85795k46465K33173O40691R63509J269162J439452
1123.8H16048682J453340J489699J502335J454472J442433J465797J699746K250969
1140.1H28807473K975583L763795M444838M828155M858553M544795M000306L415286
1156.5H61638784K777160K055108J429498R20773M60863J47700l6418k16365l69966
1174.8H68807137m25875m53890n69284p34448p92563p31885p59721r46641j169086
$$ plain form
1193.2 862223744 860896647 859500527 858029604 856410325 854684949 852949619 851169229 849291205
1209.5 849291205 847382009 845542192 843867242 842427850 841249466 840379357 839819849 839508414 839404345
1227.9 839404345 839382052 839224637 838855922 838311374 837554634 836696684 836025059 835722029 835855603 836363554
1248.3 836363554 837115884 838011146 838994145 840025008 840927005 841488719 841610670 841355860 840983272
1266.6 840983272 840665698 840323865 839913249 839478314 839006364 838513136 838043869 837650061 837402999 837271690
1287 837271690 837184548 837172627 837241769 837343633 837577045 838032424 838587582 839160383 839784145 840370715
1307.4 840370715 840771675 840949595 840867698 840510964 839959860 839268982 838554621 838021874 837786496 837843716
1327.8 837843716 838092327 838334501 838439584 838416636 838061333 836824775 834534049 831645548 828889251
$$ packed form
1193.2H62223744j327097j396120j470923j619279j725376j735330j780390j878024
1209.5H49291205j909196j839817j674950j439392j178384q70109n59508l11435j04069
1227.9H39404345k2293j57415l68715n44548p56740q57950o71625l03030J33574N07951
1248.3H36363554P52330Q95262R82999J030863R01997N61714J21951k54810l72588
1266.6H40983272l17574l41833m10616m34935m71950m93228m69267l93808k47062j31309
1287H37271690q7142j1921O9142J01864K33412M55379N55158N72801O23762N86570
1307.4H40370715M00960J77920q1897l56734n51104o90878p14361n32747k35378N7220
1327.8H37843716K48611K42174J05083k2948l55303j236558k290726k888501k756297
$$ plain form
1346.2 828889251 827196121 827103615 828382492 830385804 832423508 834096909 835352302 836106658 836389840
1364.5 836389840 836752295 837437212 838195503 838966489 839479923 839531541 839509845 839591980 839701772 839942276
1384.9 839942276 840175033 840008318 839802861 839989960 840133846 839882016 839289665 838543952 838129461 837919116
1405.3 837919116 837521970 837178469 837062180 837105930 837525666 838354886 838652730 838148534 837748289 837625980
1425.7 837625980 837748587 837898433 837724388 837697387 837823987 837051153 835760951 834862828 834316850 833961487
1446.1 833961487 833452344 832720220 832500517 833495200 835338056 835919380 835324943 835617125 836685658
1464.5 836685658 837350786 838074267 839873195 842213333 843878627 845194340 846815467 848666191 850395083
1482.8 850395083 852149844 854405642 856859148 858659863 860096693 862145841 864224136 864938974
$$ packed form
1346.2H28889251j693130r2506J278877K003312K037704J673401J255393P54356K83182
1364.5H36389840L62455O84917P58291P70986N13434N1618k1696Q2135J09792K40504
1384.9H39942276K32757j66715k05457J87099J43886k51830n92351p45713m14491k10345
1405.3H37919116l97146l43501j16289M3750M19736Q29220K97844n04196m00245j22309
1425.7H37625980J22607J49846j74045k7001J26600p72834j290202q98123n45978l55363
1446.1H33961487n09143p32124k19703R94683J842856N81324n94437K92182J068533
1464.5H36685658O65128P23481J798928K340138J665294J315713J621127J850724J728892
1482.8H50395083J754761K255798K453506J800715J436830K049148K078295P14838
$$ plain form
1499.1 864938974 864973843 865934372 868301928 869656563 868491709 867427588 867433250 868219614 869116068
1517.5 869116068 869877458 870295048 869811594 869064093 868361950 867931306 868303418 868725181 868807018 869928956
1537.9 869928956 871606708 871149600 869424284 868067920 867466688 867399931 867600799 868293524 869894028
1556.2 869894028 871541262 870027006 867424488 866362512 866371751 866727769 866420329 865796626 866000473
1574.6 866000473 865955114 864791811 863815129 863337874 863016129 862782001 862565935 862264276 861896396 861402929
1595 861402929 860770762 860208273 859717011 859115779 858475626 857864261 857090652 856226444 855837703 855917037
1615.4 855917037 855102837 853571355 852769971 852158248 851086795 849968970 848866284 848312438 848813593
1633.7 848813593 848912537 847362339 845848858 845318675 845784485 846620679 846492350 846497357 847837806 847737432
$$ packed form
1499.1H64938974L4869R60529K367556J354635j164854j064121N662P86364Q96454
1517.5H69116068P61390M17590m83454p47501p02143m30644L72112M21763Q1837J121938
1537.9H69928956J677752m57108j725316j356364o01232o6757K00868O92725J600504
1556.2H69894028J647234j514256k602518j061976R239L56018l07440o23703K03847
1574.6H66000473m5359j163303r76682m77255l21745k34128k16066l01659l67880m93467
1595H61402929o32167n62489m91262o01232o40153o11365p73609q64208l88741P9334
1615.4H55917037q14200j531482q01384o11723j071453j117825j102686n53846N01155
1633.7H48813593R8944j550198j513481n30183M65810Q36194j28329N007J340449j00374
$$ plain form
1654.1 847737432 845847011 845119834 845752835 846803844 847462535 848390400 850136340 851467490 852172494
1672.5 852172494 853218138 854034543 854645848 856147885 858653963 860328734 860098422 859970808 860493064
1690.9 860493064 861624420 863513947 865384340 866833091 867123783 866456509 866274416 866147876 865874410
1709.2 865874410 866116226 867042899 868398666 869066417 868189156 867176712 866871715 866943538 867346764
1727.6 867346764 868156433 869328499 870195389 869727015 869223893 869319320 869256496 869117022 869334400 869885743
1748 869885743 870153069 869569480 868938804 868921041 869108617 869272411 869177580 868853569 868982434 869598746
1768.4 869598746 870339990 870579123 869931638 869281769 869212806 869394362 869443238 869370222 869290352 869567454
1788.8 869567454 870293379 870605409 870169342 869863927 869972944 869994581 869675934 869371057 869384944 869623065
$$ packed form
1654.1H47737432j890421p27177O33001J051009O58691R27865J745940J331150P05004
1672.5H52172494J045644Q16405O11305J502037K506078J674771k30312j27614N22256
1690.9H60493064J131356J889527J870393J448751K90692o67274j82093j26540k73466
1709.2H65874410K41816R26673J355767O67751q77261j012444l04997P1823M03226
1727.6H67346764Q09669J172066Q66890m68374n03122R5427o2824j39474K17378N51343
1748H69885743K67326n83589o30676j7763J87576J63794r4831l24011J28865O16312
1768.4H69598746P41244K39133o47485o49869o8963J81556M8876p3016p9870K77102
1788.8H69567454P25925L12030m36067l05415J09017K1637l18647l04877J3887K38121
$$ plain form
1809.2 869623065 869696200 869471550 869276524 869220495 869200289 869301796 869562685 869747698 869913697 870062113
1829.6 870062113 869744420 869263053 869083643 869072676 869215071 869698167 870087206 869715095 869053006 868659496
1850 868659496 868499458 868415296 868335962 868286788 868261278 868245780 868324280 868656039 868920505 868535578 867874444
1872.4 867874444 867543876 867458224 867332697 867159069 867071748 867037594 867074549 867190003 867095947 866839588
1892.8 866839588 866660833 866457522 866195142 865962446 865788043 865675509 865598738 865493596 865286887 865035474
1913.2 865035474 864913225 864845335 864599586 864296854 864033878 863705277 863367558 863078296 862804353 862522542
1933.6 862522542 862272561 862126470 862124920 862157941 861987650 861663401 861429334 861320317 861258388 861243665
1954 861243665 861297011 861400902 861518860 861619413 861766875 862015069 862252057 862400770 862533569 862698019
$$ packed form
1809.2H69623065P3135k24650j95026n6029k0206J01507K60889J85013J65999J48416
1829.6H70062113l17693m81367j79410j0967J42395M83096L89039l72111o62089l93510
1850H68659496j60038q4162p9334m9174k5510j5498P8500L31759K64466l84927o61134
1872.4H67874444l30568q5652j25527j73628q7321l4154L6955J15454r4056k56359
1892.8H66839588j78755k03311k62380k32696j74403j12534p6771j05142k06709k51413
1913.2H65035474j22249o7890k45749l02732k62976l28601l37719k89262k73943k81811
1933.6H62522542k49981j46091j550L3021j70291l24249k34067j09017o1929j4723
1954H61243665N3346J03891J17958J00553J47462K48194K36988J48713J32799J64450
$$ plain form
1974.4 862698019 862889886 863110363 863319159 863480330 863656640 863881648 864089429 864238024 864275753 864214599
1994.8 864214599 864177704 864188492 864195228 864208639 864294589 864445269 864545882 864547849 864554167 864643693 864716411 864742696
2019.2 864742696 864791095 864802063 864781082 864779115 864758074 864714742 864662290 864617169 864623785 864682019 864654720 864484251
2043.7 864484251 864366174 864383996 864396393 864282727 864062667 863884628 863833845 863836825 863788903 863665104 863502860
2066.2 863502860 863358140 863284469 863254428 863165259 862981617 862833381 862754285 862617314 862496078 862476051
2086.6 862476051 862450421 862379551 862309515 862235665 862106442 861954331 861877739 861852705 861783326 861677885 861586273
2109 861586273 861518204 861465931 861405611 861341536 861300647 861279964 861236989 861137509 861024141 860950112 860891581 860831201
2133.5 860831201 860831678 860885561 860890269 860862076 860867739 860848427 860793948 860771835 860765159 860794604 860890627 860938311
$$ packed form
1974.4H62698019J91867K20477K08796J61171J76310K25008K07781J48595L7729o1154
1994.8H64214599l6895J0788O736J3411Q5950J50680J00613J967O318Q9526P2718K6285
2019.2H64742696M8399J0968k0981j967k1041m3332n2452m5121O616N8234k7299j70469
2043.7H64484251j18077J7822J2397j13666k20060j78039n0783K980m7922j23799j62244
2066.2H63502860j44720p3671l0041q9169j83642j48236p9096j36971j21236k0027
2086.6H62476051k5630p0870p0036p3850j29223j52111p6592k5034o9379j05441r1612
2109H61586273o8069n2273o0320o4075m0889k0683m2975r9480j13368p4029n8531o0380
2133.5H60831201M77N3883M708k8193N663j9312n4479k2113o676K9445R6023M7684
$$ plain form
2157.9 860938311 860918105 860954285 861051202 861142278 861217022 861294210 861370742 861441731 861552000 861678421 861730993
2180.4 861730993 861744106 861819267 861950397 862056255 862140179 862228036 862262011 862284720 862375677 862456024 862460494
2202.8 862460494 862456620 862513363 862569809 862572312 862603843 862680078 862722874 862728179 862745285 862795949 862852514 862869799
2227.3 862869799 862847030 862821102 862782538 862731636 862745345 862786293 862752497 862724245 862768531 862773597 862672865
2249.7 862672865 862558961 862533212 862565577 862582147 862559021 862536490 862547874 862489820 862335801 862273037 862358510
2272.2 862358510 862456083 862523854 862593412 862655401 862709820 862708569 862560272 862265646 861929953 861594856 861190975
2294.6 861190975 860730648 860277712 859838426 859337926 858607173 857639909 856659472 855799079 855032921 854234040
2315 854234040 853127420 851633966 850141823 849033535 848188877 847257674 846252441 845541716 845207036
$$ packed form
2157.9H60938311k0206L6180R6917R1076P4744P7188P6532P0989J10269J26421N2572
2180.4H61730993J3113P5161J31130J05858Q3924Q7857L3975K2709R0957Q0347M470
2202.8H62460494l874N6743N6446K503L1531P6235M2796N305J7106N0664N6565J7285
2227.3H62869799k2769k5928l8564n0902J3709M0948l3796k8252M4286N066j00732
2249.7H62672865j13904k5749L2365J6570k3126k2531J1384n8054j54019o2764Q5473
2272.2H62358510R7573O7771O9558O1989N4419j251j48297k94626l35693l35097m03881
2294.6H61190975m60327m52936m39286n00500p30753r67264r80437q60393p66158p98881
2315H54234040j106620j493454j492143j108288q44658r31203j005233p10725l34680
$$ plain form
2333.3 845207036 844826162 844190538 843620896 843497157 844256759 846386075 848541081 848641992 846419692
2351.7 846419692 843083918 840042233 837970674 836981893 837012708 838167787 840160966 842574954 845285833
2370.1 845285833 848127604 850840628 853348494 855818689 858216345 860224366 861638188 862457693
2386.4 862457693 862867415 863080204 863155127 863106012 863005936 862906933 862803519 862752497 862793207 862790644 862682283
2408.8 862682283 862597764 862580419 862541020 862439513 862325251 862221122 862103343 862000942 861941814 861901045
2429.2 861901045 861846149 861741543 861584246 861429989 861307383 861229181 861215949 861191452 861071050 860913932
2449.6 860913932 860761404 860585928 860445559 860362053 860259175 860132933 860027254 859948516 859888315 859831929
2470 859831929 859759688 859642863 859501362 859396040 859302402 859223604 859194219 859120429 858996451 858956635 858973145
$$ packed form
2333.3H45207036l80874o35624n69642j23739P59602K129316K155006J00911k222300
2351.7H46419692l335774l041685k071559r88781L0815J155079J993179K413988K710879
2370.1H45285833K841771K713024K507866K470195K397656K008021J413822Q19505
2386.4H62457693M09722K12789P4923m9115j00076r9003j03414n1022M0710k563j08361
2408.8H62682283q4519j7345l9399j01507j14262j04129j17779j02401n9128m0769
2429.2H61901045n4896j04606j57297j54257j22606p8202j3232k4497j20402j57118
2449.6H60913932j52528j75476j40369q3506j02878j26242j05679p8738o0201n6386
2470H59831929p2241j16825j41501j05322r3638p8798k9385p3790j23978l9816J6510
$$ plain form
2492.4 858973145 858958900 858926177 858874142 858773887 858612001 858453393 858388186 858390868 858387232 858395159 858403206 858335137
2516.9 858335137 858230293 858155012 858106434 858111978 858174324 858192742 858137250 858105600 858100772 858045697 857989013 858007550
2541.4 858007550 858061910 858134925 858225882 858260214 858213663 858132541 858035862 857961059 857912898 857805371 857654095
2563.8 857654095 857577145 857555866 857480109 857365131 857273281 857184768 857101798 857057571 857010007 856891572 856729865
2586.2 856729865 856622338 856564224 856506169 856451511 856367290 856263995 856219471 856229365 856203139 856099010 855967045
2608.7 855967045 855867743 855810642 855735779 855612099 855440736 855223000 855034769 854922473 854779243 854538798
2629.1 854538798 854306817 854158342 854021728 853827178 853595555 853355765 853145659 853009462 852908671 852745056
2649.5 852745056 852522075 852356255 852224469 852012753 851738811 851487100 851324081 851244092 851125717 850876153
$$ packed form
2492.4H58973145j4245l2723n2035j00255j61886j58608o5207K682l636P927Q047o8069
2516.9H58335137j04844p5281m8578N544O2346J8418n5492l1650m828n5075n6684J8537
2541.4H58007550N4360P3015R0957L4332m6551q1122r6679p4803m8161j07527j51276
2563.8H57654095p6950k1279p5757j14978r1850q8513q2970m4227m7564j18435j61707
2586.2H56729865j07527n8114n8055n4658q4221j03295m4524R894k6226j04129j31965
2608.7H55967045r9302n7101p4863j23680j71363k17736j88231j12296j43230k40445
2629.1H54538798k31981j48475j36614j94550k31623k39790k10106j36197j00791j63615
2649.5H52745056k22981j65820j31786k11716k73942k51711j63019p9989j18375k49564
$$ plain form
2669.9 850876153 850528121 850145400 849794090 849496722 849205911 848869324 848446548 847934425 847390056 846900165
2690.3 846900165 846472025 846041977 845629454 845286429 844985962 844686091 844391227 844108045 843829691 843593776
2710.7 843593776 843404233 843223095 843060017 842860162 842581570 842300117 842040896 841829717 841702402 841573060
2731.1 841573060 841422200 841297865 841163278 841031432 840941846 840878844 840786755 840592504 840344429 840200603
2751.4 840200603 840156913 840042531 839821756 839576662 839320242 838997483 838604271 838191628 837758422 837283671
2771.8 837283671 836820960 836399734 835927606 835388958 834839225 834266186 833678663 833104432 832542181 831982434
2792.2 831982434 831451893 830914676 830297112 829698443 829188466 828677773 828102887 827484429 826943099 826514125
2812.6 826514125 826073825 825594187 825111747 824575186 823953688 823342323 822795212 822228730 821590841 820885777
$$ packed form
2669.9H50876153l48032l82721l51310k97368k90811l36587m22776n12123n44369m89891
2690.3H46900165m28140m30048m12523l43025l00467k99871k94864k83182k78354k35915
2710.7H43593776j89543j81138j63078j99855k78592k81453k59221k11179j27315j29342
2731.1H41573060j50860j24335j34587j31846q9586o3002r2089j94251k48075j43826
2751.4H40200603m3690j14382k20775k45094k56420l22759l93212m12643m33206m74751
2771.8H37283671m62711m21226m72128n38648n49733n73039n87523n74231n62251n59747
2792.2H31982434n30541n37217o17564n98669n09977n10693n74886o18458n41330m28974
2812.6H26514125m40300m79638m82440n36561o21498o11365n47111n66482o37889p05064
$$ plain form
2833 820885777 820091605 819250226 818493903 817858398 817228258 816519082 815835297 815239727 814616799 813989639
2853.4 813989639 813471973 813092589 812817276 812565565 812366128 812311530 812361002 812401474 812451839 812623084
2873.8 812623084 812915623 813279271 813666821 814027011 814356983 814665496 814945877 815166712 815340638 815502942
2894.2 815502942 815665185 815906405 816179633 816346049 816435635 816506982 816507280 816453338 816493750 816617548 816726506
2916.7 816726506 816873968 817084253 817284286 817434907 817529321 817631721 817816138 818037987 818240702 818422318
2937 818422318 818634272 818885326 819078028 819280565 819713950 820328176 820942700 821639121 822541416 823590457
2957.4 823590457 824679136 825795650 826949775 828086913 829272509 830622792 832060635 833483875
2973.8 833483875 834944725 836453199 837936759 839403749 840820134 842057526 843053341 843792140 844382226
$$ packed form
2833H20885777p94172q41379p56323o35505o30140p09176o83785n95570o22928o27160
2853.4H13989639n17666l79384k75313k51711j99437n4598M9472M0472N0365J71245
2873.8H12623084K92539L63648L87550L60190L29972L08513K80381K20835J73926J62304
2894.2H15502942J62243K41220K73228J66416Q9586P1347K98n3942M0412J23798J08958
2916.7H16726506J47462K10285K00033J50621R4414J02400J84417K21849K02715J81616
2937H18422318K11954K51054J92702K02537M33385O14226O14524O96421R02295J049041
2957.4H23590457J088679J116514J154125J137138J185596J350283J437843J423240
2973.8H33483875J460850J508474J483560J466990J416385J237392R95815P38799N90086
$$ plain form
2992.1 844382226 844933927 845332086 845614970 845899642 846080363 846194565 846295059 846254468 846093476 845920444
3012.5 845920444 845779121 845660031 845543742 845466435 845380068 845226824 845038593 844840944 844641984 844390333
3032.9 844390333 844114006 843883753 843631864 843290329 842952847 842728496 842504203 842208803 841895103 841531456
3053.3 841531456 841175914 840903640 840631843 840294540 839917719 839526892 839152038 838838160 838539481 838159323
3073.7 838159323 837725818 837345123 837025702 836708605 836381435 836049616 835666597 835259378 834950328 834719062
3094.1 834719062 834417641 834003031 833602488 833290279 832974672 832576990 832114697 831701636 831355691 830963314
3114.5 830963314 830555737 830204070 829872191 829547226 829270065 828987837 828571260 828115761 827775240 827444732
3134.9 827444732 827043116 826657534 826357722 826130033 825843871 825436711 825030863 824657142 824296892 824015617
$$ packed form
2992.1H44382226N51701L98159K82884K84672J80721J14202J00494m0591j60992j73032
3012.5H45920444j41323j19090j16289p7307q6367j53244j88231j97649j98960k51651
3032.9H44390333k76327k30253k51889l41535l37482k24351k24293k95400l13700l63647
3053.3H41531456l55542k72274k71797l37303l76821l90827l74854l13878k98679l80158
3073.7H38159323m33505l80695l19421l17097l27170l31819l83019m07219l09050k31266
3094.1H34719062l01421m14610m00543l12209l15607l97682m62293m13061l45945l92377
3114.5H30963314m07577l51667l31879l24965k77161k82228m16577m55499l40521l30508
3134.9H27444732m01616l85582k99812k27689k86162m07160m05848l73721l60250k81275
$$ plain form
3155.3 824015617 823766172 823458314 823116660 822795928 822522163 822262049 821955264 821650326 821408331 821213245
3175.7 821213245 820994735 820671082 820320070 820071518 819855869 819573939 819311738 819142222 819009721 818855822
3196.1 818855822 818619549 818294406 818021357 817864716 817697346 817494810 817346275 817217231 817003489 816750765
3216.5 816750765 816570938 816466868 816397130 816252410 816037059 815850854 815662503 815527856 815479457 815390468
3236.9 815390468 815262735 815209687 815165639 814967215 814709663 814586043 814557254 814475119 814347148 814290583
3257.3 814290583 814285815 814264178 814222097 814119399 813960731 813830972 813776493 813772082 813776553 813796282 813843012
3279.7 813843012 813850164 813804030 813832104 813872576 813744366 813534737 813377500 813308835 813347995 813410282 813371539
3302.1 813371539 813179016 812975109 812976301 813141465 813257396 813304365 813391745 813433588 813316286 813146710
$$ packed form
3155.3H24015617k49445l07858l41654l20732k73765k60114l06785l04938k41995j95086
3175.7H21213245k18510l23653l51012k48552k15649k81930k62201j69516j32501j53899
3196.1H18855822k36273l25143k73049j56641j67370k02536j48535j29044k13742k52724
3216.5H16750765j79827j04070o9738j44720k15351j86205j88351j34647m8399q8989
3236.9H15390468j27733n3048m4048j98424k57552j23620k8789q2135j27971n6565
3257.3H14290583m768k1637m2081j02698j58668j29759n4479m411M471J9729M6730
3279.7H13843012P152m6134K8074M0472j28210k09629j57237o8665L9160O2287l8743
3302.1H13371539j92523k03907J192J65164J15931M6969Q7380M1843j17302j69576
$$ plain form
3322.5 813146710 813066483 813081026 813112974 813090920 813049972 813019693 812976062 813023269 813120842 813156605 813227594
3345 813227594 813237846 813068151 812931836 812948763 813045025 813155413 813177586 813095689 813000143 812943161 812972784
3367.4 812972784 813046992 813018739 812916458 812957406 813146114 813272893 813295424 813328803 813367128 813321233 813273251
3389.8 813273251 813345432 813467085 813564956 813598871 813572288 813632131 813777566 813887119 813917339 813891113 813942015
3412.3 813942015 814144135 814370632 814522326 814646900 814756572 814820170 814805329 814774454 814856410 814987302
3432.7 814987302 815072000 815190136 815401673 815617085 815786958 815936804 816052377 816154480 816256821 816337407
3453.1 816337407 816454232 816619754 816764474 816894591 816980302 816972136 817027867 817304790 817622125 817785561
3473.4 817785561 817907453 818127096 818438113 818734944 818937242 819109738 819290996 819404483 819491267 819648027
$$ packed form
3322.5H13146710q0227J4543L1948k2054m0948l0279m3631M7207R7573L5763P0989
3345H13227594J0252j69695j36315J6927R6262J10388K2173q1897r5546n6982K9623
3367.4H12972784P4208k8253j02281M0948J88708J26779K2531L3379L8325m5895m7982
3389.8H13273251P2181J21653R7871L3915k6583N9843J45435J09553L0220k6226N0902
3412.3H13942015K02120K26497J51694J24574J09672O3598j4841l0875Q1956J30892
3432.7H14987302Q4698J18136K11537K15412J69873J49846J15573J02103J02341Q0586
3453.1H16337407J16825J65522J44720J30117Q5711q166N5731K76923L17335J63436
3473.4H17785561J21892K19643L11017K96831K02298J72496J81258J13487Q6784J56760
$$ plain form
3493.8 819648027 819847763 820043564 820224226 820452392 820731521 821023524 821429074 821815789 821963429 822070062
3514.2 822070062 822329342 822702706 823118627 823453784 823722959 824089587 824470758 824721277 824988246 825387537
3534.6 825387537 825824916 826165497 826471031 826968074 827588499 827995598 828236878 828662395 829218328 829641759
3555 829641759 829969466 830375552 830946028 831794441 832916915 833634675 833615601 833647668 834036231 834547043
3575.4 834547043 835080862 835617661 836253107 837167323 838374496 839318871 839627981 839953899 840648830
3593.8 840648830 841395855 842022419 842644513 843287051 844093025 845386863 846885562 848042369 848987877
3612.1 848987877 849890113 850874484 851862371 852129638 851998627 852682173 854552627 856503606 856904387
3630.5 856904387 856775105 857241213 858008146 858889937 859764218 860735536 862342119 864683151 866543412
$$ packed form
3493.8H19648027J99736J95801J80662K28166K79129K92003M05550L86715J47640J06633
3514.2H22070062K59280L73364M15921L35157K69175L66628L81171K50519K66969L99291
3534.6H25387537M37379L40581L05534M97043O20425M07099K41280M25517N55933M23431
3555H29641759L27707M06086N70476Q48413J122474P17760j9074L2067L88563N10812
3575.4H34547043N33819N36799O35446R14216J207173R44375L09110L25918O94931
3593.8H40648830P47025O26564O22094O42538Q05974J293838J498699J156807R45508
3612.1H48987877R02236R84371R87887K67267j31011O83546J870454J950979M00781
3630.5H56904387j29282M66108P66933Q81791Q74281R71318J606583K341032J860261
$$ plain form
3648.8 866543412 866592884 866057456 866332948 866791129 866879165 867261171 867946148 868723392 870104849 871890724
3669.2 871890724 872963130 873905063 874861538 874408901 873394310 872894645 872973561 873814821 875238299
3687.6 875238299 876027882 875364721 874319255 873924971 874212027 874862671 875345886 875272393 875387073 876391947
3708 876391947 877719402 877957344 876999378 876141489 875834882 875845969 875844061 875701249 875447750 875333190
3728.4 875333190 875960588 877305627 878206193 877699792 876589119 876574159 878055334 879227996 879186153
3746.7 879186153 879607439 879944444 878777862 877462566 877175987 877322376 877047360 876767933 876893640
3765.1 876893640 877169609 877319992 876921892 876267016 876143396 876545489 876699209 876403689 876216054 876094341
3785.5 876094341 875961006 875917554 875865698 876138151 876813233 877487302 878242075 878468573 877952874 877713561
$$ packed form
3648.8H66543412M9472n35428K75492M58181Q8036L82006O84977P77244J381457J785875
3669.2H71890724J072406R41933R56475m52637j014591m99665P8916Q41260J423478
3687.6H75238299P89583o63161j045466l94284K87056O50644M83215p3493J14680J004874
3708H76391947J327455K37942r57966q57889l06607J1087j908j42812k53499j14560
3728.4H75333190O27398J345039R00566n06401j110673j4960J481175J172662m1843
3746.7H79186153M21286L37005j166582j315296k86579J46389k75016k79427J25707
3765.1H76893640K75969J50383l98100o54876j23620M02093J53720k95520j87635j21713
3785.5H76094341j33335m3452n1856K72453O75082O74069P54773K26498n15699k39313
$$ plain form
3805.9 877713561 877214253 876298189 876174510 877065063 877851963 878177941 878644109 878309250 877312601 876812935
3826.3 876812935 876692176 876821876 877131522 877564490 878252149 878615320 878107548 877172828 876260757 875811040
3846.7 875811040 876291633 877982199 879784644 878965437 876954198 876212418 876509309 877007782 877096474
3865 877096474 877114832 877504110 877533555 876975656 876250744 875916481 876257241 876438677 876329243 876124918
3885.4 876124918 875679970 875693321 875851691 875347376 874989867 875503838 876398265 876772225 876250327 875218034
3905.8 875218034 874358416 873904586 873703003 873827934 874202788 874306262 874111235 874001920 873878062 873587310
3926.2 873587310 873455465 873558998 873443067 872965395 872523844 872376323 872495413 872651458 872628868 872572303
3946.6 872572303 872501075 872282863 872052729 871950507 871915877 871852994 871776521 871692598 871574581 871447265
$$ packed form
3805.9H77713561m99308r16064j23679Q90553P86900L25978M66168l34859r96649m99666
3826.3H76812935j20759J29700L09646M32968O87659L63171n07772r34720r12071m49717
3846.7H75811040M80593J690566J802445q19207k011239p41780K96891M98473Q8692
3865H77096474J8358L89278K9445n57899p24912l34263L40760J81436j09434k04325
3885.4H76124918m44948J3351J58370n04315l57509N13971Q94427L73960n21898j032293
3905.8H75218034q59618m53830k01583J24931L74854J03474j95027j09315j23858k90752
3926.2H73587310j31845J03533j15931m77672m41551j47521J19090J56045k2590n6565
3946.6H72572303p1228k18212k30134j02222l4630o2883p6473q3923j18017j27316
$$ plain form
3967 871447265 871349633 871299863 871191621 870914459 870686948 870703340 870723486 870519042 870276451 870266378 870395899
3989.5 870395899 870433331 870411694 870388329 870242298
3997.6 870242298
$$ packed form
3967H71447265r7632m9770j08242k77162k27511J6392K0146k04444k42591j0073J29521
3989.5H70395899L7432k1637k3365j46031
3997.6H70242298
##END=$$ End of the data block
