##TITLE=$$ Begin of the data block
##JCAMP-DX=5.00 $$ ACD/SpecManager v 10.08
##SPECTROMETER/DATA SYSTEM=Varian
##DATE=30 Apr 2013 10:04:24
##DATA TYPE=INFRARED SPECTRUM
##DATA CLASS=XYDATA
##ORIGIN=
##OWNER=
##NPOINTS=3735
##FIRSTX=399.26403809
##LASTX=4000.35498047
##MAXX=4000.35498047
##MINX=399.26403809
##MAXY=73.02754211
##MINY=14.05520153
##XFACTOR=1.0000000000
##YFACTOR=0.000000100000000
##FIRSTY=40.11809540
##DELTAX=0.96440572
##XUNITS=1/CM
##YUNITS=TRANSMITTANCE
##XYDATA=(X++(Y..Y))
$$ plain form
399.3 401180954 522611923 591356850 610895538 605071640 594874496 587058067 580189476 574751167
407 574751167 574616470 581625862 592790298 603480377 611388779 616574669 619304695 619592094 618433914
415.7 618433914 617852440 619067345 621231766 622284470 620456467 614686356 604596329 591429176
423.4 591429176 579025726 572438431 574153976 581379013 587586899 587382812 580492783 571735039
431.1 571735039 567513390 571785088 584081726 600309372 615361938 625692902 630264091 629739456
438.8 629739456 625306282 618442459 611339111 606586800 605682068 607709999 609784584 609061699 604544411
447.5 604544411 597312202 589463348 582957001 579002762 577818260 578511200 579253502 577981071 573413048
456.2 573413048 565796928 556849060 548821945 543209686 539923973 537504349 534130096 528590813
$$ packed form
399.3D01180954J21430969O8744927J9538688n823898j0197144p816429o868591n438309
407E74751167j34697P009392J1164436J0690079P908402N185890K730026K87399j158180
415.7F18433914n81474J214905K164421J052704j828003n770111j0090027j3167153
423.4E91429176j2403450o587295J715545P225037O207886k04087o890029q757744
431.1E71735039m221649M271698J2296638J6227646J5052566J0330964M571189n24635
438.8F29739456m433174o863823p103348m752311r04732K027931K074585p22885m517288
447.5F04544411p232209p848854o506347l954239j184502O92940P42302j272431m568023
456.2E73413048p616120q947868q027115n612259l285713k419624l374253n539283
$$ plain form
463.9 528590813 520592918 510565453 499476967 488711891 479571037 472347260 465759087 457579079
471.6 457579079 446194267 431790123 416144218 401362495 388835449 379223442 373057671 370913467
479.3 370913467 372707596 376791763 379982338 378935204 371984062 359971771 345393448 330651741
487 330651741 316925449 304372826 293023319 283254814 275548992 270121460 266960335 266071548
494.7 266071548 267435150 270675030 274948635 279338169 283403320 287398586 292086124 298442936
502.5 298442936 307432652 319717388 335248146 352981453 371047707 387376709 400421829 409556160
510.2 409556160 414898567 416612282 414079742 405671310 389694595 366302948 339122543 315150509
517.9 315150509 302494164 307072029 330164528 368103523 414015312 460469742 501730995 534864159
$$ packed form
463.9E28590813p997895j0027465j1088486j0765076r140854p223777o588173q180008
471.6D57579079j1384812j4404144j5645905j4781723j2527046r612007o165771k144204
479.3C70913467J794129M084167L190575j047134o951142j2012291j4578323j4741707
487C30651741j3726292j2552623j1349507r768505p705822n427532l161125q88787
494.7B66071548J363602L239880M273605M389534M065151L995266M687538O356812
502.5B98442936Q989716J2284736J5530758J7733307J8066254J6329002J3045120R134331
510.2D09556160N342407J713715k532540q408432j5976715k3391647k7180405k3972034
517.9C15150509j2656345M577865K3092499L7938995M5911789M6454430M1261253L3133164
$$ plain form
525.6 534864159 559654655 577757301 591609116 603503418 614984741 626564903 637732086
532.4 637732086 647278214 653925705 657068176 657266922 656180420 655891724 657955551 662659912 668894043
541 668894043 674694290 678213196 678643646 676628799 673924866 672482910 673453064 676650467 680725784
549.7 680725784 683887177 684775925 683106995 679813995 676620026 675194626 676301193 679408722 682983932
558.4 682983932 685264816 685072556 682296677 677930832 673687439 671285782 671641617 674349823 677829056
567.1 677829056 680125961 679926300 677166061 672930069 668802872 666095428 665334015 666156387 667550812
575.8 667550812 668284683 667369003 664450150 660016098 655283737 651690826 650137329 650392990 651113892
584.4 651113892 650554199 647539520 642082443 635289688 628729553 623692894 620701141 619374847 618643341
$$ packed form
525.6E34864159K4790496J8102646J3851815J1894302J1481323J1580162J1167183
532.4F37732086R546128O647491L142471J98746j086502k88696K063827M704361O234131
541F68894043N800247L518906M30450k014847k703933j441956R70154L197403M075317
549.7F80725784L161393Q88748j668930l293000l193969j425400J106567L107529L575210
558.4F82983932K280884j92260k775879m365845m243393k401657L55835K708206L479233
567.1F77829056K296905j99661k760239m235992m127197k707444p61413Q22372J394425
575.8F67550812P33871r15680k918853m434052m732361l592911j553497K55661P20902
584.4F51113892n59693l014679n457077o792755o560135n036659k991753j326294p31506
$$ plain form
593.1 618643341 617226295 614231339 609595947 604124565 599094162 595655670 594343033 594886932 596364441
601.8 596364441 597599220 597658157 596242561 593796806 591281204 589711609 589666862 590979919 592776871
610.5 592776871 593893280 593476791 591425858 588410187 585521965 583811455 583882828 585574570 587820053
619.2 587820053 588948555 587490273 582980499 576051178 567778854 559192200 551729355 548075447
626.9 548075447 551790161 565056572 586144028 609213562 627326889 636493950 637470627 634054489
634.6 634054489 629707298 625410004 620013542 612035789 601122360 588368263 575880203 566175346
642.3 566175346 561565628 563430977 571553650 583978233 597684784 609821053 618800812 624655495
650 624655495 628538513 631811905 635280991 638875008 641752701 642713547 640814743 635979538 629204788
$$ packed form
593.1F18643341j417046k994956m635392n471382n030403l438492j312637N43899J477509
601.8E96364441J234779N8937j415596k445755k515602j569595m4747J313057J796952
610.5E92776871J116409m16489k050933l015671k888222j710510P1373J691742K245483
619.2E87820053J128502j458282m509774o929321q272324q586654p462845l653908
626.9E48075447L714714J3266411K1087456K3069534J8113327R167061R76677l416138
634.6F34054489m347191m297294n396462p977753j0913429j2754097j2488060r704857
642.3E66175346m609718J865349Q122673J2424583J3706551J2136269Q979759N854683
650F24655495L883018L273392L469086L594017K877693R60846j898804m835205o774750
$$ plain form
658.7 629204788 622110062 616070709 611563835 608126297 604734726 600176315 593341370 583705482
666.4 583705482 571994019 560446548 552116661 549448967 553127518 561973114 573752174 586145439
674.1 586145439 597358170 606405258 613229103 618539314 623222580 627575645 630954132 632165985
681.8 632165985 630293274 625292053 618013420 609794922 601952019 595333443 589989014 585097160
689.6 585097160 579340935 571625481 561654549 549926224 537239647 524235344 511308403 498697510
697.3 498697510 486441994 474377899 462653542 452631187 447077293 448666077 457441292 469466324
705 469466324 478395424 479186096 471082077 457577591 443774338 433589287 428770065 429577904 435699921
713.7 435699921 446488609 460822296 477226753 494291534 510953445 526476021 540403061
$$ packed form
658.7F29204788p094726o039353m506874l437538l391571m558411o834945r635888
666.4E83705482j1711463j1547471q329887k667694L678551Q845596J1779060J2393265
674.1E86145439J1212731R047088O823845N310211M683266M353065L378487J211853
681.8F32165985j872711n001221p278633q218498p842903o618576n344429m891854
689.6E85097160n756225p715454r970932j1728325j2686577j3004303j2926941j2610893
697.3D98697510j2255516j2064095j1724357j0022355n553894J588784Q775215J2025032
705D69466324Q929100P90672q104019j3504486j3803253j0185051m819222Q07839O122017
713.7D35699921J0788688J4333687J6404457J7064781J6661911J5522576J3927040
$$ plain form
720.4 540403061 552706642 563910751 574841843 586045036 597324715 607796707 616409492 622550049
728.1 622550049 626388855 628833656 631149864 634408417 638998146 644450760 649691849 653594513
735.8 653594513 655530319 655636673 654701996 653764877 653644714 654601517 656247406 657728882 658116913
744.5 658116913 656862793 654111481 650688324 647721710 646098175 646065369 647196426 648671265 649657593
753.2 649657593 649616241 648474350 646669006 645015564 644367523 645185394 647274399 649881821 652102890
761.9 652102890 653336792 653547821 653265228 653366470 654712753 657724228 662079544 666773605 670581055
770.6 670581055 672678223 673023529 672284851 671428452 671255417 672084351 673638535 675149231 675676422
779.2 675676422 674553223 671726151 667786942 663684464 660295029 658041916 656690445 655400848
$$ packed form
720.4E40403061J2303581J1204109J0931092J1203193J1279679J0471992Q612785O140557
728.1F22550049L838806K444801K316208L258553M589729N452614N241089L902664
735.8F53594513J935806J06354r34677r37119j20163R56803J645889J481476L88031
744.5F58116913j254120k751312l423157k966614j623535l2806J131057J474839R86328
753.2F49657593m1352j141891j805344j653442o48041Q17871K089005K607422K221069
761.9F52102890J233902K11029k82593J01242J346283L011475M355316M694061L807450
770.6F70581055K097168L45306p38678q56399j73035Q28934J554184J510696N27191
779.2F75676422j123199k827072l939209m102478l389435k253113j351471j289597
$$ plain form
787 655400848 653084793 648949738 642916336 635615311 627957916 620576553 613447914 605820465 596431198
795.6 596431198 583952141 567488022 546797447 522055473 493494072 461544724 427619781
802.4 427619781 394754219 367155190 348704872 341615219 346288910 362066040 387567902 420048981
810.1 420048981 454694786 485219955 505812607 512993317 506097832 486648636 457897453 425083809
817.8 425083809 395449905 376718407 374160156 388062897 413548584 443060112 469933548 490868149
825.5 490868149 506126938 517931633 528501778 538982697 549539185 560023422 570461769
832.3 570461769 581077423 592090912 603639450 615877037 629039421 643295975 658452377
839 658452377 673740616 687896271 699550247 707776260 712526474 714695740 715724335 716920853
$$ packed form
787F55400848k316055m135055o033402p301025p657395p381363p128639p627449r389267
795.6E96431198j2479057j6464119k0690575k4741974k8561401l1949348l3924943
802.4D27619781l2865562k7599029j8450318p089653M673691J5777130K5501862L2481079
810.1D20048981L4645805L0525169K0592652P180710o895485j9449196k8751183l2813644
817.8D25083809k9633904j8731498k558251J3902741K5485687K9511528K6873436K0934601
825.5D90868149J5258789J1804695J0570145J0480919J0556488J0484237J0438347
832.3E70461769J0615654J1013489J1548538J2237587J3162384J4256554J5156402
839F58452377J5288239J4155655J1653976Q226013M750214K169266J028595J196518
$$ plain form
846.8 716920853 718877640 721304092 723323212 724008942 722854080 719976730 716042099 711986084 708649216
855.4 708649216 706440659 705150299 704005661 701979980 698236313 692505798 685216751 677284622
863.1 677284622 669627914 662613831 655743408 647870026 638002281 626328888 614773064 606524200
870.9 606524200 604628067 610430527 622842522 638857346 654917984 668276291 677681427 683292007
878.6 683292007 686143112 687560883 688735199 690464783 693027191 696157837 699174118 701268234
886.3 701268234 701893463 701064301 699380188 697742462 696925812 697249527 698495407 700049515 701166916
895 701166916 701267929 700191650 698304825 696366043 695163651 695114441 696064529 697405472 698401642
903.7 698401642 698524780 697644196 696043015 694297791 693055801 692760696 693429489 694611893 695590973
$$ packed form
846.8G16920853J956787K426452K019120O85730j154862k877350l934631m056015l336868
855.4G08649216k208557j290360j144638k025681l743667n730515p289047p932129
863.1F77284622p656708p014083o870423p873382r867745j1673393j1555824q248864
870.9F06524200j896133N802460J2411995J6014824J6060638J3358307R405136N610580
878.6F83292007K851105J417771J174316J729584K562408L130646L016281K094116
886.3G01268234O25229q29162j684113j637726q16650L23715J245880J554108J117401
895G01166916J01013j076279j886825j938782j202392m9210R50088J340943R96170
903.7F98401642J23138q80584j601181j745224j241990k95105O68793J182404R79080
$$ plain form
912.3 695590973 695737686 694822311 693106308 691176605 689635925 688829803 688733902 689005051 689128494
921 689128494 688599930 687124710 684790344 682099380 679765625 678333435 677866821 677932587 677873077 677143860
930.7 677143860 675513611 673094940 670275955 667562485 665334320 663632889 662154236 660440216
938.4 660440216 658023987 654385071 648967743 641632767 633376503 626506538 623628197 625908546
946.1 625908546 632035179 638906860 643594360 644991455 643952484 642140732 640776138 640185089 640090714
954.8 640090714 640038910 639605179 638482819 636628532 634386253 632384224 631200523 631046600 631708298
963.4 631708298 632736664 633691750 634278717 634384460 634091377 633669968 633484840 633804092 634629669 635681496
973.1 635681496 636555367 636932678 636719246 636068726 635307617 634788971 634725266 635088577 635644989 636083374
$$ packed form
912.3F95590973J46713r15375j716003j929703j540680q06122r5901K71149J23443
921F89128494n28564j475220k334366k690964k333755j432190m66614O5766n9510p29217
930.7F77143860j630249k418671k818985k713470k228165j701431j478653j714020
938.4F60440216k416229l638916n417328p334976q256264o869965k878341K280349
946.1F25908546O126633O871681M687500J397095j038971j811752j364594n91049r4375
954.8F40090714n1804m33731j122360j854287k242279k002029j183701j53923O61698
963.4F31708298J028366R55086N86967J05743k93083m21409j85128L19252Q25577J051827
973.1F35681496Q73871L77311k13432o50520p61109n18646o3705L63311N56412M38385
$$ plain form
982.7 636083374 636132507 635625496 634563446 633175468 631872482 631029816 630742416 630769539 630691795 630094910
992.4 630094910 628668556 626310730 623275642 620128975 617331505 614765244 611779556 607803154
1000.1 607803154 602815094 597102699 590709114 583365364 574771767 564217339 549479103 526915665
1007.8 526915665 494566841 456719627 425179291 414020844 430614967 470196037 518833885
1014.6 518833885 562294846 593386803 612716484 624307213 631275101 634817619 635540695 634471207
1022.3 634471207 632750969 630980377 629199562 627301826 625215569 622779160 619729080 615934296
1030 615934296 611558495 606929359 602300034 597772484 593368874 589062233 584746895 580281868 575632591
1038.7 575632591 570952530 566486511 562385368 558590736 554837761 550729103 545852966 539938812
$$ packed form
982.7F36083374M9133n07011j062050j387978j302986q42666k87400K7123p7744n96885
992.4F30094910j426354k357826l035088l146667k797470k566261k985688l976402
1000.1F07803154m988060n712395o393585p343750q593597j0554428j4738236k2563438
1007.8E26915665l2348824l7847214l1540336j1158447J6594123L9581070M8637848
1014.6E18833885M3460961L1091957J9329681J1590729O967888L542518P23076j069488
1022.3F34471207j720238j770592j780815j897736k086257k436409l050080l794784
1030F15934296m375801m629136m629325m527550m403610m306641m315338m465027m649277
1038.7E75632591m680061m466019m101143l794632l752975m108658m876137n914154
$$ plain form
1046.4 539938812 532972946 525158234 516736717 507838974 498487053 488680763 478407059 467555847
1054.1 467555847 455886955 443153687 429298439 414540138 399299088 384068985 369357529
1060.9 369357529 355707397 343720627 334042892 327326622 324202576 325230293 330795288 340963707
1068.6 340963707 355365524 373172760 393186569 413999519 434188080 452499771 467989273
1075.3 467989273 480060387 488406296 492888412 493396454 489716568 481494789 468495255 451298943
1083 451298943 432180710 415403366 406184349 408464127 422733879 445495262 470891075 493456383
1090.7 493456383 510179863 520769615 526473579 528682251 528253021 525579643 520855141 514149284
1098.5 514149284 505428085 494848938 483325195 472885323 466294899 465946426 472700272 485506973
$$ packed form
1046.4E39938812o965866p814712q421517q897743r351921r806290j0273704j0851212
1054.1D67555847j1668892j2733268j3855248j4758301j5241050j5230103j4711456
1060.9C69357529j3650132j1986770r677735o716270l124046J027717N564995J0168419
1068.6C40963707J4401817J7807236K0013809K0812950K0188561J8311691J5489502
1075.3D67989273J2071114Q345909M482116N08042l679886q221779j2999534j7196312
1083D51298943j9118233j6777344r219017K279778J4269752K2761383K5395813K2565308
1090.7D93456383J6723480J0589752N703964K208672m29230k673378m724502o705857
1098.5E14149284q721199j0579147j1523743j0439872o590424l48473O753846J2806701
$$ plain form
1106.2 485506973 502051773 519871902 537136879 552751846 566081123 576769447 584791603
1112.9 584791603 590503769 594497528 597329750 599341774 600668030 601357689 601493912 601251450 600882492
1121.6 600882492 600632973 600637817 600874634 601207733 601466904 601495705 601185455 600533791 599686241 598863945
1131.2 598863945 598192177 597603493 596951637 596231270 595645943 595425949 595587234 595897980 596076279 596000443
1140.9 596000443 595734329 595397873 595044441 594638138 594103317 593386536 592506485 591569672 590720596 590042496
1150.5 590042496 589492760 588935928 588232002 587294235 586094742 584666328 583109093 581542625 579996529
1159.2 579996529 578350906 576419983 574095573 571354332 568093338 564012756 558761063 552272911
1166.9 552272911 545003433 537877769 532049103 528626900 528381042 531380997 536743050 542823830
$$ packed form
1106.2D85506973J6544800J7820129J7264977J5614967J3329277J0688324Q022156
1112.9E84791603N712166L993759K832222K012024J326256O89659J36223k42462l68958
1121.6F00882492k49519M844K36817L33099K59171K8801l10250o51664q47550q22296
1131.2E98863945o71768n88684o51856p20367n85327k19994J61285L10746J78299p5836
1140.9E96000443k66114l36456l53432m06303n34821p16781q80051r36813q49076o78100
1150.5E90042496n49736n56832p03926r37767j199493j428414j557235j566468j546096
1159.2E79996529j645623j930923k324410k741241l260994m080582n251693o488152
1166.9E52272911p269478p125664n828666l422203k45858K999955N362053O080780
$$ plain form
1174.6 542823830 547929420 551101875 552386665 552426186 551831436 550881271 549652519 548245964 546805611
1183.3 546805611 545383186 543886986 542196312 540294838 538279037 536271515 534357109 532587128
1191 532587128 530996475 529594650 528357658 527248001 526239891 525313263 524428825 523534470 522604599
1199.7 522604599 521661911 520743675 519842300 518885612 517777748 516457977 514921646 513195534 511305275
1208.4 511305275 509267197 507103691 504854622 502564163 500245781 497854233 495288620 492429314
1216.1 492429314 489183388 485508041 481396103 476837120 471786118 466157036 459844818 452763023
1223.8 452763023 444878616 436236496 426964455 417254791 407332153 397427597 387778435 378647881
1231.5 378647881 370326805 363071938 356980896 351870384 347256317 342484016 336967239 330441246
$$ packed form
1174.6E42823830N105590L172455J284790L9521n94750r50165j228752j406555j440353
1183.3E46805611j422425j496200j690674j901474k015801k007522j914406j769981
1191E32587128j590653j401825j236992j109657j008110r26628q84438q94355r29871
1199.7E22604599r42688r18236r01375r56688j107864j319771j536331j726112j890259
1208.4E11305275k038078k163506k249069k290459k318382k391548k565613k859306
1216.1D92429314l245926l675347m111938m558983n051002n629082o312218p081795
1223.8D52763023p884407q642120r272041r709664r922638r904556r649162r130554
1231.5C78647881q321076p254867o091042n110512m614067m772301n516777o525993
$$ plain form
1239.3 330441246 323146973 315917263 310134182 307492352 309523258 316982098 329378853 344963799
1247 344963799 361242142 375762444 386762962 393429108 395804863 394552879 390687294 385307045
1254.7 385307045 379406853 373920975 370016022 369322090 373651733 384116859 400170975 419379845
1262.4 419379845 438263397 453722115 464119949 469419022 470523224 468467751 463976326 457447014
1270.1 457447014 449112206 439144096 427661819 414715729 400311737 384522133 367717438 350883751
1277.8 350883751 335824356 324939537 320456467 323405113 332971916 346737938 361722794 375591431
1285.5 375591431 387306252 396977119 405224533 412571793 419164581 424788933 429018059 431373901
1293.3 431373901 431468925 429113731 424363480 417494469 408929176 399131622 388489876 377222519
$$ packed form
1239.3C30441246p294273p229710n783081k641830K030906P458840J2396755J5584946
1247C44963799J6278343J4520302J1000518O666146K375755j251984l865585n380249
1254.7C85307045n900192n485878l904953o93932M329643J0465126J6054116J9208870
1262.4D19379845J8883552J5458718J0397834N299073J104202k055473m491425o529312
1270.1D57447014q334808r968110j1482277j2946090j4403992j5789604j6804695j6833687
1277.8C50883751j5059395j0884819m483070K948646R566803J3766022J4984856J3868637
1285.5C75591431J1714821R670867Q247414P347260O592788N624352M229126K355842
1293.3D31373901R5024k355194m750251o869011q565293r797554j0641746j1267357
$$ plain form
1301 377222519 365350800 352748222 339235954 324692612 309189873 293165741 277574959 263891201
1308.7 263891201 253883286 249223156 251087780 259908485 275317421 296260910 321213379 348420868
1316.4 348420868 376118279 402707443 426915245 447938232 465524979 479925117 491699562
1323.2 491699562 501485748 509835625 517167053 523785057 529912796 535709763 541279869 546657982
1330.9 546657982 551774750 556427040 560306129 563098412 564615211 564883347 564164810 562909203 561649742
1339.6 561649742 560860214 560814095 561515694 562746162 564194450 565583611 566729546 567546768 568043900
1348.2 568043900 568312607 568472672 568563271 568460541 567920761 566752090 564996910 562986298 561237679
1356.9 561237679 560272179 560445633 561840858 564240341 567209396 570271149 573077126 575464020 577392807
$$ packed form
1301C77222519j1871719j2602578j3512268j4543342j5502739j6024132j5590782j3683758
1308.7B63891201j0007915m660130J864624Q820705J5408936K0943489K4952469K7207489
1316.4C48420868K7697411K6589164K4207802K1022987J7586747J4400138J1774445
1323.2D91699562R786186Q349877P331428O618004O127739N796967N570106N378113
1330.9E46657982N116768M652290L879089K792283J516799K68136p18537j255607j259461
1339.6E61649742p89528m6119P01599J230468J448288J389161J145935Q17222M97132
1348.2E68043900K68707J60065R0599j02730n39780j168671j755180k010612j748619
1356.9E61237679r65500J73454J395225K399483K969055L061753K805977K386894J928787
$$ plain form
1365.6 577392807 578875465 579966965 580767174 581348343 581642532 581440811 580561295 579045830 577181778
1374.3 577181778 575317650 573643150 572109108 570510902 568633308 566360245 563707809 560779800
1382 560779800 557685127 554489784 551231766 547935524 544562340 540957527 536914062 532298393 527020340
1390.7 527020340 520803719 513091240 503395195 491797028 478880997 464939384 449358063 431219902
1398.4 431219902 410830765 390549545 373818130 363314209 360228577 365277290 379762154 404747658
1406.1 404747658 438775406 476707420 511517601 537857208 554390259 563201218 567371407 569049644
1413.8 569049644 569143181 567979507 565851707 563129578 560225296 557548485 555336647 553435326 551347771
1422.5 551347771 548647041 545358124 541890182 538607216 535530701 532454872 529259949 526042709
$$ packed form
1365.6E77392807J482658J091500Q00209N81169K94189k01721q79516j515465j864052
1374.3E77181778j864128j674500j534042j598206j877594k273063k652436k928009
1382E60779800l094673l195343l258018l296242l373184l604813m043465m615669n278053
1390.7E27020340o216621p712479r696045j1598167j2916031j3941613j5581321j8138161
1398.4D31219902k0389137k0281220j6731415j0503921l085632N048713J4484864K4985504
1406.1D04747658L4027748L7932014L4810181K6339607J6533051Q810959M170189J678237
1413.8E69049644R3537j163674k127800k722129k904282k676811k211838j901321k087555
1422.5E51347771k700730l288917l467942l282966l076515l075829l194923l217240
$$ plain form
1430.2 526042709 522972183 520081367 517200012 514050407 510423851 506343117 502092705 498027534
1437.9 498027534 494249420 490436287 486033554 480654602 474295731 467165298 459362183 450784874
1445.6 450784874 441329498 431070900 420173492 408667831 396434746 383465729 370089417
1452.4 370089417 356884651 344420471 333211021 323964539 317718620 315461369 317450390 322917252
1460.1 322917252 330536194 339222221 348451538 357866745 366746521 374022560 378793373 380680771
1467.8 380680771 379631310 375530548 368249550 358146973 346395721 334623337 324115486 315297165
1475.5 315297165 307853813 301168919 294557686 287184563 277974319 265797882 249919930 230548992
1483.2 230548992 209336128 189567719 175612431 171384487 178379879 194573193 215185146 234994564
$$ packed form
1430.2E26042709l070526k890816k881355l149605l626556m080734m250412m065171
1437.9D98027534l778114l813133m402733n378952o358871p130433p803115q577309
1445.6D50784874r455376j0258598j0897408j1505661j2233085j2969017j3376312
1452.4C70089417j3204766j2464180j1209450r246482o245919k257251J989021N466862
1460.1C22917252P618942Q686027R229317R415207Q879776P276039M770813J887398
1467.8C80680771j049461m100762p280998j0102577j1751252j1772384j0507851q818321
1475.5C15297165p443352o684894o611233p373123r210244j2176437j5877952j9370938
1483.2B30548992k1212864j9768409j3955288m227944O995392J6193314K0611953J9809418
$$ plain form
1491 234994564 250614624 261237164 267713966 271140995 272143230 271040554 268236847 264277687
1498.7 264277687 259652290 254676895 249519024 244172535 238371468 231703835 224047318 215985756
1506.4 215985756 208729630 203504219 200916214 200807209 202587128 205623894 209378357 213365154
1514.1 213365154 217165585 220520134 223336525 225536480 226912270 227185116 226222439 224144459 221156616
1522.8 221156616 217276478 212303963 206144104 199164066 192163429 185945187 180965385 177478085
1530.5 177478085 175974789 177292023 182127247 190518875 202034683 216590939 234917831 257905407
1538.2 257905407 285325890 315300407 345214844 373266983 399166946 423467255 446451836
1545 446451836 467802353 487189865 504869652 521487236 537352600 552065048 564909096 575550766
$$ packed form
1491B34994564J5620060J0622540O476802L427029J002235j102676k803707l959160
1498.7B64277687m625397m975395n157871n346489n801067o667633p656517q061562
1506.4B15985756p256126n225411k588005j09005J779919L036766L754463L986797
1514.1B13365154L800431L354549K816391K199955J375790K72846r62677k077980k987843
1522.8B21156616l880138m972515o159859o980038p000637o218242m979802l487300
1530.5A77478085j503296J317234M835224Q391628J1515808J4556256J8326892K2987576
1538.2B57905407K7420483K9974517K9914437K8052139K5899963K4300309K2984581
1545D46451836K1350517J9387512J7679787J6617584J5865364J4712448J2844048J0641670
$$ plain form
1552.7 575550766 584293594 591714325 598144188 603504829 607549133 610182610 611589699 612134476
1560.4 612134476 612166328 611870766 611271019 610400734 609493217 608934402 608928108 609204254 609160652 608351440
1570 608351440 606746902 604383469 600766106 594733047 584902725 570085297 549282646 521895638
1577.7 521895638 488961945 454855003 427389488 414911575 421728783 445340347 477841454
1584.5 477841454 510392303 537243652 556752701 569773903 577668457 581518669 582369576 581477165
1592.2 581477165 580064430 578882904 578031883 577140312 575710449 573392830 570069962 565761490 560478783
1600.9 560478783 554166374 546734276 538088951 528138123 516839905 504285812 490668983 476103020
1608.6 476103020 460516853 443832283 426192932 407792664 388315697 366690140 341720314
$$ packed form
1552.7E75550766Q742828P420731O429863N360641M044304K633477J407089N44777
1560.4F12134476L1852k95562n99747q70285r07517n58815o294K76146m3602q09212
1570F08351440j604538k363433l617363o033059r830322j4817428k0802651k7387008
1577.7E21895638l2933693l4106942k7465515j2477913O817208K3611564L2501107
1584.5D77841454L2550849K6851349J9509049J3021202P894554L850212Q50907q92411
1592.2E81477165j412735j181526q51021q91571j429863k317619l322868m308472n282707
1600.9E60478783o312409p432098q645325r950828j1298218j2554093j3616829j4565963
1608.6D76103020j5586167j6684570j7639351j8400268j9476967k1625557k4969826
$$ plain form
1615.4 341720314 313174152 282234230 250863323 220861130 193674698 170985527 155096111
1622.1 155096111 148423643 152526550 167561207 192413597 225024147 262559071 301700954 339383430
1629.8 339383430 373677559 404146271 431407051 456337433 479515533 501078262 520841141
1636.6 520841141 538529587 554046631 567618752 579655266 590436897 599992332 608332176 615756493
1644.3 615756493 622840958 630088692 637623482 645198517 652411499 658884888 664374542 668908157
1652 668908157 672896118 677000427 681726379 687046280 692405396 697101898 700711060 703247681 705069275
1660.7 705069275 706683502 708572235 711030350 714024811 717157516 719813232 721471786 722033691
1668.4 722033691 721935577 721921616 722586441 724021301 725848999 727575760 728891754 729680023 729888306
$$ packed form
1615.4C41720314k8546162l0939922l1370907l0002193k7186432k2689171j5889416
1622.1A55096111o672468M102907J5034657K4852390L2610550L7534924L9141883L7682476
1629.8C39383430L4294129L0468712K7260780K4930382K3178100K1562729J9762879
1636.6E20841141J7688446J5517044J3572121J2036514J0781631R555435Q339844P424317
1644.3F15756493P084465P247734P534790P575035P212982O473389N489654M533615
1652F68908157L987961M104309M725952N319901N359116M696502L609162K536621J821594
1660.7G05069275J614227J888733K458115K994461L132705K655716J658554N61905
1668.4G22033691r8114j3961O64825J434860J827698J726761J315994P88269K08283
$$ plain form
1677.1 729888306 729564209 729029465 728825607 729267960 730021439 730275421 729483643 727919693 726408539
1685.8 726408539 725507812 725056458 724570465 723953857 723632660 723954468 724619522 724876480 724289322 723193893
1695.4 723193893 722342148 722176895 722555847 723133545 723830109 724796219 725982666 726931305 727113342
1704.1 727113342 726458817 725483170 724872055 724952850 725528870 726115646 726276093 725796356 724706192 723238297
1713.7 723238297 721743240 720542984 719799042 719506989 719591980 719949493 720373230 720527573 720136871
1722.4 720136871 719277802 718427963 718109436 718424911 718960876 719168472 718813553 718040543 717067871 715957565
1732 715957565 714746017 713700256 713262177 713629150 714428635 714910583 714529877 713361664 711975784
1740.7 711975784 710967331 710602951 710813370 711367035 711991043 712409515 712415085 711984940 711328201 710787735
$$ packed form
1677.1G29888306l24097n34744k03858M42353P53479K53982p91778j563950j511154
1685.8G26408539r00727m51354m85993o16608l21197L21808O65054K56958n87158j095429
1695.4G23193893q51745j65253L78952N77698O96564R66110J186447R48639J82037
1704.1G27113342o54525r75647o11115Q0795N76020N86776J60447m79737j090164j467895
1713.7G23238297j495057j200256p43942k92053Q4991L57513M23737J54343l90702
1722.4G20136871q59069q49839l18527L15475N35965K07596l54919p73010r72672j110306
1732G15957565j211548j045761m38079L66973P99485M81948l80706j168213j385880
1740.7G11975784j008453l64380K10419N53665O24008M18472N570m30145o56739n40466
$$ plain form
1750.4 710787735 710665512 711085358 711931458 712864075 713440475 713338776 712555771 711393433 710228500
1759 710228500 709291000 708658676 708394318 708573227 709124908 709713669 709900131 709483490 708669968 707873840
1768.7 707873840 707355804 707059784 706752625 706257248 705543518 704670715 703736038 702892380 702360535 702355270
1778.3 702355270 702968292 704105072 705510025 706846085 707798615 708200226 708136978 707932281 707960281
1787 707960281 708388901 709052887 709578781 709662094 709273300 708639297 708053131 707702789 707639694 707847214
1796.7 707847214 708282623 708834839 709286423 709381485 708987427 708211212 707358932 706764908 706620026 706898575
1806.3 706898575 707382126 707748871 707704391 707129059 706161346 705138474 704413376 704170990 704364090 704772034
1815.9 704772034 705111160 705137939 704737625 703972626 703047409 702196121 701576233 701254044 701235580 701449738
$$ packed form
1750.4G10787735j22223M19846Q46100R32617N76400j01699p83005j162338j164933
1759G10228500r37500o32324k64358J78909N51681N88761J86462m16641q13522p96128
1768.7G07873840n18036k96020l07159m95377p13730q72803r34677q43658n31845n265
1778.3G02355270O13022J136780J404953J336060R52530M01611o3248k04697K8000
1787G07960281M28620O63986N25894Q3313l88794o34003n86166l50342o3095K07520
1796.7G07847214M35409N52216M51584R5062l94058p76215q52280n94024j44882K78549
1806.3G06898575M83551L66745m4480n75332r67713j022872p25098k42386J93100M07944
1815.9G04772034L39126K6779m00314p64999r25217q51288o19888l22189j8464K14158
$$ plain form
1825.6 701449738 701682053 701601791 700968399 699875107 698764343 698141632 698223724 698825226 699539490 699995880
1835.2 699995880 699992371 699504013 698675842 697800674 697195282 696994858 697046890 697043304 696777496 696269073
1844.9 696269073 695654602 695017242 694368515 693770370 693391571 693379593 693677826 694002075 694017029 693542633
1854.5 693542633 692628479 691486969 690387344 689566498 689146118 689061584 689069138 688867645 688261337 687237091
1864.2 687237091 685917664 684469299 683059387 681859894 681019058 680570679 680360031 680088501 679487000
1872.8 679487000 678508911 677388916 676512909 676178436 676414032 676973953 677492294 677666931 677359314
1881.5 677359314 676603317 675576782 674550323 673773804 673316727 672984772 672427521 671365967 669726486
1890.2 669726486 667567215 664932938 661832733 658320694 654466248 650176392 645167007 639375305
$$ packed form
1825.6G01449738K32315q0262o33392j093292j110764o22711Q2092O01502P14264M56390
1835.2F99995880l509m88358q28171q75168o05392k00424N2032l586k65808n08423
1844.9F96269073o14471o37360o48727n98145l78799j1978K98233L24249J4954m74396
1854.5F93542633r14154j141510j099625q20846m20380q4534P554k01493o06308j024246
1864.2F87237091j319427j448365j409912j199493q40836m48379k10648k71530o01501
1872.8F79487000r78089j119995q76007l34473K35596N59921N18341J74637l07617
1881.5F77359314p55997j026535j026459p76519m57077l31955n57251j061554j639481
1890.2F69726486k159271k634277l100205l512039l854446m289856n009385n791702
$$ plain form
1897.9 639375305 633576775 629516563 629127731 633288574 641136398 650537949 659299011 666133194
1905.6 666133194 670793304 673603745 675005569 675424347 675311508 675111542 675132904 675460281 675979462
1914.3 675979462 676467667 676696167 676537857 676049805 675456238 675012741 674857559 674973907 675261688 675602493
1923.9 675602493 675854568 675845871 675450439 674708862 673856125 673197556 672925797 673024368 673304672 673514175
1933.6 673514175 673443298 673009262 672303162 671564789 671061325 670932541 671113739 671396332 671565781 671502686
1943.2 671502686 671193542 670696259 670120621 669627609 669390335 669498596 669868774 670250931 670355682 670020981
1952.9 670020981 669302750 668434372 667702026 667313080 667321014 667617645 667987289 668197937 668101120 667687912
1962.5 667687912 667080307 666468582 666034622 665887985 666026230 666327286 666585617 666596146 666252213 665604172
$$ packed form
1897.9F39375305n798530m060212l88832M160843P847824R401551Q761062O834183
1905.6F66133194M660110K810441J401824M18778j12839j99966K1362L27377N19181
1914.3F75979462M88205K28500j58310m88052n93567m43497j55182J16348K87781L40805
1923.9F75602493K52075q697l95432p41577q52737o58569k71759R8571K80304K09503
1933.6F73514175p0877m34036p06100p38373n03464j28784J81198K82593J69449o3095
1943.2F71502686l09144m97283n75638m93012k37274J08261L70178L82157J04751l34701
1952.9F70020981p18231q68378p32346l88946P934K96631L69644K10648r6817m13208
1962.5F67687912o07605o11725m33960j46637J38245L01056K58331J0529l43933o48041
$$ plain form
1972.2 665604172 664842377 664210892 663891449 663910294 664116440 664250641 664080734 663527222 662702332 661839676
1981.8 661839676 661168823 660811081 660746078 660844727 660932617 660854111 660521011 659938049 659207611 658505936
1991.5 658505936 658024673 657881699 658038940 658289490 658351212 658025055 657313004 656413498 655599594 655076523
2001.1 655076523 654896393 654959030 655068588 655013123 654646912 653951950 653045959 652128906 651392212 650944214
2010.7 650944214 650775452 650766068 650724792 650462189 649879150 649029541 648104019 647330322 646851883 646661987
2020.4 646661987 646622086 646531296 646206131 645543823 644569550 643443527 642404938 641660461 641284714 641201553
2030 641201553 641250076 641274643 641170807 640887451 640428314 639864922 639328384 638941994 638728676 638571281
2039.7 638571281 638270760 637662659 636707191 635500793 634228096 633092155 632245178 631729774 631454277
$$ packed form
1972.2F65604172p61795o31485l19443J8845K06146J34201j69907n53512q24890q62656
1981.8F61839676o70853l57742o5003R8649Q7890p8506l33100n82962p30438p01675
1991.5F58505936m81263j42974J57241K50550O1722l26157p12051q99506q13904n23071
2001.1F55076523j80130O2637J09558n5465l66211o94962r05991r17053p36694m47998
2010.7F50944214j68762r384m1276k62603n83039q49609r25522p73697m78439j89896
2020.4F46661987l9901r0790l25165o62308r74273j126023j038589p44477l75747q3161
2030F41201553M8523K4567j03836k83356m59137n63392n36538l86390k13318j57395
2039.7F38571281l00521o08101r55468j206398j272697j135941q46977n15404k75497
$$ plain form
2048.4 631454277 631235123 630901413 630397682 629812813 629325562 629110489 629263763 629768219 630488625 631199608
2058 631199608 631660156 631719398 631396065 630874710 630419350 630258942 630502205 631099815 631851997 632472992
2067.6 632472992 632719841 632528267 632053642 631557922 631224213 631058578 630965576 630904160 630949440 631194611
2077.3 631194611 631609077 632027512 632295799 632429008 632611313 633032799 633711815 634458656 634999809 635150261
2086.9 635150261 634912529 634452705 633995819 633707275 633620491 633636971 633589249 633323936 632760735 631912727
2096.6 631912727 630883827 629850388 629021835 628566971 628537788 628845329 629313889 629776421 630146179
2105.2 630146179 630426102 630676422 630972862 631371346 631868515 632374001 632729073 632785568 632504196 631997871
2114.9 631997871 631484642 631178513 631190643 631488190 631918678 632278328 632397614 632214851 631803360 631332817
$$ packed form
2048.4F31454277k19154l33710n03731n84869m87251k15073J53274N04456P20406P10983
2058F31199608M60548N9242l23333n21355m55360j60408K43263N97610P52182O20995
2067.6F32472992K46849j91574m74625m95720l33709j65635r3002o1416M5280K45171
2077.3F31194611M14466M18435K68287J33209J82305M21486O79016P46841N41153J50452
2086.9F35150261k37732m59824m56886k88544q6784J6480m7722k65313n63201q48008
2096.6F31912727j028900j033439q28553m54864k9183L07541M68560M62532L69758
2105.2F30146179K79923K50320K96440L98484M97169N05486L55072N6495k81372n06325
2114.9F31997871n13229l06129J2130K97547M30488L59650J19286j82763m11491m70543
$$ plain form
2124.5 631332817 630979080 630835190 630874634 630980492 631014099 630882187 630572243 630148010 629715614 629380684
2134.2 629380684 629218178 629255676 629465485 629759979 630008240 630091743 629975853 629746361 629566383 629580688
2143.8 629580688 629837799 630278854 630781288 631209679 631453400 631462212 631282883 631055298 630945663 631045227
2153.5 631045227 631313629 631611176 631786613 631751213 631502724 631112442 630698776 630387650 630261497 630318909
2163.1 630318909 630476570 630612373 630617867 630432281 630061798 629586143 629141121 628860168 628797913 628892670
2172.8 628892670 629003448 628993950 628799591 628444138 628013115 627615929 627347069 627251549 627306747 627434464
2182.4 627434464 627536087 627530937 627376938 627084160 626721916 626406250 626254120 626312218 626514702 626711044
2192 626711044 626752167 626575394 626231308 625842171 625531082 625368614 625357971 625445938 625540657 625534477 625341110
$$ packed form
2124.5F31332817l53737j43890L9444J05858L3607j31912l09944m24233m32396l34930
2134.2F29380684j62506L7498K09809K94494K48261Q3503j15890k29492j79978J4305
2143.8F29580688K57111M41055N02434M28391K43721Q812j79329k27585j09635R9564
2153.5F31045227K68402K97547J75437l5400k48489l90282m13666l11126j26153N7412
2163.1F30318909J57661J35803N494j85586l70483m75655m45022k80953o2255R4757
2172.8F28892670J10778r498j94359l55453m31023l97186k68860r5520N5198J27717
2182.4F27434464J01623n150j53999k92778l62244l15666j52130N8098K02484J96342
2192F26711044M1123j76773l44086l89137l11089j62468j0643Q7967R4719o180j93367
$$ plain form
2202.6 625341110 624941063 624408607 623887558 623521729 623380966 623431053 623558731 623627853 623537445 623264580
2212.3 623264580 622878189 622508774 622272644 622194443 622190666 622131119 621929092 621585464 621161156 620723839
2221.9 620723839 620322952 620001602 619805603 619761467 619839745 619945374 619955139 619783478 619435005 619010925
2231.6 619010925 618663101 618512344 618579102 618768196 618921165 618902054 618662949 618254814 617792015 617399826
2241.2 617399826 617166519 617111588 617176132 617245979 617201958 616971474 616557388 616029205 615493393 615055466
2250.9 615055466 614781456 614666977 614629097 614540176 614293518 613863831 613320007 612779007 612336998 612020454
2260.5 612020454 611786690 611560631 611274643 610886497 610377007 609749832 609041748 608328056 607699966 607215347
2270.2 607215347 606865768 606593552 606349945 606138840 606008263 606005745 606147079 606421700 606809464 607273293
$$ packed form
2202.6F25341110m00047n32456n21049l65829j40763N0087J27678O9122r0408k72865
2212.3F23264580l86391l69415k36130p8201l777n9547k02027l43628m24308m37317
2221.9F20723839m00887l21350j95999m4136P8278J05629R765j71661l48473m24080
2231.6F19010925l47824j50757O6758J89094J52969j9111k39105m08135m62799l92189
2241.2F17399826k33307n4931O4544O9847m4021k30484m14086n28183n35812m37927
2250.9F15055466k74010j14479l7880q8921k46658m29687n43824n41000m42009l16544
2260.5F12020454k33764k26059k85988l88146n09490o27175p08084p13692o28090m84619
2270.2F07215347l49579k72216k43607k11105j30577k518J41334K74621L87764M63829
$$ plain form
2279.8 607273293 607735710 608076973 608183937 608019257 607656288 607243614 606922112 606749191 606679344 606607552
2289.4 606607552 606439476 606138840 605730324 605274315 604845276 604518623 604350014 604341812 604424553 604483109
2299.1 604483109 604422913 604219971 603917236 603580246 603257599 602970200 602714653 602464294 602174568 601806602
2308.7 601806602 601355591 600850716 600329170 599820709 599361954 599006538 598787003 598644257 598417206 597942429
2318.4 597942429 597200012 596361008 595667953 595247574 595031815 594855919 594623756 594366760 594144020 593914795
2328 593914795 593544693 592954903 592255020 591699104 591485443 591583748 591755905 591748734 591481247 591075897
2337.7 591075897 590736237 590598640 590666962 590840302 590981216 590987015 590853539 590707512 590756874 591151924
2347.3 591151924 591838570 592544441 592939987 592860489 592397003 591773186 591136589 590471840 589711838 588907433
$$ packed form
2279.8F07273293M62417L41263J06964j64680l62969m12674l21502j72921o9847p1792
2289.4F06607552j68076l00636m08516m56009m29039l26653j68609q202Q2741N8556
2299.1F04483109o0196k02942l02735l36990l22647k87399k55547k50359k89726l67966
2308.7F01806602m51011n04875n21546n08461m58755l55416k19535j42746k27051m74777
2318.4E97942429p42417q39004o93055m20379k15759j75896k32163k56996k22740k29225
2328E93914795l70102n89790o99883n55916k13661R8305J72157p171k67487m05350
2337.7E91075897l39660j37597O8322J73340J40914N799j33476j46027M9362L95050
2347.3E91151924O86646P05871L95546p9498m63486o23817o36597o64749p60002q04405
$$ plain form
2356.9 588907433 588250008 587913971 587887192 587981796 588012466 587947540 587880249 587875519 587885323 587822609 587689171
2367.6 587689171 587594032 587638969 587811050 588005791 588142738 588230553 588319054 588414917 588475266 588480644 588480225
2378.2 588480225 588542900 588666916 588763390 588737907 588583298 588385811 588245583 588196602 588194733 588163834 588041611
2388.8 588041611 587799416 587448273 587041473 586663551 586393433 586263885 586247482 586278114 586283646 586206894
2398.4 586206894 586019287 585736313 585423660 585174141 585055847 585066795 585132637 585148125 585031204 584755936
2408.1 584755936 584356308 583908043 583496361 583177986 582954941 582770691 582539406 582188110 581692505 581090164
2417.7 581090164 580462112 579887848 579396019 578943405 578440819 577812614 577040749 576168938 575277672 574466171
2427.3 574466171 573851700 573554726 573654518 574135742 574878120 575709305 576480446 577108536 577571182 577879944
$$ packed form
2356.9E88907433o57425l36037k6779R4604L0670o4926o7291m730R804o2714j33438
2367.6E87689171r5139M4937J72081J94741J36947Q7815Q8501R5863O0349N378m19
2378.2E88480225O2675J24016R6474k5483j54609j97487j40228m8981j869l0899j22223
2388.8E88041611k42195l51143m06800l77922k70118j29548j6403L0632N532p6752
2398.4E86206894j87607k82974l12653k49519j18294J0948O5842J5488j16921k75268
2408.1E84755936l99628m48265m11682l18375k23045j84250k31285l51296m95605o02341
2417.7E81090164o28052n74264m91829m52614n02586o28205p71865q71811q91266q11501
2427.3E74466171o14471k96974R9792M81224P42378Q31185P71141O28090M62646L08762
$$ plain form
2437 577879944 578065758 578170128 578226357 578235435 578165054 577984543 577707138 577396507 577129021 576945572 576832199
2447.6 576832199 576737366 576609001 576419907 576172600 575886078 575580940 575273476 574985390 574751816 574607773
2457.2 574607773 574553757 574533882 574458237 574267273 573979111 573678322 573453369 573339500 573308830 573302269 573262367
2467.8 573262367 573146019 572924957 572596436 572195206 571787453 571439171 571177940 570978127 570783463 570545731
2477.5 570545731 570253334 569929390 569609337 569317207 569057770 568822479 568595734 568353844 568063164 567686348
2487.1 567686348 567200012 566613274 565973434 565356331 564843063 564491653 564313850 564270134 564293556 564330482
2496.8 564330482 564369125 564430428 564531784 564658394 564772034 564839897 564846458 564776688 564599266 564285545 563850670
2507.4 563850670 563368759 562933121 562595825 562346001 562137070 561925087 561676598 561359215 560953255 560486374
$$ packed form
2437E77879944J85814J04370N6229R078p0381j80511k77405l10631k67486j83449j13373
2447.6E76832199r4833j28365j89094k47307k86522l05138l07464k88086k33574j44043
2457.2E74607773n4016j9875p5645j90964k88162l00789k24953j13869l0670o561l9902
2467.8E73262367j16348k21062l28521m01230m07753l48282k61231j99813j94664k37732
2477.5E70545731k92397l23944l20053k92130k59437k35291k26745k41890k90680l76816
2487.1E67686348m86336n86738o39840o17103n13268l51410j77803m3716K3422L6926
2496.8E64330482L8643O1303J01356J26610J13640O7863O561o9770j77422l13721m34875
2507.4E63850670m81911m35638l37296k49824k08931k11983k48489l17383m05960m66881
$$ plain form
2517 560486374 560043106 559715004 559529762 559427795 559310303 559110680 558825073 558490677 558156967 557873154
2526.7 557873154 557681999 557597122 557578583 557542381 557407646 557147484 556802597 556449127 556151123 555929031
2536.3 555929031 555756226 555584488 555375404 555119400 554827576 554510155 554171371 553828545 553526955 553316917
2546 553316917 553204880 553125229 552971344 552663422 552196579 551635437 551071548 550580444 550198708 549918747
2555.6 549918747 549696388 549470787 549187431 548813133 548340988 547794876 547235947 546750107 546403580 546185493
2565.2 546185493 545994530 545694275 545205269 544561691 543895378 543364449 543078842 543057060 543223572 543445244
2574.9 543445244 543595772 543618011 543537903 543417473 543290024 543140144 542943878 542718582 542519188 542383766
2584.5 542383766 542288170 542162437 541955528 541686096 541435242 541287766 541271782 541336441 541382599 541326027
$$ packed form
2517E60486374m43268l28102j85242j01967j17492j99623k85607l34396l33710k83813
2526.7E57873154j91155q4877j8539l6202j34735k60162l44887l53470k98004k22092
2536.3E55929031j72805j71738k09084k56004k91824l17421l38784l42826l01590k10038
2546E53316917j12037p9651j53885l07922m66843n61142n63889m91104l81736k79961
2555.6E49918747k22359k25601k83356l74298m72145n46112n58929m85840l46527k18087
2565.2E46185493j90963l00255m89006o43578o66313n30929k85607k1782J66512K21672
2574.9E43445244J50528K2239q0108j20430j27449j49880j96266k25296j99394j35422
2584.5E42383766r5596j25733k06909k69432k50854j47476j5984O4659M6158n6572
$$ plain form
2594.2 541326027 541152077 540924454 540737991 540654106 540669289 540738754 540819969 540889244 540923767 540887718 540750771
2604.8 540750771 540524979 540273437 540073853 539963684 539913979 539848671 539691353 539409828 539033432 538636551
2614.4 538636551 538294601 538039589 537843781 537647209 537403145 537102585 536763535 536405220 536038704 535678558
2624.1 535678558 535350990 535079308 534856644 534631920 534329071 533888741 533309097 532656670 532040405 531557922
2633.7 531557922 531244354 531052551 530878906 530616379 530202522 529636993 528966522 528257294 527569427 526942368
2643.4 526942368 526389313 525895844 525428238 524946632 524420776 523843269 523234444 522636871 522095642 521632385
2653 521632385 521225395 520812340 520322456 519718285 519015884 518265877 517508087 516739273 515921555 515018578
2662.6 515018578 514025307 512965508 511861610 510709457 509478455 508131485 506649323 505044022
$$ packed form
2594.2E41326027j73950k27623j86463q3885J5183O9465Q1215O9275L4523l6049j36947
2604.8E40750771k25792k51542j99584j10169m9705o5308j57318k81525l76396l96881
2614.4E38636551l41950k55012j95808j96572k44064l00560l39050l58315l66516l60146
2624.1E35678558l27568k71682k22664k24724l02849m40330n79644o52427o16265m82483
2633.7E31557922l13568j91803j73645k62527m13857n65529o70471p09228o87867o27059
2643.4E26942368n53055m93469m67606m81606n25856n77507o08825n97573n41229m63257
2653E21632385m06990m13055m89884o04171p02401p50007p57790p68814q17718r02977
2662.6E15018578r93271j059799j103898j152153j231002j346970j482162j605301
$$ plain form
2670.4 505044022 503354225 501624908 499879646 498107452 496282692 494412117 492570152 490891342
2678.1 490891342 489514923 488529816 487963715 487821884 488130951 488938904 490265388 492046394 494124222
2686.8 494124222 496296730 498389702 500304184 502013397 503528671 504866638 506037865 507050438
2694.5 507050438 507911987 508628006 509197540 509613571 509866638 509954033 509889946 509712105 509470520 509202843
2704.1 509202843 508918190 508610725 508290329 507993851 507750854 507537956 507277069 506896820 506401596 505880203
2713.8 505880203 505438766 505122070 504887733 504647942 504328880 503902664 503386765 502826691 502273712 501759338
2723.4 501759338 501276245 500785980 500252457 499668999 499048309 498388443 497659645 496837578 495948792 495065842
2733 495065842 494245186 493468094 492653999 491738281 490734940 489713821 488723640 487745323 486732674
$$ packed form
2670.4E05044022j689797j729317j745262j772194j824760j870575j841965j678810
2678.1D90891342j376419r85107n66101j41831L09067Q07953J326484J781006K077828
2686.8D94124222K172508K092972J914482J709213J515274J337967J171227J012573
2694.5E07050438Q61549P16019N69534M16031K53067Q7395o4087j77841k41585k67677
2704.1E09202843k84653l07465l20396k96478k42997k12898k60887l80249m95224n21393
2713.8E05880203m41437l16696k34337k39791l19062m26216n15899n60074n52979n14374
2723.4E01759338m83093m90265n33523n83458o20690o59866p28798q22067q88786q82950
2733D95065842q20656p77092q14095r15718j003341j021119r90181r78317j012649
$$ plain form
2741.7 486732674 485688553 484686165 483803673 483039017 482298508 481470451 480516663 479493484 478489838
2750.4 478489838 477546043 476623535 475647278 474574890 473433266 472292252 471205292 470171547 469153137
2759.1 469153137 468124466 467100334 466115036 465184631 464300117 463463058 462717285 462132187 461747627
2767.8 461747627 461536636 461425285 461345673 461271706 461209335 461163788 461121178 461058617 460969162 460874977 460815163
2778.4 460815163 460816689 460868340 460922012 460925179 460859489 460750580 460642395 460562706 460516701 460505333 460537720
2789 460537720 460616035 460715446 460794945 460837250 460875931 460966644 461126595 461301651 461400070 461357918 461175652
2799.6 461175652 460894585 460549583 460149422 459698067 459216957 458736343 458263550 457769318 457214165 456592598
2809.2 456592598 455950089 455358620 454871330 454498901 454219398 454002380 453817787 453628693 453387337 453055267
$$ packed form
2741.7D86732674j044121j002388q82492p64656p40509q28057r53788j023179j003646
2750.4D78489838r43795r22508r76257j072388j141624j141014j086960j033745j018410
2759.1D69153137j028671j024132r85298r30405q84514q37059p45773n85098l84560
2767.8D61747627k10991j11351p9612p3967o2371m5547m2610o2561q9455r4185n9814
2778.4D60815163J526N1651N3672L167o5690j08909j08185p9689m6005j1368L2387
2789D60537720P8315R9411P9499M2305L8681R0713J59951J75056R8419m2152j82266
2799.6D61175652k81067l45002m00161m51355m81110m80614m72793m94232n55153o21567
2809.2D56592598o42509n91469m87290l72429k79503k17018j84593j89094k41356l32070
$$ plain form
2818.9 453055267 452639542 452205200 451842232 451599579 451442604 451276474 451020279 450668831 450283623 449925880
2828.5 449925880 449596710 449244080 448829155 448380203 447978020 447688637 447511063 447389870 447271118 447138710
2838.2 447138710 446999016 446846046 446657562 446423950 446166649 445911560 445643158 445296860 444809456 444178505
2847.8 444178505 443469124 442760925 442090912 441441612 440775909 440071030 439325371 438549042 437762489 437006264
2857.4 437006264 436338577 435806961 435409698 435082397 434724159 434251099 433636551 432916336 432161598 431442032
2867.1 431442032 430798988 430230293 429688225 429094582 428377724 427513046 426534805 425503769 424458237
2875.8 424458237 423396378 422311783 421244850 420296860 419586067 419181328 419065132 419149933 419327011
2884.4 419327011 419509583 419646187 419706764 419664574 419493675 419183502 418748703 418213921 417588158 416857300
$$ packed form
2818.9D53055267m15725m34342l62968k42653j56975j66130k56195l51448l85208l57743
2828.5D49925880l29170l52630m14925m48952m02183k89383j77574j21193j18752j32408
2838.2D47138710j39694j52970j88484k33612k57301k55089k68402l46298m87404o30951
2847.8D44178505p09381p08199o70013o49300o65703p04879p45659p76329p86553p56225
2857.4D37006264o67687n31616l97263l27301l58238m73060o14548p20215p54738p19566
2867.1D31442032o43044n68695n42068n93643p16858q64678r78241j031036j045532
2875.8D24458237j061859j084595j066933r47990p10793m04739j16196Q4801J77078
2884.4D19327011J82572J36604O0577m2190j70899l10173m34799n34782o25763p30858
$$ plain form
2894.1 416857300 416005936 415042000 413991356 412867889 411658592 410348473 408954735 407527351 406113968
2902.8 406113968 404731827 403380814 402079544 400876617 399816895 398896904 398050461 397178955 396203537
2911.4 396203537 395103531 393917046 392703781 391496201 390278053 389009285 387668343 386267014
2919.2 386267014 384820137 383311768 381703339 379979210 378177910 376374931 374639244 373008156
2926.9 373008156 371492386 370085869 368765907 367495689 366244087 365003891 363779488 362553711
2934.6 362553711 361279869 359918175 358477707 357004814 355518570 353963280 352233696 350255966
2942.3 350255966 348048019 345705376 343337479 341010132 338733292 336477127 334198112 331859627
2950 331859627 329449615 326985626 324499893 322015686 319542942 317096672 314711323 312426682 310258751
$$ packed form
2894.1D16857300q51364r63936j050644j123467j209297j310119j393738j427384j413383
2902.8D06113968j382141j351013j301270j202927j059722r19991q46443q71506r75418
2911.4C96203537j100006j186485j213265j207580j218148j268768j340942j401329
2919.2C86267014j446877j508369j608429j724129j801300j802979j735687j631088
2926.9C73008156j515770j406517j319962j270218j251602j240196j224403j225777
2934.6C62553711j273842j361694j440468j472893j486244j555290j729584j977730
2942.3C50255966k207947k342643k367897k327347k276840k256165k279015k338485
2950C31859627k410012k463989k485733k484207k472744k446270k385349k284641k167931
$$ plain form
2958.7 310258751 308192539 306212730 304333382 302588062 300988617 299507217 298106213 296780529
2966.4 296780529 295559235 294465485 293486004 292589188 291759300 291003246 290327606 289728031 289209423
2975.1 289209423 288802299 288535233 288389187 288293228 288177299 288024368 287863808 287721138 287592106 287472172
2984.7 287472172 287393761 287416897 287577324 287853966 288192024 288552780 288940029 289383602 289906597 290503674
2994.4 290503674 291141396 291775112 292374077 292947769 293548813 294250259 295105972 296124325 297269859
3003.1 297269859 298486214 299725304 300965157 302208691 303465500 304733543 306001835 307271557
3010.8 307271557 308566761 309909496 311279068 312598362 313768044 314720631 315450459 316005936 316462479
3019.5 316462479 316888657 317309494 317684174 317931232 317998734 317923489 317810993 317749691 317743473 317733345 317670250
$$ packed form
2958.7C10258751k066212j979809j879348j745320j599445j481400j401004j325684
2966.4B96780529j221294j093750r79481q96816q29888p56054o75640n99575n18608
2975.1B89209423m07124k67066j46046r5959j15929j52931j60560j42670j29032j19934
2984.7B87472172p8411K3136J60427K76642L38058L60756L87249M43573N22995N97077
2994.4B90503674O37722O33716N98965N73692O01044P01446Q55713J018353J145534
3003.1B97269859J216355J239090J239853J243534J256809J268043J268292J269722
3010.8C07271557J295204J342735J369572J319294J169682R52587P29828N55477M56543
3019.5C16462479M26178M20837L74680K47058O7502p5245j12496o1302o218j0128o3095
$$ plain form
3030.1 317670250 317550240 317381668 317145119 316815090 316420250 316057148 315822620 315729618 315694904 315603352
3039.7 315603352 315377808 314986534 314407024 313606567 312568493 311322556 309931068 308434620 306812325
3048.4 306812325 305004749 302976646 300761509 298448448 296143341 293959961 292052708 290635548
3056.1 290635548 289919224 289980831 290659714 291580830 292302628 292496548 292041931 291004772 289545879
3064.8 289545879 287827282 285954475 283951550 281767178 279312897 276528072 273436565 270151978
3072.5 270151978 266822701 263558140 260401993 257371902 254524040 251976700 249873028 248319473
3080.2 248319473 247353935 246948891 247020054 247425690 247979736 248501034 248880672 249110527 249242325 249315491
3089.9 249315491 249321098 249226131 249022675 248746624 248452530 248174229 247910366 247638531 247333641 246976795
$$ packed form
3030.1C17670250j20010j68572k36549l30029l94840l63102k34528r3002l4714r1552
3039.7C15603352k25544l91274n79510q00457j038074j245937j391488j496448j622295
3048.4C06812325j807576k028103k215137k313061k305107k183380j907253j417160
3056.1B90635548p16324O1607O78883R21116P21798J93920m54617j037159j458893
3064.8B89545879j718597j872807k002925k184372k454281k784825l091507l284587
3072.5B70151978l329277l264561l156147l030091k847862k547340k103672j553555
3080.2B48319473r65538m05044P1163M05636N54046N21298L79638K29855J31798P3166
3089.9B49315491N607r4967k03456k76051k94094k78301k63863k71835l04890l56846
$$ plain form
3099.5 246976795 246557007 246078167 245566921 245061626 244581261 244099445 243554993 242893772 242100830 241185532
3109.1 241185532 240139809 238916912 237456646 235724087 233719025 231455936 228951054 226232166
3116.9 226232166 223345585 220336533 217222633 214005985 210718307 207440395 204257889 201198845
3124.6 201198845 198227844 195309715 192465973 189757118 187217388 184825420 182545471 180380726
3132.3 180380726 178370762 176539402 174863434 173299274 171830692 170479317 169271908 168212719
3140 168212719 167291603 166505814 165857220 165324783 164849815 164363079 163832703 163284893 162771893 162315292
3149.6 162315292 161875095 161372089 160743904 159982424 159118185 158169518 157107048 155875731 154456177
3158.3 154456177 152909212 151355276 149908228 148624134 147508497 146568251 145844460 145392046 145225906
$$ packed form
3099.5B46976795m19788m78840n11246n05295m80365m81816n44452o61221p92942r15298
3109.1B41185532j045723j222897j460266j732559k005062k263089k504882k718888
3116.9B26232166k886581l009052l113900l216648l287678l277912l182506l059044
3124.6B01198845k971001k918129k843742k708855k539730k391968k279949k164745
3132.3A80380726k009964j831360j675968j564160j468582j351375j207409j059189
3140A68212719r21116p85789o48594n32437m74968m86736n30376n47810n13000m56601
3149.6A62315292m40197n03006o28185p61480q64239r48667j062470j231317j419554
3158.3A54456177j546965j553936j447048j284094j115637r40246p23791m52414j66140
$$ plain form
3167 145225906 145291662 145493202 145754776 146063414 146464901 147021933 147773256 148719978 149839411 151114969
3176.6 151114969 152556353 154199066 156084051 158232822 160638733 163280087 166142349 169230137
3184.4 169230137 172560863 176147614 179986324 184057102 188342113 192853203 197644825 202790947
3192.1 202790947 208330650 214227486 220388203 226734867 233255444 239968815 246823120 253629818
3199.8 253629818 260116615 266072960 271469383 276459522 281279316 286135788 291156292 296399021
3207.5 296399021 301880436 307589836 313487396 319494858 325485458 331288834 336731796 341707191
3215.2 341707191 346224937 350395432 354350433 358167343 361859016 365413132 368815842 372023392
3222.9 372023392 374927254 377384682 379310608 380742302 381795921 382551193 382983437 383016090 382633018
$$ packed form
3167A45225906O5756K01540K61574L08638M01487N57032P51323R46722J119433J275558
3176.6A51114969J441384J642713J884985K148771K405911K641354K862262L087788
3184.4A69230137L330726L586751L838710M070778M285011M511090M791622N146122
3192.1B02790947N539703N896836O160717O346664O520577O713371O854305O806698
3199.8B53629818O486797N956345N396423M990139M819794M856472N020504N242729
3207.5B96399021N481415N709400N897560O007462N990600N803376N442962M975395
3215.2C41707191M517746M170495L955001L816910L691673L554116L402710L207550
3222.9C72023392K903862K457428J925926J431694J053619P55272M32244L2653l83072
$$ plain form
3231.6 382633018 381919174 380986557 379869537 378508224 376826248 374804039 372466927 369823570 366845169
3240.3 366845169 363512039 359865608 355992508 351963348 347801323 343507271 339094086 334572639
3248 334572639 329909096 325021324 319838085 314365845 308693409 302935295 297174950 291459084 285831757
3256.7 285831757 280358963 275125694 270222340 265745258 261802864 258507481 255943432 254136124
3264.4 254136124 253052711 252637901 252855759 253700886 255171204 257228260 259777126 262683163 265810509
3273.1 265810509 269062176 272401829 275849247 279444904 283198700 287058125 290928650 294734726
3280.8 294734726 298466663 302166805 305870762 309569569 313231144 316845055 320433998 324014435
3288.5 324014435 327561340 331021767 334367485 337623711 340846519 344073677 347304687 350521584
$$ packed form
3231.6C82633018p13844r32617j117020j361313j681976k022209k337112k643357k978401
3240.3C66845169l333130l646431l873100m029160m162025m294052m413185m521447
3248C34572639m663543m887772n183239n472240n672436n758114n760345n715866n627327
3256.7B85831757n472794n233269m903354m477082l942394l295383k564049j807308
3264.4B54136124j083413m14810K17858Q45127J470318K057056K548866K906037L127346
3273.1B65810509L251667L339653L447418L595657L753796L859425L870525L806076
3280.8B94734726L731937L700142L703957L698807L661575L613911L588943L580437
3288.5C24014435L546905L460427L345718L256226L222808L227158L231010L216897
$$ plain form
3296.2 350521584 353724823 356941376 360196419 363474197 366705856 369802170 372716370 375484924
3303.9 375484924 378207664 380974083 383803406 386649208 389455833 392200356 394881096 397484055
3311.7 397484055 399981461 402369041 404679756 406945190 409143867 411208611 413097763 414853020
3319.4 414853020 416570435 418308830 420030670 421636658 423056450 424311523 425501022 426735268
3327.1 426735268 428074303 429502640 430943298 432299309 433500366 434530258 435419540 436216850 436962166
3335.8 436962166 437679596 438378181 439052467 439685783 440265656 440797462 441298370 441775093 442210655 442573166
3345.4 442573166 442829132 442941895 442873993 442618027 442234192 441835556 441500244 441191406 440783195 440186424
3355.1 440186424 439445229 438693123 438008308 437326965 436508408 435475540 434278488 433022919 431756744
$$ packed form
3296.2C50521584L203239L216553L255043L277778L231659L096314K914200K768554
3303.9C75484924K722740K766419K829323K845802K806625K744523K680740K602959
3311.7C97484055K497406K387580K310715K265434K198677K064744J889152J755257
3319.4D14853020J717415J738395J721840J605988J419792J255073J189499J234246
3327.1D26735268J339035J428337J440658J356011J201057J029892Q89282P97310P45316
3335.8D36962166P17430O98585O74286O33316N79873N31806N00908M76723M35562L62511
3345.4D42573166K55966J12763o7902k55966l83835l98636l35312l08838m08211n96771
3355.1D40186424p41195p52106o84815o81343q18557j032868j197052j255569j266175
$$ plain form
3363.7 431756744 430442696 429030533 427528954 425991135 424441261 422839355 421129189 419313622
3371.4 419313622 417462845 415639496 413820801 411907616 409810524 407522507 405104370 402609558
3379.2 402609558 400038109 397358322 394555321 391638489 388609085 385442657 382112160 378618965
3386.9 378618965 374984589 371209259 367253227 363064156 358617554 353922806 348993073 343814964
3394.6 343814964 338342819 332513084 326256485 319510670 312234459 304417439 296064587 287164650
3402.3 287164650 277669258 267507572 256630840 245052376 232855072 220167847 207145138
3409.1 207145138 193982925 180985546 168639107 157627316 148756180 142829285 140552015 142497911
3416.8 142497911 149087515 160512619 176603565 196731415 219838448 244613266 269735870
$$ packed form
3363.7D31756744j314048j412163j501579j537819j549874j601906j710166j815567
3371.4D19313622j850777j823349j818695j913185k097092k288017k418137k494812
3379.2D02609558k571449k679787k803001k916832l029404l166428l330497l493195
3386.9C78618965l634376l775330l956032m189071m446602m694748m929733n178109
3394.6C43814964n472145n829735o256599o745815p276211p817020q352852q899937
3402.3B87164650r495392j0161686j0876732j1578464j2197304j2687225j3022709
3409.1B07145138j3162213j2997379j2346439j1011791q871136n926895k277270J945896
3416.8A42497911O589604J1425104J6090946K0127850K3107033K4774818K5122604
$$ plain form
3423.5 269735870 294086876 316858082 337557907 355946388 371956444 385646324 397193336
3430.3 397193336 406892471 415115852 422229080 428514900 434153862 439260559 443931160 448250008
3438 448250008 452263832 455964432 459315567 462305489 464978409 467409973 469651604 471697464 473508835
3446.7 473508835 475068626 476411934 477603607 478690758 479682846 480568848 481340332 481994057 482524643
3455.3 482524643 482934608 483253975 483539581 483837547 484150658 484455299 484751320 485078659 485469818 485889397
3465 485889397 486244545 486470871 486605339 486761818 487033157 487421875 487860870 488282776 488652534 488947296
3474.6 488947296 489138260 489216003 489226494 489256859 489372406 489572029 489804802 490021172 490196457 490317802
3484.3 490317802 490376053 490389557 490426674 490577469 490890121 491330261 491806374 492235870 492587357 492873917
$$ packed form
3423.5B69735870K4351006K2771206K0699825J8388481J6010056J3689880J1547012
3430.3C97193336R699135Q223381P113228O285820N638962N106697M670601M318848
3438D48250008M013824L700600L351135K989922K672920K431564K241631K045860J811371
3446.7D73508835J559791J343308J191673J087151R92088Q86002P71484O53725N30586
3455.3D82524643M09965L19367K85606K97966L13111L04641K96021L27339L91159M19579
3465D85889397L55148K26326J34468J56479K71339L88718M38995M21906L69758K94762
3474.6D88947296J90964P7743J0491L0365J15547J99623K32773K16370J75285J21345
3484.3D90317802N8251J3504L7117J50795L12652M40140M76113M29496L51487K86560
$$ plain form
3493.9 492873917 493115959 493319511 493487892 493648834 493859787 494169121 494558716 494930725 495177727 495289764
3503.6 495289764 495387383 495626564 496056900 496581993 497062721 497446785 497784042 498132439 498486252 498809662
3513.2 498809662 499103889 499400787 499698524 499950790 500145607 500358086 500674820 501060829 501348610 501401711
3522.9 501401711 501280327 501211510 501384926 501787529 502237854 502560730 502718430 502805481 502958031 503269920
3532.5 503269920 503746414 504301147 504800148 505152168 505375023 505574112 505850296 506237144 506716270 507257423
3542.1 507257423 507805862 508252220 508480644 508496933 508495598 508736572 509310608 510030479 510584679 510820541
3551.8 510820541 510875740 511033821 511456604 512059250 512626724 513022804 513273773 513486900 513740387 514076347
3561.4 514076347 514555626 515232048 516030807 516691475 516929741 516715355 516376038 516365204 516887665 517746735
$$ packed form
3493.9D92873917K42042K03552J68381J60942K10953L09334L89595L72009K47002J12037
3503.6D95289764R7619K39181M30336N25093M80728L84064L37257L48397L53813L23410
3513.2D98809662K94227K96898K97737K52266J94817K12479L16734L86009K87781N3101
3522.9E01401711j21384o8817J73416M02603M50325L22876J57700Q7051J52550L11889
3532.5E03269920M76494N54733M99001L52020K22855J99089K76184L86848M79126N41153
3542.1E07257423N48439M46358K28424J6289j335K40974N74036P19871N54200K35862
3551.8E10820541N5199J58081M22783O02646N67474L96080K50969K13127K53487L35960
3561.4E14076347M79279O76422P98759O60668K38266k14386l39317j0834N22461Q59070
$$ plain form
3571.1 517746735 518559532 519099159 519425507 519728966 520115204 520558281 521005821 521456642 521936378 522455978
3580.7 522455978 523033257 523715286 524507256 525261269 525699921 525639076 525223312 524907188 525140419 526019554
3590.4 526019554 527223091 528280716 528926620 529238014 529493179 529922600 530567398 531307716 531980171
3599 531980171 532480927 532816048 533097382 533481255 534058075 534756927 535363159 535677299 535708046 535715752
3608.7 535715752 536020393 536710205 537531624 538111153 538333473 538488388 538987579 539910049 540872803 541402168
3618.3 541402168 541413231 541260986 541324158 541648521 542071457 542592010 543401566 544463844 545238686 545080223
3628 545080223 543985786 542799301 542512894 543359489 544666672 545583000 545842209 545807724 545928726 546307564
3637.6 546307564 546755371 547085648 547261887 547353096 547471237 547738380 548200798 548718491 548989830 548741989
$$ packed form
3571.1E17746735Q12797N39627L26348L03459L86238M43077M47540M50821M79736N19600
3580.7E22455978N77279O82029P91970P54013M38652o0845m15764l16124K33231Q79135
3590.4E26019554J203537J057625O45904L11394K55165M29421O44798P40318O72455
3599E31980171N00756L35121K81334L83873N76820O98852O06232L14140L0747P706
3608.7E35715752L04641O89812Q21419N79529K22320J54915M99191R22470R62754N29365
3618.3E41402168J1063j52245O3172L24363M22936N20553Q09556J062278P74842j58463
3628E45080223j094437j186485k86407Q46595J307183R16328K59209l4485J21002L78838
3637.6E46307564M47807L30277J76239R1209J18141K67143M62418N17693K71339k47841
$$ plain form
3647.3 548741989 547913361 546688194 545433083 544619560 544657822 545599174 546949539 547928772 548079033
3655.9 548079033 547638054 547249031 547307472 547653580 547872238 547754974 547411919 547070808 546933479 547164688
3665.6 547164688 547770729 548380280 548352661 547388458 546055374 545442467 546077576 547242126 547558899
3674.3 547558899 546334000 544246483 542683487 542482605 543371696 544494476 545269966 545709953 546110268
3682.9 546110268 546645813 547249794 547711906 547789307 547308960 546305389 545099449 544166336 543840141
3691.6 543840141 544107857 544667740 545171661 545440102 545518036 545585098 545783539 546061020 546162415 545842400
3701.3 545842400 545142517 544438744 544145699 544356613 544798622 545135117 545239601 545137215 544776039 544023247
3710.9 544023247 542942085 541949883 541540489 541814651 542368507 542697945 542660332 542486534 542407608 542395897
$$ packed form
3647.3E48741989q28628j225167j255111q13523L8262R41352J350365R79233J50261
3655.9E48079033m40979l89023N8441L46108K18658j17264l43055l41111j37329K31209
3665.6E47164688O06041O09551k7619r64203j333084o12907O35109J164550L16773
3674.3E47558899j224899k087517j562996k00882Q89091J122780P75490M39987M00315
3682.9E46110268N35545O03981M62112P7401m80347j003571j205940r33113l26195
3691.6E43840141K67716N59883N03921K68441P7934O7062J98441K77481J01395l20015
3701.3E45842400o99883p03773k93045K10914M42009L36495J04484j02386l61176p52792
3710.9E44023247j081162r92202m09394K74162N53856L29438l7613j73798p8926j1711
$$ plain form
3720.5 542395897 542290688 542048454 541755829 541448975 541067047 540629959 540358849 540504150 541068001 541763191
3730.2 541763191 542240105 542285995 541810608 540790253 539359818 537930145 537051735 537059288 537863388 539094582
3739.8 539094582 540363922 541315269 541559868 540839996 539408798 538100319 537731628 538292389 538822289
3748.5 538822289 538254433 536437607 534305878 533058891 533216286 534409447 535888748 537069397 537666626
3757.2 537666626 537595482 536977272 536209297 535794487 535927467 536273956 536287231 535789108 535171509 534964142
3766.8 534964142 535247574 535577393 535492973 535009193 534548950 534463959 534727516 535094490 535412788 535664444
3776.5 535664444 535766487 535524216 534876213 534099083 533623886 533610115 533778229 533714485 533311272 532854195
3786.1 532854195 532693825 532883224 533153534 533211594 533036537 532882919 532982445 533234520 533236046 532705193
$$ packed form
3720.5E42395897j05209k42234k92625l06854l81928m37088k71110J45301N63851O95190
3730.2E41763191M76914M5890m75387j020355j430435j429673q78410P553Q04100J231194
3739.8E39094582J269340R51347K44599p19872j431198j308479l68691N60761N29900
3748.5E38822289n67856j816826k131729j246987J57395J193161J479301J180649N97229
3757.2E37666626p1144o18210p67975m14810J32980L46489J3275m98123o17599k07367
3766.8E34964142K83432L29819q4420m83780m60243q4991K63557L66974L18298K51656
3776.5E35664444J02043k42271o48003p77130m75197j3771J68114o3744m03213m57077
3786.1E32854195j60370J89399K70310N8060j75057j53618R9526K52075J526n30853
$$ plain form
3795.8 532705193 531886139 531399994 531561165 531894379 531548615 530297318 528976326 528703842 529657822
3804.4 529657822 530816765 531011391 530095520 528943291 528426094 528652382 529207001 529777641 530260849
3813.1 530260849 530431290 529965401 528965836 528160248 528205757 528818359 528916016 527801704 526039238 524934349
3822.8 524934349 525187035 526250153 527040367 527074203 526757164 526691475 526957207 527143745 526920166 526406250
3832.4 526406250 525997200 525935402 526084213 526063805 525582275 524693718 523781357 523266449 523268814 523534508
3842.1 523534508 523702736 523635445 523477707 523443565 523624840 524006920 524540558 525055428 525127373 524229698
3851.7 524229698 522217903 519696655 517772369 517279358 518161392 519597511 520731506 521283226 521501007
3860.4 521501007 521634865 521583633 521097450 520242424 519517174 519407539 519844093 520198669 519895859 519004440
$$ packed form
3795.8E32705193q19054m86145J61171L33214l45764j251297j320992k72484R53980
3804.4E29657822J158943J94626r15871j152229n17197K26288N54619N70640M83208
3813.1E30260849J70441m65889r99565q05588M5509O12602R7657j114312j762466j104889
3822.8E24934349K52686J063118P90214L3836l17039o5689K65732J86538k23579n13916
3832.4E26406250m09050o1798J48811k0408m81530q88557r12361n14908K365K65694
3842.1E23534508J68228o7291j57738l4142J81275L82080N33638N14870P1945q97675
3851.7E24229698k011795k521248j924286m93011Q82034J436119J133995N51720K17781
3860.4E21501007J33858n1232m86183q55026p25250j09635M36554L54576l02810q91419
$$ plain form
3870 519004440 518150864 517831688 517903481 517845955 517484474 517277260 517755623 518749847 519380951 518949471
3879.7 518949471 517757683 516881599 517068405 517954979 518471756 517984390 516928329 516301346 516623421
3888.3 516623421 517467232 517951355 517586975 516642761 515809975 515606499 516044273 516723671 517170639 517148361
3898 517148361 516764793 516334648 516105843 516064110 515975838 515631065 515068779 514581146 514486809 514864807
3907.6 514864807 515480003 515972900 516153488 516128883 516144867 516303902 516453972 516350899 515899086 515221100
3917.3 515221100 514536171 514028397 513813438 513923988 514249992 514529266 514511833 514189224 513827248 513725166
3926.9 513725166 513940620 514254990 514377632 514158325 513647346 513035545 512553329 512355804 512425652 512594757
3936.6 512594757 512696266 512691383 512622414 512473450 512165451 511721420 511361237 511333885 511640663 511976128
$$ packed form
3870E19004440q53576l19176P1793n7526l61481k07214M78363R94224O31104m31480
3879.7E18949471j191788q76084J86806Q86574N16777m87366j056061o26983L22075
3888.3E16623421Q43811M84123l64380r44214q32786k03476M37774O79398M46968k2278
3898E17148361l83568m30145k28805m1733q8272l44773n62286m87633r4337L77998
3907.6E14864807O15196M92897J80588k4605J5984J59035J50070j03073m51813o77986
3917.3E15221100o84929n07774k14959J10550L26004K79274j7433l22609l61976j02082
3926.9E13725166K15454L14370J22642k19307n10979o11801m82216j97525O9848J69105
3936.6E12594757J01509m883o8969j48964l07999m44031l60183k7352L06778L35465
$$ plain form
3946.2 511976128 511978645 511539078 510874825 510335770 510139008 510241432 510421028 510480843 510397949 510273247
3955.8 510273247 510151138 509950447 509609756 509240341 509033012 509016228 509018059 508914223 508800049 508811073
3965.5 508811073 508855247 508692894 508279648 507849541 507585449 507371674 507020378 506607094 506354980 506230049
3975.1 506230049 505935402 505379868 504878159 504691467 504601097 504244347 503722801 503441696 503342590 502824326
3984.8 502824326 501688919 500639801 500285759 500026855 498813171 496944275 495896988 495762444 494195213
3993.5 494195213 489653015 484896393 483754692 481821136 462218437 405894928 310262108
4000.2 310262108
$$ packed form
3946.2E11976128K517m39567o64253n39055j96762J02424J79596N9815q2894j24702
3955.8E10273247j22109k00691l40691l69415k07329j6784J831j03836j14174J1024
3965.5E08811073M4174j62353m13246m30107k64092k13775l51296m13284k52114j24931
3975.1E06230049k94647n55534n01709j86692r0370l56750n21546k81105r9106n18264
3984.8E02824326j135407j049118l54042k58904j213684j868896j047287j34544j567231
3993.5D94195213m542198m756622j141701j933556j9602699n6323509r5632820
4000.2C10262108
##END=$$ End of the data block
