##TITLE=$$ Begin of the data block
##JCAMP-DX=5.00 $$ ACD/SpecManager v 10.08
##SPECTROMETER/DATA SYSTEM=Alpha
##DATE=13 Jun 2014 08:26:00
##DATA TYPE=INFRARED SPECTRUM
##DATA CLASS=XYDATA
##ORIGIN=
##OWNER=
##NPOINTS=1765
##FIRSTX=399.75695801
##LASTX=3997.56933594
##MAXX=3997.56933594
##MINX=399.75695801
##MAXY=0.71591163
##MINY=0.03792910
##XFACTOR=1.0000000000
##YFACTOR=1.000000000000000e-9
##FIRSTY=0.28840053
##DELTAX=2.03957629
##XUNITS=1/CM
##YUNITS=ARBITRARY UNITS
##XYDATA=(X++(Y..Y))
399.8B88400531J0370582R416074R930879J0746866J0115862R378046R797603R492010
$$ 288400531 298771113 308187187 318118066 328864932 338980794 348358840 358156443 367648453
416.1C67648453R537309J0297656Q971840P453770P171839P852584P548928O023825
$$ 367648453 377185762 387483418 396455258 403909028 411080867 418933451 426482379 432506204
432.4D32506204O062239O702602N499840M888117O249070N950600M036337M202247
$$ 432506204 438568443 445271045 450770885 455659002 461908072 467858672 471895009 476097256
448.7D76097256N049348L855139K798557L870756L876596K117902K355665L538966
$$ 476097256 481146604 485001743 487800300 491671056 495547652 497665554 500021219 503560185
465E03560185K778352J891315K886355L363013K217054K200604L279090L030061K163709
$$ 503560185 506338537 508229852 511116207 514479220 516696274 518896878 522175968 525206029 527369738
483.4E27369738K535045K852142K030670J887977K634764K144396J055479J539112
$$ 527369738 529904783 532756925 534787595 536675572 539310336 541454732 542510211 544049323
499.7E44049323K285182J378954Q55505J610160J360118L97504P86185J415729N38290
$$ 544049323 546334505 547713459 548568964 550179124 551539242 551936746 552722931 554138660 554676950
518.1E54676950j38700P35104J162291L76582L60727J196146R77218L48091R95875
$$ 554676950 554538250 555273354 556435645 556812227 557172954 558369100 559346318 559694409 560690284
536.4E60690284J592576Q74162N38230J217127J116931J35064J73390Q06630K46823
$$ 560690284 562282860 563157022 563695252 564912379 566029310 566164374 566337764 567144394 567391217
554.8E67391217n48899p9990L89755r2328k4199O85274K25783p06494k24948N53370
$$ 567391217 566842318 566762328 567152083 567059755 567035556 567720830 567946613 567240119 567015171 567568541
575.2E67568541N6684l31343N65112J089871M18663L06308J037359Q73626R3519K58387
$$ 567568541 567625225 567293882 567858994 568948865 569367528 569673836 570711195 571584821 571678340 571936727
595.6E71936727M96983l47972r28700o44564r93133j678228j021266J19209R7692j84953
$$ 571936727 572433710 572085738 571157038 570512474 569519341 567841113 566819847 566939056 567036748 566851795
616E66851795N42938J213253Q56101P90716J339495J035273L50058Q30710J688480
$$ 566851795 567394733 568607986 569464087 570254803 571594298 572629571 572979629 573810339 575498819
634.3E75498819J433909R34184J345515J384914M12166J33455O06894J14143q10861
$$ 575498819 576932728 577866912 579212427 580597341 581009507 581142962 581749856 581863999 581053138
652.7E81053138n55575m5300o45578j084029m04060j29044j108051j064002N83529
$$ 581053138 580497563 580452263 579806685 578722656 578318596 578189552 577081501 576017499 576601028
671E76601028M04299k86103J61648M51267m50313r83298o11603r82702k214491k755225
$$ 576601028 577005327 576719224 576880872 577332139 576881826 575898528 575286925 574304223 572089732 569334507
691.4E69334507l036678m455030o113589o586790p054627q871734j0587692j0888696
$$ 569334507 566297829 561842799 555729210 549142420 542087793 533216059 522628367 511739671
707.7E11739671j0298133q781761o406039m638642l529995m89772N270571J1098146
$$ 511739671 501441538 492659777 486253738 481615096 478085101 477595329 482865900 493964046
724D93964046J5132517J7804742J9058943J7834603J4813841J2153268R864091O891251
$$ 493964046 509096563 526901305 545960248 563794851 578608692 590761960 600626051 607517302
740.4F07517302M446447L660560K927303J497567J022875J414657R20593Q2493K99275
$$ 607517302 611963749 615624309 618551612 620049179 621072054 622486711 623407304 623489797 623789072
758.7F23789072N81503p6771l57568M10139O52433K8491J72079R67621P83682K02418
$$ 623789072 624370575 624293804 623936236 624346375 624998808 625027299 625199378 626166999 626950681 627153099
779.1F27153099O03318R22978J84774k22564L10958J60515p03931n34355J62303j21176
$$ 627153099 627756417 628679395 628864169 628641605 628952563 629113078 628409147 627874792 628037095 627915919
799.5F27915919n49793q9229N5552p35581r82285m25159o83606j531959j430213j053631
$$ 627915919 627366126 627276897 627332449 626596868 625614583 625189424 624505818 622973859 621543646 620490015
819.9F20490015j643777k283216k064526k192020l247381l899872l946543m684269
$$ 620490015 618846238 616563022 614498496 612306476 609059095 605159223 601212680 596528411
836.2E96528411n892694o648481q080363j1657179j4562368j1226356m569113l755987
$$ 596528411 590635717 583987236 575906873 564249694 549687326 538460970 533891857 530135870
852.5E30135870q653164j3461471j7727345k3063838k9998273m0560454n6603044p0051551
$$ 530135870 521482706 508021235 490293890 467230052 437231779 396671325 340068281 270016730
868.9B70016730o3452289l6709860j0746285O312758K2416517L9737880N4220110O4059317
$$ 270016730 206564441 169854581 159108296 165421054 187837571 227575451 281795561 345854878
885.2C45854878O7669928O1826975M8129409L3850908K3534298J6500712J1948049
$$ 345854878 413524806 475351781 523481190 557332098 580866396 597367108 609315157
899.4F09315157R579003P662892N425930M144252L754675K698362J472950J299381
$$ 609315157 618894160 626557052 631982982 636127234 639881909 642580271 644053221 645352602
915.8F45352602J113832p033o43850k69711m15444j111210r10222k91169n81503q65638
$$ 645352602 646466434 646459401 645815551 645545840 645130396 644019186 643108964 642817795 642236292 641370654
936.2F41370654j53422K10106m37021n95033q9884m94182j534641j679003j549185
$$ 641370654 641217232 641427338 640990317 640395284 640305400 639811218 638276577 636597574 635048389
954.5F35048389k365469l074646k802492k889514l799498m031896l629983m124939
$$ 635048389 632682920 629608274 626805782 623916268 620116770 616084874 612454891 608329952
970.8F08329952n095423n274474n476952o640613p612824p658720p874429q500398
$$ 608329952 603234529 597960055 592483103 585842490 578229666 570570946 562696517 554196119
987.1E54196119q348822p542432p268548p216036o466269n750478n933463o247640
$$ 554196119 545847297 538304865 531036317 523820281 517354012 511603534 505670071 499422431
1003.5D99422431o229311o701380p573724p688463p135033o741971o101549m621118
$$ 499422431 493193120 486491740 478918016 471229553 464094520 457352549 451251000 446629882
1019.8D46629882l125906k261728j339436j29491N52803O29396Q75503J129716O53029
$$ 446629882 443503976 441242248 439902812 439773321 440326124 440955520 441831023 442960739 443613768
1038.1D43613768j73509m99994o96540j232505j355707o83994P9543P45982J800448
$$ 443613768 443440259 442940265 442243725 441011220 439655513 438971519 439051062 439797044 441597492
1056.5D41597492K847522L084809K710491K200693J092255r28700k839088l829271
$$ 441597492 444445014 447529823 450240314 452441007 453533262 452604562 449765474 445936203
1072.8D45936203m273355m209310l255546j933962p24465O85513K394230L849774M547030
$$ 445936203 441662848 437453538 434197992 432264030 431539565 432225078 434619308 438469082 443016112
1091.2D43016112M620939M089147K668530R89616K51621L83347M99666P09832J382082
$$ 443016112 447637051 451726198 454394728 455384344 455635965 456019312 456518978 457228810 458610892
1109.5D58610892J827181J609116J342118J155436N41359j37895j44005M3214k23905
$$ 458610892 460438073 462047189 463389307 464544743 465086102 464948207 464804202 464847416 464623511
1127.9D64623511m25458l31938p48217j737178k377212k565682k881288l074319k597749
$$ 464623511 464198053 463866115 463117898 461380720 459003508 456437826 453556538 450482219 447884470
1146.2D47884470j913488j621157j314789n89162Q9944N60611J398534K458393K952963
$$ 447884470 445970982 444349825 443035036 442445874 442535818 443096429 444494963 446953356 449906319
1164.6D49906319K945274K909422K645314K035499J637697J653433J468569Q41856
$$ 449906319 452851593 455761015 458406329 460441828 462079525 463732958 465201527 466043383
1180.9D66043383L28988o6817q45730j653791j936823k144486k662986k903342k655805
$$ 466043383 466372371 466305554 465459824 463806033 461869210 459724724 457061738 454158396 451502591
1199.3D51502591k522587k570838k335698k031713k183259k534926k657741k853930
$$ 451502591 448980004 446409166 444073468 442041755 439858496 437323570 434665829 431811899
1215.6D31811899l305227l522724l455519l548444l734350l630966l444940l500789
$$ 431811899 428506672 424983948 421528429 417979985 414245635 410614669 407169729 403668940
1231.9D03668940l510684l275007l143251l238529l202408l039211l067792l223598
$$ 403668940 400158256 396883249 393739998 390501469 387299061 384259850 381192058 377968460
1248.2C77968460l186762l112406l264248l388971l325909l320545l443420l432274
$$ 377968460 374781698 371669292 368405044 365016073 361690164 358369619 354926199 351493925
1264.5C51493925l346265l423899l592580l632039l681690l879487l990323l940820
$$ 351493925 348147660 344723761 341131181 337499142 333817452 329937965 325947642 322006822
1280.8C22006822l952921m122466m255145m351080m498541m637182m684150m768104
$$ 322006822 318053901 313931435 309676290 305325210 300826669 296189487 291505337 286737233
1297.2B86737233m942447m996895m941583m960954n043835m992127m916996m912183
$$ 286737233 281794786 276797891 271856308 266895354 261851519 256859392 251942396 247030213
1313.5B47030213m842475m769802m847511m950002n003452n103857n252450n380258
$$ 247030213 242187738 237417936 232570425 227620423 222616971 217513114 212260664 206880406
1329.8B06880406n315468n131424n085975n358010n603552n399018n166188n218313
$$ 206880406 201564938 196433514 191347539 185989529 180385977 174986959 169820771 164602458
1346.1A64602458n333423n381152n357623n313695n266934n112619n088687n330085
$$ 164602458 159269035 153887883 148530260 143216565 137949631 132837012 127748325 122418240
1362.4A22418240n245686m831426m708722m563324m467890m617743m385523m049503
$$ 122418240 117172554 112341128 107632406 103069082 98601192 93983449 89597926 85548423
1378.7H5548423l953509l771096l503934l483280l405981l028616k966825l172227
$$ 85548423 81594914 77823818 74319884 70836604 67430623 64402007 61435182 58262955
1395.1E8262955l045372k840918k580799k281286k184376j915593j547306j273711
$$ 58262955 55217583 52376665 49795866 47514580 45330204 43414611 41867305 40593594
1411.4D0593594j022745p72934n69358k99454O9145L54309N62470O89778Q05080Q68075
$$ 40593594 39570849 38797915 38228557 37929103 37998248 38352557 38915027 39604805 40409885 41277960
1431.8D1277960Q49426Q83378R37860P82837O46255N75617N38297N32426M75865M11958
$$ 41277960 42127386 43010764 43948624 44731461 45377716 45953333 46491630 47024056 47499921 47911879
1452.2D7911879L60269L82650N04062N92232O05672O89905P76165P77773Q31105J052622
$$ 47911879 48272148 48654798 49158860 49751092 50356764 51046669 51822834 52600607 53431712 54484334
1472.6E4484334J253534J278974J325131J408312J533352J598801J750611K114631
$$ 54484334 55737868 57016842 58341973 59750285 61283637 62882438 64633049 66747680
1488.9F6747680K445072K366528K426319K950989L168806K959624K672754L005401
$$ 66747680 69192752 71559280 73985599 76936588 80105394 83065018 85737772 88743173
1505.2H8743173M151910L878422L212363L206044L386893L566689L582701L919863
$$ 88743173 92895083 96773505 99985868 103191912 106578805 110145494 113728195 117648058
1521.5A17648058L917209L591046L702209L493517L514603L954470L573567L260925
$$ 117648058 121565267 125156313 128858522 132352039 135866642 139821112 143394679 146655604
1537.8A46655604M389450M963160M359677M308522M420608M827708N106017N325422
$$ 146655604 151045054 156008214 160367891 164676413 169097021 173924729 179030746 184356168
1554.1A84356168N456477P074535Q523643O178648N687177O159350O463304O689832
$$ 184356168 189812645 196887180 205410823 211589471 217276648 223435998 229899302 236589134
1570.5B36589134N606591N175308N952671N282253M436672M434079M388034M134446
$$ 236589134 242195725 247371033 253323704 258605957 263042629 267476708 271864742 275999188
1586.8B75999188L846288L644914L427326L124297K841353K735824K605766K345711
$$ 275999188 279845476 283490390 286917716 290042013 292883366 295619190 298224956 300570667
1603.1C00570667K126962K034217J797348J458526J333415J301140R81569P16061Q20905
$$ 300570667 302697629 304731846 306529194 307987720 309321135 310622275 311603844 312319905 313140810
1621.4C13140810P22944M80473M55529N36054O27399P85231Q96365Q61853R37998J215399
$$ 313140810 313863754 314344227 314799756 315335810 315963209 316748440 317644805 318506658 319444656 320660055
1641.8C20660055J607954J915485J839012J718282K342254K869994K289146K423883
$$ 320660055 322268009 324183494 326022506 327740788 330083042 332953036 335242182 337666065
1658.2C37666065K977490L358215L444165L458947L916055M188031L812492M055261
$$ 337666065 340643555 344001770 347445935 350904882 354820937 359008968 362821460 366876721
1674.5C66876721M256606L875465L946721M579991N215139M465490M128009M405290
$$ 366876721 371133327 375008792 378955513 383535504 388750643 393216133 397344142 401749432
1690.8D01749432M220575M774809N363882N112320N180716M485697M203617M177899
$$ 401749432 405970007 410744816 416108698 421221018 426401734 430887431 435091048 439268947
1707.1D39268947L726840L734558L795594L690422L775150L434151K798468K735764
$$ 439268947 442995787 446730345 450525939 454216361 457991511 461425662 464224130 466959894
1723.4D66959894L020554L106833K930582K811402L219574K979935K358466K659470
$$ 466959894 469980448 473087281 476017863 478829265 482048839 485028774 487387240 490046710
1739.7D90046710K935856K683461K550483K812028K989590K550840K235353K564550
$$ 490046710 492982566 495666027 498216510 501028538 504018128 506568968 508804321 511368871
1756.1E11368871K609193K245367K242982K222776J987875J835287J899063J764000
$$ 511368871 513978064 516223431 518466413 520689189 522677064 524512351 526411414 528175414
1772.4E28175414J087069O88195N93186Q5234p29203j268625j532435j738549k157509
$$ 528175414 529262483 529950678 530543864 530629098 529899895 528631270 527098835 525360286 523202777
1790.7E23202777k481401k131939j635969j104116k54274M93527J073062J951158K915085
$$ 523202777 520721376 518589437 516953468 515849352 515595078 516088605 517161667 519112825 522027910
1809.1E22027910L406226L609300M067898M438221M290879M086673M160941L996253
$$ 522027910 525434136 529043436 533111334 537549555 541840434 545927107 550088048 554084301
1825.4E54084301L417194L270626L219902K697647K350688K432525K409578K081513
$$ 554084301 557501495 560772121 563992023 566689670 569040358 571472883 573882461 575963974
1841.7E75963974J994908K112806J881301J542628J562357J734316J610339J422763
$$ 575963974 577958882 580071688 581952989 583495617 585057974 586792290 588402629 589825392
1858E89825392J577854J684070J455009J372098J536966J385033J066685J210749J453757
$$ 589825392 591403246 593087316 594542325 595914423 597451389 598836422 599903107 601113856 602567613
1876.4F02567613J298070J085281J255334J389742J165151J073897J237750J206756
$$ 602567613 603865683 604950964 606206298 607596040 608761191 609835088 611072838 612279594
1892.7F12279594R77218J001835J189947J083732Q63671J036465J254797J004875P82192
$$ 612279594 613256812 614258647 615448594 616532326 617395997 618432462 619687259 620692134 621474326
1911.1F21474326R71675J095771Q94547Q42512J042723R74834P03275P76828R54330
$$ 621474326 622446001 623541772 624436319 625278831 626321554 627296388 627999663 628776491 629730821
1929.4F29730821P90536O78599Q89122R65774P56026P29501Q52227P40588N88894P29501
$$ 629730821 630521357 631199956 632089078 633054852 633810878 634540379 635392606 636133194 636722088 637451589
1949.8F37451589Q61526O55889M88401O11186O72519N17487N64397P99536P51734N45085
$$ 637451589 638313115 638969004 639457405 640068591 640741110 641258597 641822994 642622530 643374264 643919349
1970.2F43919349O48379Q35717O91175N53549P36057Q06213N34057M63069O93261O80507
$$ 643919349 644567728 645403445 646094620 646648169 647384226 648190439 648724496 649187565 649880826 650561333
1990.6F50561333M27961M58002O61612N56647L77954N04195O05166M09365L66807N86927
$$ 650561333 650989294 651447296 652108908 652665555 653043509 653547704 654152870 654562235 654929042 655515969
2011F55515969N76377L66091M03285N54860M31180L08156M95136N89788L38495K50041
$$ 655515969 656092346 656458437 656861722 657416582 657847762 658155918 658651054 659240842 659579337 659829378
2031.4F59829378M87268N37038L24964L41535N40853M52876K89976M37200N50867L31223
$$ 659829378 660316646 660853684 661178648 661520183 662061036 662513912 662803888 663241088 663791955 664123178
2051.8F64123178K48253M92871N43832L29376L58283N55396M38810K55644M08590N45442
$$ 664123178 664371431 664864302 665408134 665737510 666095793 666651189 667089999 667345643 667754233 668299675
2072.2F68299675L41713K47062M81844N28216K84016K67923M68016M05788K40624L53217
$$ 668299675 668641388 668888450 669370294 669898510 670182526 670450449 670918465 671324253 671564877 671918094
2092.6F71918094M56095K62439J83404M03702M49359K34127K21432M05311L14832J14798
$$ 671918094 672374189 672636628 672820032 673223734 673673093 673907220 674128652 674533963 674848795 674963593
2113F74963593K46287M11093K45035J28686L09289L45051J32978J40548L57747L02613
$$ 674963593 675209880 675620973 675866008 675994694 676303983 676649034 676782012 676922560 677280307 677582920
2133.4F77582920J13129K34246M04299K40862J18017L38555M25040K05219J99437M31419
$$ 677582920 677696049 677930295 678334594 678575456 678693473 679032028 679457068 679662287 679861724 680293143
2153.8F80293143L90291K34663M02987N79954L98993K69890M64976N35548L65078L95119
$$ 680293143 680683434 680918097 681321084 681901038 682300031 682569921 683034897 683570445 683935523 684330642
2174.2F84330642O13034N49614L20077L86536N45323M23849L20315M94421N28157K92778
$$ 684330642 684943676 685493290 685813367 686199903 686745226 687169075 687489390 687983811 688511968 688804746
2194.6F88804746K80440M96685M31955K24054L22461M68552L25799K20418L82900M23193
$$ 688804746 689085186 689581871 690013826 690237880 690560341 691028893 691354692 691575110 691958010 692381203
2215F92381203K31207K36749M27306L64840J82211K71023M11629K91825J86026L51965
$$ 692381203 692612410 692849159 693276465 693641305 693823516 694094539 694506168 694797993 694984019 695335984
2235.4F95335984M30167K41101K01523L77357L55721K07245K93791M27783K73585J19269
$$ 695335984 695766151 696007252 696208775 696586132 696941853 697149098 697442889 697870672 698144257 698263526
2255.8F98263526L07023M37916K54631K12312M24087M08291K18571K82526L96788K67029
$$ 698263526 698570549 699008465 699263096 699475408 699899495 700307786 700526357 700808883 701205671 701472700
2276.1G01472700J73270L28243L92079K09392J50144K79247K03372L1292J51813K97427
$$ 701472700 701645970 701974213 702366292 702575684 702725828 703005075 703208447 703239739 703391552 703688979
2296.5G03688979J59025J8776J08361J25170p9811j30832L6299N3227p4088q7202j01149
$$ 703688979 703848004 703866780 703975141 704100311 704020500 703889668 703925967 703979194 703905106 703817904 703716755
2319G03716755k32041k00868P2301J37925m3690N9J90497J72138R1136J62780K98917
$$ 703716755 703484714 703283846 703356147 703494072 703450382 703450441 703640938 703813076 703904212 704066992 704365909
2341.4G04365909M49717P20322P80642K68221m66049p66575m90546k81334j57475K59757
$$ 704365909 704815626 705535948 706316590 706584811 706118762 705352187 704861641 704580307 704422832 704682589
2361.8G04682589O42657P57396Q85725J064420J052677Q89481Q71598R58026Q80241
$$ 704682589 705325246 706082642 706968367 708032787 709085464 709974945 710846543 711804569 712684810
2380.2G12684810O90639N98371N21541K96354R7394J21176J62959P6354P3314J75118
$$ 712684810 713375449 713973820 714495361 714791715 714889109 715010285 715173244 715249598 715322912 715498030
2400.6G15498030J31130j072K0504P8558J9074j729Q0347Q6785j9551o6399k2292m0233
$$ 715498030 715629160 715628088 715648592 715727150 715746224 715744495 715824842 715911627 715892076 715825677 715803385 715763152
2425G15763152j25409j19030p7903j53840k42591k12848j89245k75373l38316l40283
$$ 715763152 715637743 715518713 715440810 715286970 715044379 714831531 714642286 714366913 714028597 713688314
2445.4G13688314m12524n34713n74648n93186p07269q06808q32737r56296j169563
$$ 713688314 713275790 712741077 712166429 711573243 710865974 710059166 709226429 708270133 707100570
2463.8G07100570j271546j316785j482904j710594j841009j942932k165318k406359
$$ 707100570 705829024 704512239 703029335 701318741 699477732 697534800 695369482 692963123
2480.1F92963123k529323k627134k756298k803683k764344k738059k684355k496123
$$ 692963123 690433800 687806666 685050368 682246685 679482341 676744282 674059927 671563804
2496.4F71563804k291798k174736k044737j885414j798034j796186j769781j682400
$$ 671563804 669272006 667097270 665052533 663167119 661369085 659572899 657803118 656120718
2512.7F56120718j577914j458943j285851j032055p38143m35949j23083J96516N32448
$$ 656120718 654542804 653083861 651798010 650765955 650027812 649591863 649468780 649665296 650197744
2531.1F50197744Q98779J242697J492024J660525J822949J977384K040684K022147
$$ 650197744 651096523 652339220 653831244 655491769 657314718 659292102 661332786 663354933
2547.4F63354933K006233J969635J842559J652002J484275J386404J255334J059293
$$ 663354933 665361166 667330801 669173360 670825362 672309637 673696041 674951375 676010668
2563.7F76010668R47357Q81373P32720N63741M88520M73439M05372L06308K57969K28226
$$ 676010668 676958025 677839398 678572118 679135859 679624379 680097818 680503190 680809498 681067467 681295693
2584.1F81295693J72377J44362J60217J20640N7697P6592J16110J38998J99139K66731
$$ 681295693 681468070 681612432 681772649 681893289 681950986 682027578 682143688 682282686 682481825 682748556
2604.5F82748556K56658K30968L36349M81426M96328M78268N69999O79970P00355O87778
$$ 682748556 683005214 683236182 683572531 684053957 684550285 685028553 685598552 686278522 686978877 687666655
2624.9F87666655P24971P71105P51376P43330P76231P30395O46294O43849O34313N50449
$$ 687666655 688391626 689162731 689914107 690657437 691433668 692164063 692810357 693454206 694088519 694638968
2645.3F94638968N05745N11169M27902K41280J45137J98782J52170l5465j10268r1672
$$ 694638968 695144713 695655882 696083784 696325064 696470201 696668983 696821153 696785688 696675420 696583748
2665.7F96583748j43230j80066j34706j75059l30031l54171j98960j51038k90036l28958
$$ 696583748 696440518 696260452 696125746 695950687 695620656 695266485 695067525 694916487 694626451 694297493
2686.1F94297493k52724k81871l27467k82169k99513m00663l85642k84969l32535m63545
$$ 694297493 694044769 693762898 693435431 693153262 692853749 692453086 692067444 691782475 691449940 690986395
2706.5F90986395m22001l14057l73542m54903l90470l70681n10156n71430m70698m04358
$$ 690986395 690564394 690250337 689876795 689421892 689031422 688660741 688150585 687579155 687108457 686704099
2726.9F86704099m27306m03285l65614m49896n04673m03464l74257m92156n12659m18842
$$ 686704099 686276793 685873508 685507894 685057998 684553325 684149861 683775604 683283448 682770789 682351947
2747.3F82351947m12285m77732m58657m23491n09918n79596n07772m77671o10531o70850
$$ 682351947 681939662 681461930 681003273 680579782 680069864 679490268 678982496 678504825 677894294 677223444
2767.7F77223444n63443n82099p29501o64651n41509o79552q08239p19130p27654r28282
$$ 677223444 676660001 676077902 675348401 674683750 674142241 673462689 672654450 671935320 671207666 670279384
2788.1F70279384r30488p43986q03053j023054r93550q30710r27091j122713j088857
$$ 670279384 669348896 668604910 667801857 666778803 665785253 664954543 664027452 662904739 661815882
2806.4F61815882j060248j207113j249611j173735j238346j379788j371145j332045
$$ 661815882 660755634 659548521 658298910 657125175 655886829 654507041 653135896 651803851
2822.7F51803851j475453j629591j599372j628577j891435k075076k121567k325178
$$ 651803851 650328398 648698807 647099435 645470858 643579423 641504347 639382780 637057602
2839.1F37057602k678990l073215l572345l977001l598332k377510j318872j002670
$$ 637057602 634378612 631305397 627733052 623756051 620157719 617780209 616461337 615458667
2855.4F15458667j025557j015961j160324j517177j718819j765609j964092k087355
$$ 615458667 614433110 613417149 612256825 610739648 609020829 607255220 605291128 603203773
2871.7F03203773j780867j349151j215816j225710j155376j167894j275539j195609
$$ 603203773 601422906 600073755 598857939 597632229 596476853 595308959 594033420 592837811
2888E92837811r98974j027644j150250j006484q10981q88884r78291r20654j040995
$$ 592837811 591838837 590811193 589660943 588654459 587843478 586954594 585976303 585055649 584014654
2906.4E84014654j429856j857400k265572k557993k355039j598716q31187m30345j62602
$$ 584014654 582584798 580727398 578461826 575903833 573548794 571950078 571118891 570688546 570525944
2924.7E70525944J33455K78115L64721N92291P89941P91132P78199Q66115Q45611O73294
$$ 570525944 570659399 570937514 571302235 571894526 572684467 573475599 574253798 575119913 575965524 576638818
2945.1E76638818N78642N11884K42770m9353o0081O2585N5671J08003M17650O73771
$$ 576638818 577217460 577729344 577972114 577922761 577862680 577925265 577980936 578088939 578506589 579180360
2965.5E79180360P10726Q05378R82880R72331Q11875P59840P91132P09236N88059N73576
$$ 579180360 579891086 580696464 581679344 582651675 583463550 584223390 585014522 585723758 586311817 586885393
2985.9E86885393M90665K24471J14322K81930K52902K7180Q0466K15531O8068q7857
$$ 586885393 587376058 587600529 587714851 587996781 588249683 588276863 588357329 588572860 588640928 588553071
3006.3E88553071j9431q583j59741j28090J00434Q7797j74939l06904l16740m63306
$$ 588553071 588533640 588525057 588365316 588237226 588337660 588425457 588250518 587943614 587626874 587163568
3026.7E87163568o44982o43850o46531p45833p59840p86305r68635j091063r42111
$$ 587163568 586518586 585874736 585228205 584482372 583722532 582936227 581967592 580876529 579934418
3045.1E79934418q20994j026988j182437j025617r26793j061737j125336j024068j051008
$$ 579934418 579113424 578086436 576903999 575878382 574951589 573889852 572764516 571740448 570689440
3063.4E70689440j182020j078904q53002q89420j079738j112700j080394j107752j062810
$$ 570689440 569507420 568428516 567575514 566686094 565606356 564493656 563413262 562305510 561242700
3081.8E61242700r19462q99553j049697j048863r08375r89914j144886j100361j067162
$$ 561242700 560323238 559423685 558373988 557325125 556416750 555426836 554281950 553181589 552114427
3100.1E52114427j165330j187861j128614j178444j260757j238942j224041j334191
$$ 552114427 550949097 549761236 548632622 547454178 546193421 544954479 543730438 542396247
3116.4E42396247j415670j272082j171350j371444j525342j436174j398087j473546
$$ 542396247 540980577 539708495 538537145 537165701 535640359 534204185 532806098 531332552
3132.8E31332552j490235j525998j646817j634180j498938j535892j712740j762926
$$ 531332552 529842317 528316319 526669502 525035322 523536384 522000492 520287752 518524826
3149.1E18524826j692713j700103j759887j738727j719653j800538j864910j804590
$$ 518524826 516832113 515132010 513372123 511633396 509913743 508113205 506248295 504443705
3165.4E04443705j759648j849890j890808j804114j836180j980991j954495j846999
$$ 504443705 502684057 500834167 498943359 497139245 495303065 493322074 491367579 489520580
3181.7D89520580j912684j999855j904577j801431j840651j879066j851171j867027
$$ 489520580 487607896 485608041 483703464 481902033 480061382 478182316 476331145 474464118
3198D74464118j904308j844734j776308j833469j867175j766294j742184j843632j866281
$$ 474464118 472559810 470715076 468938768 467105299 465238124 463471830 461729646 459886014 458019733
3216.4D58019733j801908j762747j750797j712591j681059j741946j795381j727522
$$ 458019733 456217825 454455078 452704281 450991690 449310631 447568685 445773304 444045782
3232.7D44045782j685738j748145j754969j666785j639843j687050j673340j650155
$$ 444045782 442360044 440611899 438856930 437190145 435550302 433863252 432189912 430539757
3249D30539757j693070j712203j693308j703650j740784j749157j710356j688242j659244
$$ 430539757 428846687 427134484 425441176 423737526 421996742 420247585 418537229 416848987 415189743
3267.4D15189743j553088j490534j550019j547575j431494j388252j428068j427323
$$ 415189743 413636655 412146121 410596102 409048527 407617033 406228781 404800713 403373390
3283.7D03373390j363277j325786j309842j224130j207471j298905j272976j154572
$$ 403373390 402010113 400684327 399374485 398150355 396942884 395643979 394371003 393216431
3300C93216431j125544j125485j121968j174211j225174j252651j247496j251697j329005
$$ 393216431 392090887 390965402 389843434 388669223 387444049 386191398 384943902 383692205 382363200
3318.4C82363200j353115j308024j337349j419485j454383j440257j454621j474649
$$ 382363200 381010085 379702061 378364712 376945227 375490844 374050587 372595966 371121317
3334.7C71121317j420170j359492j379073j396239j330882j253993j193314j126141
$$ 371121317 369701147 368341655 366962582 365566343 364235461 362981468 361788154 360662013
3351C60662013j108736j143932j112044j000464r74148j036197j016230r30100r21577
$$ 360662013 359553277 358409345 357297301 356296837 355322689 354286492 353270262 352340162 351418585
3369.3C51418585r86815r55582q14288p39426p07149o54191o74188p23303o07729l87072
$$ 351418585 350431770 349476188 348661900 347922474 347215325 346561134 345886946 345163643 344555914 344168842
3389.7C44168842l74109n73545n95212l87371k90245l71873m36723l48002k09034j33007
$$ 344168842 343794733 343221188 342625976 342238605 341948360 341576487 341139764 340791762 340582728 340449721
3410.1C40449721p6980p4595j16348m4018O0916N9813J22666K74748L40521K99067
$$ 340449721 340372741 340298146 340181798 340137780 340198696 340258509 340381175 340655923 340996444 341295511
3430.5C41295511L57210N00947M80414L85403M25101N40882O44863P00712O93649P64042
$$ 341295511 341652721 342153668 342634082 343019485 343444586 343985468 344630331 345331043 346024692 346788734
3450.9C46788734Q62807Q87662R74656J107990J097858J058489J149774J222283J174837
$$ 346788734 347651541 348539203 349513859 350621849 351719707 352778196 353927970 355150253 356325090
3469.3C56325090J116276J159548J235456J366555J508773J462459J362890J460702
$$ 356325090 357441366 358600914 359836370 361202925 362711698 364174157 365537047 366997749
3485.6C66997749J586407J574487J571714J629711J711070J733571J778126J858473
$$ 366997749 368584156 370158643 371730357 373360068 375071138 376804709 378582835 380441308
3501.9C80441308J749188J666307J851767J970619J953990J989394K009362K009183
$$ 380441308 382190496 383856803 385708570 387679189 389633179 391622573 393631935 395641118
3518.2C95641118K022952K128959K214670K174258K175331K248884K296596K353520
$$ 395641118 397664070 399793029 402007699 404181957 406357288 408606172 410902768 413256288
3534.5D13256288K397954K389312K496600K678543K764047K628415K483249K584815
$$ 413256288 415654242 418043554 420540154 423218697 425982744 428611159 431094408 433679223
3550.9D33679223K710134K706587K738714K892822K999574K967596L096551L412753
$$ 433679223 436389357 439095944 441834658 444727480 447727054 450694650 453791201 457203954
3567.2D57203954L281057K950788K975583L183901L306866L351361L357589L379911
$$ 457203954 460485011 463435799 466411382 469595283 472902149 476253510 479611099 482991010
3583.5D82991010L632724L810644L470719L223717L450722L637016L637254L669441
$$ 482991010 486623734 490434378 493905097 497128814 500579536 504216552 507853806 511523247
3599.8E11523247L584563L481329L696620L971398L841341L698408L571690L413915
$$ 511523247 515107810 518589139 522285759 526257157 530098498 533796906 537368596 540782511
3616.1E40782511L741145L850162L237665K996683L657580M655718M161478L151059
$$ 540782511 544523656 548373818 551611483 554608166 558265746 562921464 567082942 570234001
3632.4E70234001L273248L408075L323674L277600L077388L045260L693343M408419
$$ 570234001 573507249 576915324 580238998 583516598 586593986 589639246 593332589 597741008
3648.8E97741008L385246K024352K353430K958953K612353K277910K199471K142966
$$ 597741008 601126254 603150606 605504036 608462989 611075342 613353252 615552723 617695689
3665.1F17695689K442479K892614K373099K014756K581358J885891J009822J063407
$$ 617695689 620138168 623030782 625403881 627418637 629999995 631885886 632895708 633959115
3681.4F33959115J121759J445353K214670K064645P48516L36945P01308R57847J206636
$$ 633959115 635080874 636526227 638740897 640805542 641554058 641891003 642592311 643550158 644756794
3699.8F44756794J377463J041949Q47280J233101J678824J311899L56912J81437N54144
$$ 644756794 646134257 647176206 648023486 649256587 650935411 652247310 652604222 652785659 653339803
3718.1F53339803P81417P87735O62267L10242P0692M40120J024485J156330P18534
$$ 653339803 654121220 654908955 655571222 655881464 655952156 656392276 657416761 658573091 659291625
3736.5F59291625K503k34901L91304Q47936L75867N55217R06050Q5831l59297J11401
$$ 659291625 659294128 659059227 659450531 660298467 660674334 661229551 662135601 662221432 661862135 661973536
3756.9F61973536L94166R7334p153J70172K81393M61638K69115j98662j21355M17232
$$ 661973536 662367702 662465036 662457883 662628055 662909448 663371086 663640201 663441539 663320184 663737416
3777.3F63737416N64754P0155j01030O7830N4896O1750P5698N0724R0122J50800M79042
$$ 663737416 664302170 664372325 664271295 664339125 664394021 664455771 664531469 664582193 664672315 664823115 665302157
3799.7F65302157M00663k25127j4961J39058l05176k47478L19123M79162R4652J89185
$$ 665302157 665702820 665477693 665462732 665601790 665296614 665049136 665368259 665847421 665942073 666131258
3820.1F66131258P2122l26097j65522Q285M1902M3094J18017L40879K33591j09494
$$ 666131258 666203380 665877283 665711761 665720046 665761948 665805042 665923059 666263938 666497529 666388035
3840.5F66388035j70112k67446m94480l94046L11494J026988J65402q22186n33938
$$ 666388035 666217923 665950477 665455997 665061951 665373445 666400433 666565835 665743649 665209711
3858.8F65209711K265K59518R179j80542R6977Q2731j27733k40147l02315l1173M9949
$$ 665209711 665211976 665471494 665480673 665300131 665397108 665479839 665352106 665111959 664809644 664778471 664828420
3881.3F64828420j8955j6570k86638j31607J37567k65777m25577j0073K31206J67370
$$ 664828420 664809465 664792895 664506257 664374650 664512217 664246440 663820863 663810790 664041996 664209366
3901.7F64209366N1319k74360m59909k29776q6844j56403p7247L2007j02043k14755
$$ 664209366 664260685 663986325 663526416 663296640 663209796 663053393 662976146 663008153 662906110 662691355
3922.1F62691355j12951q5712j31487k7061K861j69456l05772l26454j86205l3975
$$ 662691355 662578404 662492692 662361205 662334144 662337005 662167549 661861777 661535323 661349118 661315143
3942.5F61315143q9764o8665M4763l6299j77682j97291j25647m9948m6134q7679r9420
$$ 661315143 661225379 661156714 661201477 661165178 660987496 660790205 660664558 660614610 660568476 660480797 660381377
3964.9F60381377j22607j42157q2731j8955k5391m7982o0141r4354q4520m0650n5671
$$ 660381377 660258770 660116613 660033882 660014927 659989536 659941554 659881413 659787059 659702539 659661889 659606218
3987.3F59606218o0498m9651o8128r0778r3639
$$ 659606218 659545720 659496069 659427941 659337163 659243524
3997.5F59243524
$$ 659243524
##END=$$ End of the data block
