##TITLE=$$ Begin of the data block
##JCAMP-DX=5.00 $$ ACD/SpecManager v 10.08
##SPECTROMETER/DATA SYSTEM=Alpha
##DATE=13 Jun 2014 08:26:00
##DATA TYPE=INFRARED SPECTRUM
##DATA CLASS=XYDATA
##ORIGIN=
##OWNER=
##NPOINTS=1765
##FIRSTX=399.75695801
##LASTX=3997.56933594
##MAXX=3997.56933594
##MINX=399.75695801
##MAXY=0.71772552
##MINY=0.03806620
##XFACTOR=1.0000000000
##YFACTOR=1.000000000000000e-9
##FIRSTY=0.28964156
##DELTAX=2.03957629
##XUNITS=1/CM
##YUNITS=ARBITRARY UNITS
##XYDATA=(X++(Y..Y))
399.8 289641559 299357206 308647543 318743885 329533011 339431107 348558396 358257920 367968649
416.1 367968649 377911866 388308644 397200882 404623777 411562055 419017106 426273197 432255834
432.4 432255834 438584238 445649624 451401770 456236392 462062150 467667431 471538216 475489765
448.7 475489765 480505168 484651268 487648427 491597444 495558172 497720271 500009656 503292561
465 503292561 505802929 507685363 510726690 514154375 516371608 518635988 521953642 524938285 527077675
483.4 527077675 529567778 532270432 534166276 536084116 538833082 541007817 541980386 543414593 545701146
501.7 545701146 547169745 548108041 549706936 551002562 551372588 552030861 553298473 553916097 553906977
520.1 553906977 554666340 555803537 556064010 556316316 557511926 558576405 559077859 560197711 561847746
538.4 561847746 562666416 563064098 564259171 565479577 565648913 565667093 566225410 566307902 565705359 565612972
558.8 565612972 566006064 566005290 566067517 566736281 567047298 566513836 566267848 566595018 566521049 566301167 566962659
581.3 566962659 567961395 568315864 568691850 569788516 570656955 570687652 570870996 571397126 571155846 570269465
601.7 570269465 569667459 568780422 567086995 565946877 566064119 566222489 566041529 566615224 567869663
620 567869663 568720758 569481134 570702732 571588576 571920872 572868586 574650943 576049507 576931775 578328490
640.4 578328490 579800546 580206454 580240548 580772161 580918312 580229640 579711974 579532325 578771114 577737153
660.8 577737153 577469051 577404678 576297283 575253606 575828254 576217949 575914383 576013088 576410890 576011837
681.2 576011837 575174332 574636579 573549807 571185768 568368912 565339565 560930073 554891765 548367977
699.6 548367977 541321635 532413065 521818340 511019826 500812173 492013186 485580355 480996817
715.9 480996817 477508545 476972282 482207775 493315041 508427382 526221693 545293987 563091516
732.2 563091516 577857018 590029418 599954545 606877565 611326277 614986718 617882490 619331777
748.5 619331777 620283365 621645212 622613788 622720182 622996747 623646975 623650610 623269618 623640954 624311805
768.9 624311805 624428928 624741137 625724912 626359224 626455843 627063453 627993524 628176153 627973139 628287315
789.3 628287315 628428876 627723992 627238393 627463996 627369046 626837254 626773953 626874685 626199126 625195444
809.7 625195444 624688148 623998404 622517109 621086180 619995534 618357480 616133690 614106715 611853361
828.1 611853361 608521283 604618609 600704551 596037269 590158343 583528221 575484753 563880801
844.4 563880801 549336493 538080573 533485174 529696167 520977557 507464647 489716709 466681451
860.7 466681451 436820060 396436125 339932621 269935429 206554458 169879124 159111440
875 159111440 165447876 187952802 227773696 281998843 345949799 413516283 475343853 523506701
891.3 523506701 557376146 580933869 597445965 609357238 618853271 626456439 631922841 636157632
907.6 636157632 639941633 642602324 644017816 645283878 646412671 646421552 645743787 645450592 645091355
926 645091355 644043803 643145025 642863452 642309189 641422391 641175151 641310573 640884101 640309274 640187502
946.4 640187502 639687002 638171077 636478543 634933770 632591486 629486918 626599431 623683274 619946241
964.7 619946241 615940392 612296700 608194590 603125751 597859681 592375100 585695922 578045011
981 578045011 570389211 562543333 554058731 545730114 538218141 530948639 523723841 517276645 511534870
999.4 511534870 505581915 499329269 493121296 486461908 478941023 471264303 464107543 457370788
1015.7 457370788 451254845 446551323 443380892 441188157 439938843 439830810 440369725 440977693 441832244
1034.1 441832244 442961365 443606913 443434596 442937344 442200303 440937549 439607501 438969374 439072937
1052.4 439072937 439799815 441563934 444413990 447514951 450221509 452415198 453488380 452562720 449772507
1070.8 449772507 445993930 441751182 437532157 434222192 432254016 431536287 432216674 434581101 438406080
1089.1 438406080 442960292 447587013 451635540 454266906 455289483 455596447 455973506 456419289 457089335
1107.5 457089335 458473563 460315555 461926788 463270307 464430064 464971811 464833558 464693397 464740127
1125.8 464740127 464540571 464173794 463879883 463122278 461377949 458997607 456411898 453528523 450471073
1144.2 450471073 447868973 445923477 444278091 442971587 442417800 442541867 443108916 444487840 446926266
1162.6 446926266 449867249 452789426 455684155 458325267 460347623 461991787 463672668 465149850
1178.9 465149850 465971529 466269702 466191441 465366483 463727564 461770475 459602505 456953138 454064041
1197.2 454064041 451375812 448825061 446266890 443941027 441900015 439707786 437157542 434474170
1213.5 434474170 431618124 428343713 424851716 421417832 417875797 414116234 410456002 407015353
1229.9 407015353 403542340 400062978 396812618 393682361 390461504 387270361 384204686 381094933
1246.2 381094933 377849400 374652833 371546566 368309617 364954352 361658871 358333677 354862541
1262.5 354862541 351422012 348092020 344692230 341092259 337433875 333744228 329857737 325859159
1278.8 325859159 321908116 317922056 313772112 309528530 305225641 300768137 296132237 291443884
1295.1 291443884 286688298 281758606 276742607 271774173 266822338 261782855 256774485 251860678
1311.4 251860678 246961683 242117763 237357914 232538089 227593660 222552314 217404351 212159112
1327.8 212159112 206819713 201536357 196422130 191324964 185941532 180326447 174913004 169736236
1344.1 169736236 164546311 159267530 153919354 148557484 143228441 137960389 132853284 127757430
1360.4 127757430 122417040 117184870 112367138 107629009 103020459 98545007 93952082 89577034
1376.7 89577034 85521810 81578501 77830806 74351579 70887461 67494094 64482264 61528303
1393 61528303 58371883 55347316 52496582 49885944 47587510 45409948 43521892 41983221 40673792
1411.4 40673792 39616849 38863067 38336847 38066201 38164079 38531549 39065067 39725259 40538926 41418020
1431.8 41418020 42256583 43125588 44051606 44812858 45443092 46038136 46613559 47157981 47626704 48037801
1452.2 48037801 48413523 48846949 49361750 49882330 50444406 51138803 51916130 52687306 53519785 54587822
1472.6 54587822 55873860 57179961 58511857 59920706 61456490 63062288 64831153 66951163
1488.9 66951163 69385678 71760148 74201003 77142879 80305450 83290040 85991368 89016311
1505.2 89016311 93165293 97025499 100239165 103467286 106878825 110469766 114079796 118006803
1521.5 118006803 121908888 125472456 129145756 132631078 136167198 140140802 143713579 147024006
1537.8 147024006 151510015 156476378 160768345 165032268 169434398 174256504 179381892 184736326
1554.1 184736326 190227643 197360888 205864817 211966932 217622668 223786369 230248615 236907020
1570.5 236907020 242496476 247708887 253694832 258964717 263398498 267830193 272186577 276291460
1586.8 276291460 280119240 283733845 287146360 290288001 293138236 295843214 298411340 300754964
1603.1 300754964 302881569 304891944 306669444 308110595 309421599 310697973 311630934 312284023 313067287
1621.4 313067287 313771784 314223379 314641207 315146089 315789223 316643834 317593664 318449140 319351703 320529014
1641.8 320529014 322155625 324162573 326055437 327791840 330200881 333098501 335363120 337823898
1658.2 337823898 340871423 344259590 347698003 351162523 355094075 359309554 363159418 367234915
1674.5 367234915 371489257 375365525 379355162 384031564 389294177 393715918 397824764 402244270
1690.8 402244270 406503201 411358774 416811943 421974599 427130878 431551754 435733467 439930290
1707.1 439930290 443684042 447442472 451265752 455009967 458848685 462291598 465067953 467782557
1723.4 467782557 470782816 473891556 476856470 479704648 482918143 485860646 488214552 490890890
1739.7 490890890 493829310 496506184 499054760 501882613 504911840 507507622 509773374 512342691
1756.1 512342691 514953792 517214715 519453824 521652460 523630500 525470316 527396560 529196858
1772.4 529196858 530248523 530888319 531506538 531649292 530952334 529678702 528124928 526380181 524224341
1790.7 524224341 521724045 519557774 517908156 516823173 516585350 517080247 518163562 520122707 523043215
1809.1 523043215 526467264 530085206 534149885 538593113 542892694 546977460 551149487 555188179
1825.4 555188179 558633685 561910450 565148592 567871869 570232749 572645426 575031519 577127457
1841.7 577127457 579134285 581216872 583093345 584657669 586228073 587974131 589593291 590995789
1858 590995789 592552841 594240546 595696211 597059667 598598123 599989235 601056397 602286696 603788853
1876.4 603788853 605116606 606205642 607468665 608860195 610001862 611034214 612250626 613469064
1892.7 613469064 614463508 615472913 616674066 617760599 618604779 619636595 620908797 621932030 622740269
1911.1 622740269 623751402 624872863 625762224 626584053 627597809 628544509 629242897 630030990 630983412
1929.4 630983412 631761551 632438481 633345485 634327471 635072470 635790288 636648715 637385905 637939036 638623834
1949.8 638623834 639500022 640221596 640740812 641345441 642021775 642539680 643091500 643902838 644687951 645236611
1970.2 645236611 645862401 646700144 647414088 647962153 648657858 649428010 649960041 650445402 651157498 651838958
1990.6 651838958 652248204 652695417 653364241 653923094 654303074 654817998 655431747 655848622 656223595 656812608
2011 656812608 657384396 657740414 658152640 658738256 659168303 659433126 659890473 660475552 660841644 661134183
2031.4 661134183 661633492 662139535 662446022 662824571 663415074 663859963 664096177 664490402 665044069 665418029
2051.8 665418029 665700793 666206777 666763902 667085230 667398930 667927861 668380260 668647945 669066489 669644356
2072.2 669644356 670028031 670282900 670729280 671221972 671490848 671765625 672267079 672697306 672939003 673291802
2092.6 673291802 673739374 674001694 674220860 674676776 675146282 675346315 675523758 675903380 676204264 676322460
2113 676322460 676595688 677041650 677276611 677353919 677650869 678045392 678221881 678367317 678731501 679048717
2133.4 679048717 679162621 679388344 679782569 680012345 680133581 680489004 680912614 681116462 681328833 681743622
2153.8 681743622 682106435 682340622 682753265 683351517 683781624 684072912 684542596 685084105 685447693 685809612
2174.2 685809612 686372638 686892390 687232614 687686682 688293099 688735545 689052343 689546883 690079093 690372586
2194.6 690372586 690647662 691132009 691558778 691789865 692118347 692594826 692921042 693126619 693505824 693937898
2215 693937898 694170058 694414020 694861650 695233405 695395589 695652902 696080387 696396708 696594834 696933568
2235.4 696933568 697337627 697563708 697779596 698194504 698554873 698723435 699005961 699465692 699763298 699904680
2255.8 699904680 700241685 700681388 700918794 701121092 701525748 701903760 702107728 702413321 702860713 703151703
2276.1 703151703 703319073 703652322 704047561 704246104 704383790 704652309 704871356 704932213 705080509 705358386
2296.5 705358386 705515683 705561697 705709457 705852985 705789387 705699265 705776811 705862820 705819011 705748856 705676317
2319 705676317 705503523 705363631 705472171 705635667 705612004 705623806 705841064 706017971 706089199 706270039
2339.4 706270039 706594706 707038939 707724392 708434403 708639324 708156586 707413018 707018316 706963658 706980646
2359.8 706980646 707167149 707697332 708401859 709187388 710181534 711190701 712006927 712823153 713728487 714527845
2380.2 714527845 715156913 715741932 716254413 716535151 716654837 716807485 716943681 716964304 717014253 717217028
2400.6 717217028 717409253 717440724 717435122 717486262 717526197 717559934 717643797 717725515 717719078 717669010 717654943 717611730
2425 717611730 717477024 717336118 717215419 717026532 716792583 716617227 716449380 716178954 715846539 715503454
2445.4 715503454 715085149 714552104 713975728 713378847 712677896 711875916 711024106 710063100 708938956
2463.8 708938956 707687974 706331432 704818070 703111708 701268911 699305236 697139919 694766223
2480.1 694766223 692255557 689606369 686818182 684005857 681232989 678484201 675817788 673320770
2496.4 673320770 671000123 668821096 666787565 664900482 663099051 661310196 659537017 657859981
2512.7 657859981 656318426 654878259 653564215 652491212 651740134 651301920 651170909 651384890 651963413
2531.1 651963413 652893484 654141963 655639708 657314360 659130991 661089599 663160920 665234387
2547.4 665234387 667240143 669182479 671023071 672698557 674207270 675595105 676839471 677915633
2563.7 677915633 678879917 679737568 680453062 681045711 681555450 681999445 682366908 682675183 682966352 683209121
2584.1 683209121 683377564 683536708 683697999 683788776 683834314 683934987 684097767 684266686 684441745 684682965
2604.5 684682965 684979022 685257494 685579002 686017871 686496913 686997056 687588811 688248992 688917339 689595759
2624.9 689595759 690340579 691144347 691909850 692651272 693419814 694137990 694784522 695449948 696107864 696667314
2645.3 696667314 697175264 697683752 698102474 698363960 698558509 698767364 698904395 698877931 698769331 698672831
2665.7 698672831 698545337 698358059 698180676 698001444 697701037 697338104 697102606 696931005 696644068 696326017
2686.1 696326017 696095169 695834994 695501447 695205510 694906175 694506347 694100678 693786561 693456888 693031073
2706.5 693031073 692628622 692291915 691891015 691439748 691080034 690731943 690233052 689678907 689218044 688801527
2726.9 688801527 688363969 687967360 687592864 687104225 686559558 686163068 685860932 685441077 684921861 684430122
2747.3 684430122 683955491 683460057 683023095 682640970 682153225 681555390 681016028 680525184 679905891 679232180
2767.7 679232180 678686261 678106546 677352726 676684320 676172674 675514817 674709320 673987806 673262656 672363162
2788.1 672363162 671449065 670694947 669894040 668846071 667800188 666944623 666017711 664910078 663827658
2806.4 663827658 662742674 661506176 660262644 659126461 657909453 656519532 655120850 653764904
2822.7 653764904 652284801 650662363 649055421 647397459 645499885 643428385 641271710 638916373
2839.1 638916373 636241257 633180976 629627347 625680506 622106254 619712710 618322253 617240787
2855.4 617240787 616202593 615220249 614063919 612522006 610790431 609022558 607060850 604994237
2871.7 604994237 603241563 601877153 600592196 599329293 598206520 597075403 595819592 594644189
2888 594644189 593645871 592603624 591473818 590531528 589766681 588860273 587817848 586841643 585782588
2906.4 585782588 584341764 582479715 580235422 577706516 575373411 573764026 572870016 572380900 572228134
2924.7 572228134 572405636 572709858 573084116 573670328 574439943 575217605 576001227 576895893 577787399 578463376
2945.1 578463376 578992188 579471171 579710245 579670072 579626024 579698801 579753399 579844058 580254257 580955744
2965.5 580955744 581690788 582490206 583456993 584412396 585213721 585991859 586817086 587542176 588128507 588686943
2985.9 588686943 589145005 589339674 589444399 589735091 590030849 590119958 590210676 590386868 590439975 590389729
3006.3 590389729 590403378 590373397 590181589 590036392 590108931 590174019 589988112 589664221 589338839 588888586
3026.7 588888586 588267446 587643862 587011158 586264968 585487247 584683895 583698809 582588077 581643164
3045.1 581643164 580816150 579753220 578556716 577563882 576651752 575576425 574453592 573441029 572390497
3063.4 572390497 571195245 570096016 569203079 568251073 567125261 566013515 564976871 563888848 562786818
3081.8 562786818 561818719 560876846 559803784 558766901 557881057 556921601 555803955 554702520 553602934
3100.1 553602934 552376986 551145256 550016165 548847198 547589183 546350241 545119524 543774307
3116.4 543774307 542347789 541055501 539858997 538497627 537012517 535571933 534094870 532507241
3132.8 532507241 530954421 529467821 527901769 526283264 524721920 523148715 521436334 519646943
3149.1 519646943 517930925 516261935 514533043 512772739 511012793 509163499 507262051 505457819
3165.4 505457819 503690660 501815021 499906898 498072237 496196866 494213343 492287308 490464538
3181.7 490464538 488555431 486549079 484652013 482847363 480939507 478970289 477076948 475213379
3198 475213379 473329306 471487135 469689906 467850685 465970188 464121222 462269396 460370392 458528489
3216.4 458528489 456787556 455035239 453263104 451566398 449889660 448090047 446217448 444454134
3232.7 444454134 442776740 441036224 439281493 437620521 435979486 434264660 432543814 430866987
3249 430866987 429159939 427412689 425712824 424050689 422333390 420583963 418889523 417245448 415625364
3267.4 415625364 414048076 412465066 410833031 409248799 407781184 406370729 404928833 403486937 402157664
3285.7 402157664 400876939 399563342 398306429 397088408 395796776 394482374 393262148 392107278
3302 392107278 390937030 389752120 388576597 387404561 386205822 384973615 383712292 382403880 381062031
3320.4 381062031 379698128 378264070 376754045 375262469 373841882 372402728 370902687 369440168
3336.7 369440168 368007451 366520852 365083396 363805592 362581849 361326367 360127211 359016776
3353 359016776 357869238 356664270 355548680 354530662 353513271 352513313 351558834 350606591 349605262
3371.4 349605262 348603785 347700328 346907288 346188307 345486045 344785184 344104320 343491286 343014210
3389.7 343014210 342564017 341996819 341427624 341007710 340679079 340305358 339860439 339495718 339288533 339156628
3410.1 339156628 339067429 338980079 338854939 338801116 338830948 338837296 338923365 339187145 339533180 339885235 340287000
3432.6 340287000 340772778 341256887 341649562 342046618 342577726 343246460 343982607 344670206 345387489 346236497
3453 346236497 347171426 348230213 349371642 350408286 351406485 352548450 353797525 355019778 356156230
3471.3 356156230 357331008 358613491 360010713 361514747 362986118 364396453 365884215 367470890
3487.6 367470890 369060427 370648891 372278392 373968393 375712097 377547771 379466027 381285697
3504 381285697 383000523 384827048 386764348 388719916 390722752 392778218 394838959 396903783 399064958
3522.3 399064958 401270986 403456271 405690581 408017427 410397202 412800342 415233225 417663991
3538.6 417663991 420175701 422864228 425662398 428350180 430887073 433495015 436248422 439028651
3554.9 439028651 441829652 444774389 447809070 450807929 453991383 457492083 460777551 463730454
3571.3 463730454 466776580 470072269 473485947 476904213 480266005 483661652 487391084 491318107
3587.6 491318107 494864702 498164564 501693428 505375266 509069502 512821078 516488373 520046949
3603.9 520046949 523829699 527927279 531870365 535599411 539182067 542630911 546445906 550407648
3620.2 550407648 553767502 556848109 560552657 565255344 569454610 572657406 576027513 579530835
3636.5 579530835 582893312 586194336 589349926 592516780 596349120 600858331 604288101 606356502
3652.8 606356502 608735621 611708999 614357531 616698563 618957222 621140242 623630226 626553535
3669.2 626553535 628955781 631080806 633740902 635562897 636523783 637627065 638815880 640273452
3685.5 640273452 642457306 644550145 645367384 645722806 646426678 647432745 648686409 650038183 651012123
3703.8 651012123 651825368 653092742 654855609 656234741 656645179 656891048 657471478 658215642 658928514
3722.2 658928514 659568369 659962833 660148084 660692275 661832094 663000941 663518608 663332522 663113534
3740.5 663113534 663655281 664592087 664950371 665508866 666366637 666361749 666010916 666167617 666555941 666613281
3760.9 666613281 666612089 666870236 667248070 667720914 667935908 667701423 667609334 668074429 668586016 668564737
3781.3 668564737 668461382 668560982 668628633 668689251 668788850 668889046 668973386 669079900 669577599 670041025
3801.7 670041025 669868350 669860959 669937789 669580042 669327497 669658244 670146227 670271516 670498252 670554519
3822.1 670554519 670224726 670082510 670077324 670096993 670144260 670265436 670646131 670947254 670816362 670594037
3842.5 670594037 670361042 669974685 669639468 669912100 670901477 671046793 670215011 669731319 669787467 670038164
3862.9 670038164 670000911 669782996 669826210 669853032 669699967 669483900 669323385 669449925 669486880 669332802
3883.3 669332802 669194996 668881476 668820322 669017553 668778479 668416798 668443918 668617547 668693960 668716133
3903.7 668716133 668480754 667994201 667650938 667548716 667516053 667510092 667516589 667398632 667198837 667114198 667043805
3926.1 667043805 666923881 666919291 666918695 666729271 666436672 666161716 666033804 666019022 665883243 665756941 665784657
3948.6 665784657 665740490 665542603 665347457 665237665 665152311 665063679 665019989 664995849 664930761 664851308 664769053
3971 664769053 664668739 664578319 664502740 664461136 664436758 664352775 664202809 664082587 664106488 664202094 664188206
3993.4 664188206 664020419 663812280
3997.5 663812280
##END=$$ End of the data block
