##TITLE=$$ Begin of the data block
##JCAMP-DX=5.00 $$ ACD/SpecManager v 10.08
##SPECTROMETER/DATA SYSTEM=Alpha
##DATE=13 Jun 2014 08:26:00
##DATA TYPE=INFRARED SPECTRUM
##DATA CLASS=XYDATA
##ORIGIN=
##OWNER=
##NPOINTS=1765
##FIRSTX=399.75695801
##LASTX=3997.56933594
##MAXX=3997.56933594
##MINX=399.75695801
##MAXY=0.72015840
##MINY=0.03806912
##XFACTOR=1.0000000000
##YFACTOR=1.000000000000000e-9
##FIRSTY=0.29078698
##DELTAX=2.03957629
##XUNITS=1/CM
##YUNITS=ARBITRARY UNITS
##XYDATA=(X++(Y..Y))
$$ plain form
399.8 290786982 300029427 308849066 318283588 328392953 338089973 347676516 357941747 367938519
416.1 367938519 378113896 388576835 397077739 403977811 410762727 418419600 425854295 431673855
432.4 431673855 437594116 444666415 450736165 455630213 461405337 467094272 471162826 475247175
448.7 475247175 480215162 484294027 487284273 491141051 494853973 496686578 498621970 501772940
465 501772940 504566610 506803989 510030448 513536870 515718043 518030882 521444082 524208903 526017308
483.4 526017308 528537989 531472385 533395290 535192132 537894011 539996386 540936828 542547226 544884861
501.7 544884861 546203732 547114015 548795104 550191224 550607264 551255882 552468061 552967072 552954674
520.1 552954674 553763926 554836154 554994583 555211723 556513786 557659507 558093488 559214532 560998321
$$ packed form
399.8B90786982R242445Q819639R434522J0109365R697020R586543J0265231R996772
416.1C67938519J0175377J0462939Q500904O900072O784916P656873P434695N819560
432.4D31673855N920261P072299O069750M894048N775124N688935M068554M084349
448.7D75247175M967987M078865K990246L856778L712922J832605J935392L150970
465E01772940K793670K237379L226459L506422K181173K312839L413200K764821J808405
483.4E26017308K520681K934396J922905J796842K701879K102375R40442J610398K337635
501.7E44884861J318871R10283J681089J396120M16040O48618J212179M99011j2398
520.1E52954674Q09252J072228J58429K17140J302063J145721M33981J121044J783789
$$ plain form
538.4 560998321 562024236 562536716 563578606 564595759 564672172 564700603 565380573 565560460 564969897 564855635
558.8 564855635 565230548 565196812 565199375 565861702 566168010 565556526 565335751 565843403 565858781 565499544
579.2 565499544 565952122 566952169 567446470 567835391 568838537 569575787 569512725 569760263 570455432 570326686
599.6 570326686 569456637 568820596 567872465 566146135 564959526 565007627 565225244 565112650 565549910 566667378
620 566667378 567523420 568295479 569576502 570591629 570939422 571768045 573497355 574989676 575940549
638.4 575940549 577245235 578645408 579176426 579363823 579921186 580008626 579237282 578707457 578609586 577911317
658.8 577911317 576815784 576396525 576338828 575443447 574371874 574709535 575050056 574838936 575036526 575518131
679.2 575518131 575139225 574169278 573482275 572431982 570221901 567535996 564566195 560082138 553888023
$$ packed form
538.4E60998321J025915N12480J041890J017153P6413K8431O79970J79887n90563j14262
558.8E64855635L74913l3736K563O62327L06308o11484k20775N07652J5378l59237
579.2E65499544M52578J000047M94301L88921J003146P37250o3062K47538O95169j28746
599.6E70326686q70049o36041r48131j726330j186609M8101K17617j12594M37260J117468
620E66667378Q56042P72059J281023J015127L47793Q28623J729310J492321R50873
638.4E75940549J304686J400173N31018J87397N57363Q7440p71344n29825r7871o98269
658.8E77911317j095533m19259n7697q95381j071573L37661L40521k11120J97590M81605
679.2E75518131l78906r69947o87003j050293k210081k685905k969801m484057o194115
$$ plain form
697.5 553888023 547292411 540300488 531460702 520852804 510013521 499837548 491115808 484729081
713.8 484729081 480147541 476659089 476155162 481400311 492499143 507605851 525318623 544303834
730.2 544303834 562144279 577011764 589154065 598929942 605811417 610326707 613999724 616880000
746.5 616880000 618350387 619382083 620842576 621798098 621815503 622053981 622708917 622729778 622371197 622717738
766.9 622717738 623329520 623408794 623692334 624694288 625415981 625592649 626241148 627181947 627323031 627057850
787.3 627057850 627356172 627524495 626821101 626287401 626549900 626586556 626093090 625977993 626035750 625332177
807.7 625332177 624299526 623773932 623130798 621714711 620306134 619235337 617598593 615330637 613261998
826 613261998 611012161 607726574 603868127 599950552 595265269 589395463 582754433 574677706 563071907
$$ packed form
697.5E53888023o595612o991923q839786j0607898j0839283j0175973q721740o386727
713.8D84729081m581540l488452n03927N245149J1098832J5106708J7712772J8985211
730.2E44303834J7840445J4867485J2142301R775877O881475M515290L673017K880276
746.5F16880000J470387J031696J460493R55522J7405K38478O54936K0861l58581L46541
766.9F22717738O11782P9274K83540J001954P21693J76668O48499R40799J41084k65181
787.3F27057850K98322J68323p03394n33700K62499L6656m93466j15097N7757p03573
807.7F25332177j032651n25594o43134j416087j408577j070797j636744k267956k068639
826F13261998k249837l285587l858447l917575m685283n869806o641030q076727j1605799
$$ plain form
844.4 563071907 548586369 537437975 532904148 529113412 520406008 506913424 489182860 466174126
860.7 466174126 436290354 395842493 339382201 269558311 206376776 169876173 159221679
875 159221679 165581837 188063890 227895290 282136589 346073061 413630813 475422800 523520172
891.3 523520172 557335496 580851197 597363651 609329045 618875504 626468122 631869555 636042416
907.6 636042416 639795423 642462969 643903553 645149529 646211803 646175742 645516574 645255864 644880652
926 644880652 643812835 642917037 642644465 642107010 641228259 641000509 641185701 640766740 640134335 639987707
946.4 639987707 639508128 638017833 636352718 634787440 632396698 629276872 626384795 623443007 619674683
964.7 619674683 615647614 611989558 607903898 602850914 597549856 592045307 585393190 577756345
$$ packed form
844.4E63071907j4485538j1148394m533827l790736q707404j3492584j7730564k3008734
860.7D66174126k9883772m0447861n6460292o9823890o3181535l6500603j0654494
875A59221679O360158K2482053L9831400N4241299O3936472O7557752O1791987M8097372
891.3E23520172L3815324K3515701J6512454J1965394R546459P592618N401433M172861
907.6F36042416L753007K667546J440584J245976J062274l6061o59168k60710l75212
926F44880652j067817q95798k72572n37455q78751k27750J85192m18961o32405j46628
946.4F39987707m79579j490295j665115j565278k390742l119826k892077k941788l768324
964.7F19674683m027069l658056m085660n052984n301058n504549o652117p636845
$$ plain form
981 577756345 570099473 562272668 553804278 545437872 537864745 530589521 523401499 516986310 511288762
999.4 511288762 505392849 499155045 492918938 486256987 478774160 471151650 464046001 457318604
1015.7 457318604 451195091 446519941 443370432 441126049 439790010 439642251 440165848 440762788 441636682
1034.1 441636682 442779928 443422347 443244189 442749619 442041129 440809220 439478308 438820392 438905030
1052.4 438905030 439615220 441374838 444237143 447349101 450050712 452246517 453344256 452431023 449612409
1070.8 449612409 445792139 441537261 437317014 433990747 432031542 431343943 432030052 434400827 438203603
1089.1 438203603 442675561 447276741 451395810 454082638 455106974 455422133 455836266 456316888 456995100
1107.5 456995100 458367527 460202336 461800933 463122308 464273751 464814633 464663029 464515001 464603931
$$ packed form
981E77756345p656872p826805q468390q366406p573127p275224p188022o415189n697548
999.4E11288762n895913o237804o236107o661951p482827p622510p105649o727397
1015.7D57318604o123513m675150l149509k244383j336039j47759N23597N96940Q73894
1034.1D41636682J143246O42419j78158m94570p08490j231909j330912o57916Q4638
1052.4D38905030P10190J759618K862305L111958K701611K195805J097739r13233k818614
1070.8D49612409l820270m254878m220247l326267j959205o87599O86109K370775L802776
1089.1D38203603M471958M601180M119069K686828J024336L15159M14133M80622O78212
1107.5D56995100J372427J834809J598597J321375J151443N40882j51604j48028Q8930
$$ plain form
1125.8 464603931 464441150 464007556 463641226 462929577 461245447 458866209 456304669 453445166 450372517
1144.2 450372517 447784990 445862591 444190443 442846000 442281723 442422211 443005323 444369465 446772814
1162.6 446772814 449684262 452578604 455451161 458108813 460144758 461761206 463422924 464890420
1178.9 464890420 465706736 466031283 465974450 465143830 463495374 461509347 459300220 456642061 453791797
1197.2 453791797 451170534 448648989 446053237 443691671 441653877 439455152 436880201 434205294
1213.5 434205294 431376636 428094625 424579799 421153665 417638838 413899779 410249472 406812251
1229.9 406812251 403336525 399840921 396578968 393459886 390227705 386994421 383914113 380825877
1246.2 380825877 377624303 374475300 371365309 368075520 364677668 361373305 358077019 354645222
$$ packed form
1125.8D64603931j62781m33594l66330p11649j684130k379238k561540k859503l072649
1144.2D50372517k587527j922399j672148j344443n64277J40488N83112J364142K403349
1162.6D46772814K911448K894342K872557K657652K035945J616448J661718J467496
1178.9D64890420Q16316L24547n6833q30620j648456j986027k209127k658159k850264
1197.2D53791797k621263k521545k595752k361566k037794k198725k574951k674907
1213.5D34205294k828658l282011l514826l426134l514827l739059l650307l437221
1229.9D06812251l475726l495604l261953l119082l232181l233284l080308l088236
1246.2C80825877l201574l149003l109991l289789l397852l304363l296286l431797
$$ plain form
1262.5 354645222 351209909 347854048 344429821 340831399 337191224 333528042 329671055 325684756
1278.8 325684756 321734548 317753613 313602328 309332162 304990739 300520360 295884460 291167408
1295.1 291167408 286384255 281472236 276503593 271568030 266617477 261582822 256592304 251687050
1311.4 251687050 246781856 241916627 237135395 232317150 227391571 222373948 217244431 211984977
1327.8 211984977 206608012 201311573 196225032 191155955 185758859 180117458 174717292 169563890
1344.1 169563890 164343506 159022138 153685704 148333177 142971203 137684971 132601842 127545521
1360.4 127545521 122242659 117040351 112247236 107532166 102940954 98474666 93882874 89510158
1376.7 89510158 85461244 81523806 77776834 74287914 70823751 67448847 64440764 61473500
$$ packed form
1262.5C54645222l435313l355861l424227l598422l640175l663182l856987l986299
1278.8C25684756l950208l980935m151285m270166m341423m470379m635900m717052
1295.1B91167408m783153m912019m968643m935563m950553n034655m990518m905254
1311.4B51687050m905194m865229m781232m818245m925579n017623n129517n259454
1327.8B11984977n376965n296439n086541n069077n397096n641401n400166n153402
1344.1A69563890n220384n321368n336434n352527n361974n286232n083129n056321
1360.4A27545521n302862n202308m793115m715070m591212m466288m591792m372716
1376.7H9510158m048914l937438l746972l488920l464163l374904l008083k967264
$$ plain form
1393 61473500 58303591 55276830 52446775 49856462 47557477 45367021 43458287 41904908 40610243
1411.4 40610243 39586402 38847696 38323190 38069118 38175449 38536981 39081015 39753631 40567577 41452955
1431.8 41452955 42299386 43167237 44087186 44854753 45514945 46131186 46672951 47167815 47636308 48063938
1452.2 48063938 48423365 48816424 49352754 49948592 50540581 51215265 51986951 52780826 53626016 54691821
1472.6 54691821 55986904 57287239 58594212 59997249 61548661 63171789 64963542 67120574
1488.9 67120574 69551118 71873859 74297734 77276409 80461107 83445534 86171299 89246184
1505.2 89246184 93404807 97225592 100428425 103666253 107091509 110703021 114329316 118259773
1521.5 118259773 122149959 125686869 129338339 132833198 136378467 140346289 143949136 147323743
$$ packed form
1393F1473500l169909l026761k830055k590313k298985k190456j908734j553379j294665
1411.4D0610243j023841p38706n24506k54072J06331L61532N44034O72616Q13946Q85378
1431.8D1452955Q46431Q67851R19949P67567O60192O16241N41765M94864M68493M27630
1452.2D8063938L59427L93059N36330N95838N91989O74684P71686P93875Q45190J065805
1472.6E4691821J295083J300335J306973J403037J551412J623128J791753K157032
1488.9F7120574K430544K322741K423875K978675L184698K984427K725765L074885
1505.2H9246184M158623L820785L202833L237828L425256L611512L626295L930457
1521.5A18259773L890186L536910L651470L494859L545269L967822L602847L374607
$$ plain form
1537.8 147323743 151842251 156769827 161046416 165327698 169740736 174576119 179715097 185055405
1554.1 185055405 190521553 197666451 206197873 212292463 217934132 224092185 230557546 237237960
1570.5 237237960 242849901 248068318 254059553 259332359 263746440 268152505 272504479 276600361
1586.8 276600361 280394703 283986539 287395477 290510625 293316811 296011597 298590690 300903618
1603.1 300903618 302971512 304943204 306687385 308109403 309419751 310669720 311558455 312176764 312913626
1621.4 312913626 313571900 313992441 314393103 314902812 315546364 316374540 317275792 318111211 319056511 320299864
1641.8 320299864 321950674 323950112 325885475 327676177 330120593 333096236 335436970 337929517
1658.2 337929517 341013640 344479591 347978979 351464570 355422914 359670401 363543481 367657661
$$ packed form
1537.8A47323743M518508M927576M276589M281282M413038M835383N138978N340308
1554.1A85055405N466148P144898Q531422O094590N641669O158053O465361O680414
1570.5B37237960N611941N218417N991235N272806M414081M406065M351974M095882
1586.8B76600361L794342L591836L408938L115148K806186K694786K579093K312928
1603.1C00903618K067894J971692J744181J422018J310348J249969Q88735O18309P36862
1621.4C12913626O58274M20541M00662N09709O43552Q28176R01252Q35419R45300J243353
1641.8C20299864J650810J999438J935363J790702K444416K975643K340734K492547
1658.2C37929517L084123L465951L499388L485591L958344M247487L873080M114180
$$ plain form
1674.5 367657661 371975869 375908554 379906744 384544849 389823973 394312292 398444951 402883798
1690.8 402883798 407169014 412029594 417480260 422671974 427877516 432316184 436496407 440709174
1707.1 440709174 444491535 448269486 452108145 455867827 459726065 463203222 466007680 468738526
1723.4 468738526 471757233 474908531 477920145 480769575 483965874 486920148 489286959 491963565
1739.7 491963565 494903415 497599900 500187516 503038049 506042659 508603156 510859847 513450146
1756.1 513450146 516101778 518383920 520631790 522859871 524862528 526710570 528636456 530413449
1772.4 530413449 531445086 532082498 532689929 532810450 532101512 530844212 529320300 527591646 525437772
1790.7 525437772 522935629 520770848 519111037 517988324 517725170 518233538 519336820 521309793 524239957
$$ packed form
1674.5C67657661M318208L932685L998190M638105N279124M488319M132659M438847
1690.8D02883798M285216M860580N450666N191714N205542M438668M180223M212767
1707.1D40709174L782361L777951L838659L759682L858238L477157K804458K730846
1723.4D68738526L018707L151298L011614K849430L196299K954274K366811K676606
1739.7D91963565K939850K696485K587616K850533L004610K560497K256691K590299
1756.1E13450146K651632K282142K247870K228081K002657J848042J925886J776993
1772.4E30413449J031637O37412O07431J20521p08938j257300j523912j728654k153874
1790.7E25437772k502143k164781j659811j122713k63154N08368J103282J972973K930164
$$ plain form
1809.1 524239957 527673483 531300426 535378575 539858818 544192851 548287392 552465081 556500494
1825.4 556500494 559933901 563199162 566432774 569183111 571591496 574036121 576424837 578504682
1841.7 578504682 580505371 582601786 584481359 586031854 587604463 589379311 591030538 592458844
1858 592458844 594025075 595701575 597159326 598546147 600102127 601492047 602545083 603756607 605238974
1876.4 605238974 606563389 607656240 608906448 610288322 611436307 612485468 613721430 614956141
1892.7 614956141 615962207 616971791 618157685 619232833 620086849 621123314 622392654 623425007
1909 623425007 624233961 625224769 626333058 627226472 628053844 629077733 630038142 630734503 631498337 632429838
1929.4 632429838 633222401 633932471 634858549 635855675 636610508 637310028 638148189 638886273 639447391 640153408
$$ packed form
1809.1E24239957L433526L626943M078149M480243M334033M094541M177689M035413
1825.4E56500494L433407L265261L233612K750337K408385K444625K388716K079845
1841.7E78504682K000689K096415J879573J550495J572609J774848J651227J428306
1858E92458844J566231J676500J457751J386821J555980J389920J053036J211524J482367
1876.4F05238974J324415J092851J250208J381874J147985J049161J235962J234711
1892.7F14956141J006066J009584J185894J075148Q54016J036465J269340J032353
1909F23425007Q08954R90808J108289Q93414Q27372J023889R60409O96361P63834R31501
1929.4F32429838P92563P10070R26078R97126P54833O99520Q38161P38084N61118P06017
$$ plain form
1949.8 640153408 641060829 641782284 642284751 642892838 643556237 644042552 644600034 645443976 646234989 646784484
1970.2 646784484 647435486 648279250 648975551 649523437 650238335 651021838 651548088 652023911 652737081 653430104
1990.6 653430104 653855145 654301703 654949367 655471325 655815899 656326771 656960130 657395005 657785833 658399820
2011 658399820 659000456 659369886 659765542 660320699 660746753 661028981 661496401 662085593 662445664 662724853
2031.4 662724853 663243651 663793147 664116919 664477050 665036201 665474057 665724158 666124642 666667521 667018414
2051.8 667018414 667300463 667835653 668415189 668743193 669070482 669604242 670023263 670261204 670678079 671253026
2072.2 671253026 671640694 671924770 672409415 672937155 673232615 673507810 673976660 674365580 674578905 674942076
2092.6 674942076 675453544 675770164 675977290 676398873 676858783 677064478 677244306 677635550 677973509 678118169
$$ packed form
1949.8F40153408R07421P21455N02467O08087O63399M86315N57482Q43942P91013N49495
1970.2F46784484O51002Q43764O96301N47886P14898P83503N26250M75823P13170O93023
1990.6F53430104M25041M46558O47664N21958L44574N10872O33359M34875L90828O13987
2011F58399820O00636L69430L95656N55157M26054K82228M67420N89192L60071K79189
2031.4F62724853N18798N49496L23772L60131N59151M37856K50101M00484N42879L50893
2051.8F67018414K82049N35190N79536L28004L27289N33760M19021K37941M16875N74947
2072.2F71253026L87668K84076M84645N27740K95460K75195M68850L88920K13325L63171
2092.6F74942076N11468L16620K07126M21583M59910K05695J79828L91244L37959J44660
$$ plain form
2113 678118169 678360522 678760171 679005921 679120064 679423153 679802299 679975212 680147111 680546641 680870771
2133.4 680870771 680953324 681147337 681557119 681836545 681981027 682328701 682747602 682932973 683119893 683552086
2153.8 683552086 683969378 684244871 684655130 685217142 685620725 685915291 686401844 686963797 687339246 687704861
2174.2 687704861 688280880 688823342 689170122 689593732 690157235 690570295 690873384 691393018 691990376 692321062
2194.6 692321062 692589879 693075359 693507195 693726838 694044888 694531024 694876194 695088327 695464551 695900977
2215 695900977 696160078 696434736 696900427 697304130 697490454 697718143 698110342 698418975 698616087 698978364
2235.4 698978364 699410617 699634254 699833453 700228214 700582743 700760603 701048374 701528609 701857448 702001393
2255.8 702001393 702324033 702763617 703013599 703242183 703685999 704094708 704299331 704569697 704975128 705261707
$$ packed form
2113F78118169K42353L99649K45750J14143L03089L79146J72913J71899L99530L24130
2133.4F80870771Q2553J94013M09782K79426J44482L47674M18901J85371J86920M32193
2153.8F83552086M17292K75493M10259N62012M03583K94566M86553N61953L75449L65615
2174.2F87704861N76019N42462L46780M23610N63503M13060L03089N19634N97358L30686
2194.6F92321062K68817M85480M31836K19643L18050M86136L45170K12133L76224M36426
2215F95900977K59101K74658M65691M03703J86324K27689L92199L08633J97112L62277
2235.4F98978364M32253K23637J99199L94761L54529J77860K87771M80235L28839J43945
2255.8G02001393L22640M39584K49982K28584M43816M08709K04623K70366M05431K86579
$$ plain form
2276.1 705261707 705455422 705788553 706156373 706355393 706528008 706828654 707048833 707093418 707245529 707554042
2296.5 707554042 707747459 707807899 707947910 708111525 708086848 707995832 708072901 708175421 708132565 708107471 708120823
2319 708120823 707960010 707766175 707871258 708088160 708103955 708101392 708293140 708504021 708625138 708818257
2339.4 708818257 709142685 709575295 710207045 710859597 711076915 710692167 710083485 709786057 709715366 709637463
2359.8 709637463 709826231 710440993 711199939 711976767 712864876 713776588 714573860 715356708 716212511 716985464
2380.2 716985464 717581034 718115270 718584716 718850136 718974173 719120920 719267666 719340682 719413340 719581485
2400.6 719581485 719747841 719794273 719819725 719897628 719945848 719977796 720081687 720158398 720089078 719994485 719986737
2423 719986737 719960988 719842970 719738901 719655275 719466686 719209969 719011486 718813062 718510628 718192041
$$ packed form
2276.1G05261707J93715L33131L67820J99020J72615L00646K20179M4585J52111L08513
2296.5G07554042J93417O0440J40011J63615k4677r1016P7069J02520m2856k5094J3352
2319G08120823j60813j93835J05083K16902J5795k563J91748K10881J21117J93119
2339.4G08818257L24428M32610O31750O52552K17318l84748o08682k97428p0691p7903
2359.8G09637463J88768O14762P58946P76828Q88109R11712P97272P82848Q55803P72953
2380.2G16985464N95570N34236M69446K65420J24037J46747J46746P3016P2658J68145
2400.6G19581485J66356M6432K5452P7903M8220L1948J03891P6711o9320r4593p748
2423G19986737k5749j18018j04069q3626j88589k56717j98483j98424l02434l18587
$$ plain form
2443.4 718192041 717904031 717509389 716959953 716377318 715797067 715118527 714326859 713471174 712495506 711350262
2463.8 711350262 710088551 708742142 707248628 705546439 703684926 701696217 699521601 697150290
2480.1 697150290 694628417 691981196 689217269 686384618 683570802 680822790 678132474 675573826
2496.4 675573826 673241556 671106577 669107735 667214096 665378511 663553298 661767066 660088658
2512.7 660088658 658533633 657086670 655811548 654812396 654097319 653632522 653481722 653730989 654338837
2531.1 654338837 655242980 656464577 657966495 659647703 661471605 663438082 665513217 667604864
2547.4 667604864 669636905 671604931 673473239 675149977 676623702 677989662 679249406 680345833
2563.7 680345833 681322217 682195127 682932615 683535278 684041798 684504628 684898436 685205281 685499609 685764670
$$ packed form
2443.4G18192041k88010l94642n49436n82635n80251o78540p91668q55685r75668j145244
2463.8G11350262j261711j346409j493514j702189j861513j988709k174616k371311
2480.1F97150290k521873k647221k763927k832651k813816k748012k690316k558648
2496.4F75573826k332270k134979j998842j893639j835585j825213j786232j678408
2512.7F60088658j555025j446963j275122r99152p15077m64797j50800K49267O07848
2531.1F54338837R04143J221597J501918J681208J823902J966477K075135K091647
2547.4F67604864K032041J968026J868308J676738J473725J365960J259744J096427
2563.7F80345833R76384Q72910P37488O02663N06520M62830L93808L06845K94328K65061
$$ plain form
2584.1 685764670 685925305 686052442 686212182 686326325 686385930 686490119 686661363 686839163 687011778 687239408
2604.5 687239408 687507629 687780321 688132882 688592732 689078569 689581215 690181673 690882325 691584229 692254186
2624.9 692254186 692985535 693799853 694579959 695310831 696071923 696819067 697477639 698103428 698732436 699316919
2645.3 699316919 699861586 700367033 700764060 701023161 701214790 701402068 701515317 701474547 701376975 701307774
2665.7 701307774 701179981 700980246 700817168 700654268 700354934 699996054 699767649 699591458 699305296 699011922
2686.1 699011922 698797643 698535800 698195159 697887301 697586060 697191775 696791768 696486473 696150899 695711911
2706.5 695711911 695319593 694996417 694598317 694152474 693789184 693423212 692886233 692291558 691846132 691486299
2726.9 691486299 691066384 690640032 690261602 689809978 689270735 688829362 688474238 688021719 687519431 687094808
$$ packed form
2584.1F85764670J60635J27137J59740J14143N9605J04189J71244J77800J72615K27630
2604.5F87239408K68221K72692L52561M59850M85837N02646O00458P00652P01904O69957
2624.9F92254186P31349Q14318P80106P30872P61092P47144O58572O25789O29008N84483
2645.3F99316919N44667N05447L97027K59101J91629J87278J13249m0770r7572o9201
2665.7G01307774j27793j99735j63078j62900k99334l58880k28405j76191k86162k93374
2686.1F99011922k14279k61843l40641l07858l01241l94285m00007l05295l35574m38988
2706.5F95711911l92318l23176l98100m45843l63290l65972n36979n94675m45426l59833
2726.9F91486299m19915m26352l78430m51624n39243m41373l55124m52519n02288m24623
$$ plain form
2747.3 687094808 686678827 686181605 685706496 685303211 684808910 684208870 683670282 683163643 682538629 681880534
2767.7 681880534 681334078 680761695 680038154 679376781 678846896 678176463 677349448 676609159 675894022 674991667
2788.1 674991667 674069643 673324168 672518075 671466589 670434296 669585943 668646753 667519450 666431427
2806.4 666431427 665343285 664106667 662881553 661742985 660488605 659069657 657676756 656331360
2822.7 656331360 654832602 653185606 651562810 649893165 647988856 645911515 643777966 641456604
2839.1 641456604 638759196 635636449 632030845 628043234 624431551 622036219 620706022 619675100
2855.4 619675100 618607700 617574215 616427362 614915550 613168061 611394703 609454572 607364058
2871.7 607364058 605590880 604264736 603014171 601743877 600590706 599438608 598169863 596969068
$$ packed form
2747.3F87094808m15981m97222m75109m03285m94301o00040n38588n06639o25014o58095
2767.7F81880534n46456n72383p23541o61373n29885o70433q27015p40289p15137r02355
2788.1F74991667r22024p45475q06093j051486j032293q48353r39190j127303j088023
2806.4F66431427j088142j236618j225114j138568j254380j418948j392901j345396
2822.7F56331360j498758j646996j622796j669645j904309k077341k133549k321362
2839.1F41456604k697408l122747l605604l987611l611683k395332j330197j030922
2855.4F19675100j067400j033485j146853j511812j747489j773358j940131k090514
2871.7F07364058j773178j326144j250565j270294j153171j152098j268745j200795
$$ plain form
2888 596969068 595946074 594893992 593756497 592784107 591982901 591089308 590113461 589192986 588143647
2906.4 588143647 586675584 584764123 582494438 579971373 577628613 576017618 575174153 574729502 574543297
2924.7 574543297 574643970 574917793 575309157 575886548 576633871 577429056 578253984 579172790 580072761 580774069
2945.1 580774069 581339180 581840515 582077920 582015276 581950247 582009912 582050323 582129300 582541645 583264112
2965.5 583264112 584010720 584795117 585759640 586734474 587559342 588353038 589138329 589798808 590394735 591016293
2985.9 591016293 591518044 591731966 591840088 592110574 592350721 592374802 592445076 592640936 592735112 592729867
3006.3 592729867 592739224 592669785 592474639 592367768 592467725 592530727 592347741 592028260 591695428 591238260
3026.7 591238260 590593517 589927197 589254618 588496208 587717950 586894035 585903287 584805548 583841264
$$ packed form
2888E96969068j022994j052082j137495r72390q01206q93593r75847r20475j049339
2906.4E88143647j468063j911461k269685k523065k342760j610995q43465m44651j86205
2924.7E74543297J00673K73823L91364N77391P47323P95185Q24928R18806Q99971P01308
2945.1E80774069N65111N01335K37405o2644o5029N9665M0411P8977M12345P22467
2965.5E83264112P46608P84397R64523R74834Q24868P93696P85291O60479N95927O21558
2985.9E91016293N01751K13922J08122K70486K40147K4081P0274J95860R4176n245
3006.3E92729867R357o9439j95146j06871R9957O3002j82986l19481l32832m57168
3026.7E91238260o44743o66320o72579p58410p78258q23915r90748j097739r64284
$$ plain form
3045.1 583841264 582998335 581986547 580819547 579761326 578785360 577719867 576635778 575612366 574512780
3063.4 574512780 573282063 572159767 571271479 570342183 569230139 568129122 567073822 565949023 564857006
3081.8 564857006 563922524 562983572 561885417 560794175 559830725 558812022 557664335 556542456 555462122
3100.1 555462122 554297447 553077340 551903427 550716639 549446762 548165441 546894491 545506597
3116.4 545506597 544053733 542789221 541624188 540242195 538695633 537224054 535804331 534295738
3132.8 534295738 532747209 531197131 529550850 527898371 526359558 524787366 523046076 521227837
3149.1 521227837 519464254 517725050 515926480 514128625 512374580 510557473 508690476 506906271
3165.4 506906271 505122840 503185749 501218140 499370307 497498989 495491952 493515462 491648972
$$ packed form
3045.1E83841264q42929j011788j167000j058221r75966j065493j084089j023412j099586
3063.4E74512780j230717j122296q88288r29296j112044j101017j055300j124799j092017
3081.8E64857006r34482r38952j098155j091242r63450j018703j147687j121879j080334
3100.1E55462122j164675j220107j173913j186788j269877j281321j270950j387894
3116.4E45506597j452864j264512j165033j381993j546562j471579j419723j508593
3132.8E34295738j548529j550078j646281j652479j538813j572192j741290j818239
3149.1E21227837j763583j739204j798570j797855j754045j817107j866997j784205
3165.4E06906271j783431j937091j967609j847833j871318k007037j976490j866490
$$ plain form
3181.7 491648972 489731580 487713635 485753268 483884245 481965601 480021089 478162646 476305455
3198 476305455 474365741 472460806 470647991 468781263 466841340 465001315 463214785 461319208 459429950
3216.4 459429950 457659990 455883801 454037458 452226132 450480849 448696196 446862906 445089281
3232.7 445089281 443371892 441618979 439859837 438168496 436478853 434723198 433002949 431369096
3249 431369096 429702610 427955151 426214129 424516469 422782093 421010345 419304311 417637199 415962398
3267.4 415962398 414361000 412820756 411234438 409649491 408176899 406775385 405325055 403839976
3283.7 403839976 402464241 401169509 399833888 398537457 397319108 396053672 394751579 393519789
3300 393519789 392337382 391166449 390002608 388790756 387518823 386234194 384957731 383681506 382338434
$$ packed form
3181.7D91648972j917392k017945j960367j869023j918644j944512j858443j857191
3198D76305455j939714j904935j812815j866728j939923j840025j786530j895577j889258
3216.4D59429950j769960j776189j846343j811326j745283j784653j833290j773625
3232.7D45089281j717389j752913j759142j691341j689643j755655j720249j633853
3249D31369096j666486j747459j741022j697660j734376j771748j706034j667112j674801
3267.4D15962398j601398j540244j586318j584947j472592j401514j450330j485079
3283.7D03839976j375735j294732j335621j296431j218349j265436j302093j231790
3300C93519789j182407j170933j163841j211852j271933j284629j276463j276225j343072
$$ plain form
3318.4 382338434 380908579 379495114 378083706 376574665 375032246 373537004 372034609 370520711
3334.7 370520711 369061291 367619425 366125226 364659071 363317072 362033129 360739291 359481037
3351 359481037 358292103 357101172 355904073 354794472 353727251 352627575 351570338 350599825 349631011
3369.3 349631011 348605782 347591698 346677989 345849723 345055938 344270170 343494356 342772782 342148334
3387.7 342148334 341625065 341115803 340523094 339941025 339514732 339184850 338776499 338285416 337908566 337685615
3408.1 337685615 337518007 337384313 337262392 337150097 337104321 337105066 337116629 337210566 337448716 337808162 338170409
3430.5 338170409 338554442 339040130 339483619 339822769 340218782 340757906 341398686 342095822 342831969 343669891
3450.9 343669891 344583273 345483571 346451521 347544730 348617494 349667609 350852370 352118641 353317201
$$ packed form
3318.4C82338434j429855j413465j411408j509041j542419j495242j502395j513898
3334.7C70520711j459420j441866j494199j466155j341999j283943j293838j258254
3351C59481037j188934j190931j197099j109601j067221j099676j057237r70513r68814
3369.3C49631011j025229j014084r13709q28266p93785p85768p75814p21574o24448
3387.7C42148334n23269n09262n92709n82069m26293l29882m08351m91083l76850k22951
3408.1C37685615j67608j33694j21921j12295m5776P45J1563R3937K38150L59446L62247
3430.5C38170409L84033M85688M43489L39150L96013N39124O40780O97136P36147Q37922
3450.9C43669891R13382R00298R67950J093209J072764J050115J184761J266271J198560
$$ plain form
3469.3 353317201 354473352 355727226 357077539 358531833 360082150 361539245 362880319 364332289
3485.6 364332289 365953952 367615938 369288832 370975465 372662961 374387294 376250952 378188193
3501.9 378188193 379959077 381645143 383522570 385549873 387613267 389736921 391848475 393891513
3518.2 393891513 395984292 398251057 400547504 402752042 404985279 407352984 409796298 412236691
3534.5 412236691 414667189 417095661 419674903 422463208 425279468 427924335 430516243 433300346
3550.9 433300346 436181754 439002872 441871732 444891810 447954297 450990885 454225630 457745254
3567.2 457745254 461073279 464138001 467332631 470769078 474277526 477766007 481239855 484760851
3583.5 484760851 488546342 492467344 496044040 499443680 503097892 506892979 510653317 514444351
$$ packed form
3469.3C53317201J156151J253874J350313J454294J550317J457095J341074J451970
3485.6C64332289J621663J661986J672894J686633J687496J724333J863658J937241
3501.9C78188193J770884J686066J877427K027303K063394K123654K111554K043038
3518.2C93891513K092779K266765K296447K204538K233237K367705K443314K440393
3534.5D12236691K430498K428472K579242K788305K816260K644867K591908K784103
3550.9D33300346K881408K821118K868860L020078L062487L036588L234745L519624
3567.2D57745254L328025L064722L194630L436447L508448L488481L473848L520996
3583.5D84760851L785491L921002L576696L399640L654212L795087L760338L791034
$$ plain form
3599.8 514444351 518185258 521856844 525731742 529884815 533909261 537787139 541572869 545193374
3616.1 545193374 549093723 553113520 556589246 559841633 563722551 568571627 572868049 576118112
3632.4 576118112 579506934 583077431 586555421 589936435 593172312 596449733 600352645 604864478
3648.8 604864478 608328283 610545814 613090515 616139650 618837476 621262670 623605013 625846982
3665.1 625846982 628363192 631267309 633637667 635756433 638443351 640343606 641373098 642504573
3681.4 642504573 643717408 645211279 647418916 649536729 650449038 650893629 651602149 652612329 653948367
3699.8 653948367 655401945 656454861 657336712 658641994 660413861 661771774 662119091 662285507 662840605
3718.1 662840605 663635135 664376199 665002048 665411055 665650129 666253984 667402029 668509722 668991745
$$ packed form
3599.8E14444351L740907L671586L874898M153073M024446L877878L785730L620505
3616.1E45193374L900349M019797L475726L252387L880918M849076M296422L250063
3632.4E76118112L388822L570497L477990L381014L235877L277421L902912M511833
3648.8F04864478L463805K217531K544701L049135K697826K425194K342343K241969
3665.1F25846982K516210K904117K370358K118766K686918J900255J029492J131475
3681.4F42504573J212835J493871K207637K117813R12309M44591P08520J010180J336038
3699.8F53948367J453578J052916Q81851J305282J771867J357913L47317J66416N55098
3718.1F62840605P94530P41064O25849M09007K39074O03855J148045J107693M82023
$$ plain form
3736.5 668991745 668834805 668666422 669259548 670189083 670457363 670918882 671718895 671746373 671501040 671755791
3756.9 671755791 672197878 672306716 672337830 672497630 672706068 673151255 673478484 673335314 673259676 673733354
3777.3 673733354 674278200 674246013 674101353 674187541 674299538 674458385 674620926 674726427 674832225 674969137
3797.7 674969137 675452709 675876081 675689876 675697029 675799608 675476432 675262630 675613225 676054657 676114380
3818 676114380 676302791 676301956 675988436 675967813 676055789 676089346 676105320 676169693 676509202 676793694 676650584
3840.5 676650584 676400423 676147282 675783753 675459325 675674200 676558733 676664591 675866544 675410628 675488055
3860.9 675488055 675793052 675867677 675758123 675855994 675868392 675647199 675367653 675171018 675298631 675404549
3881.3 675404549 675354064 675262690 674908161 674773514 674923897 674690425 674334049 674351156 674551547 674643934
$$ packed form
3736.5F68991745j56940j68383N93126R29535K68280M61519Q00013K7478k45333K54751
3756.9F71755791M42087J08838L1114J59800K08438M45187L27229j43170p5638M73678
3777.3F73733354N44846l2187j44660Q6188J11997J58847J62541J05501J05798J36912
3797.7F74969137M83572M23372j86205P153J02579l23176k13802L50595M41432N9723
3818F76114380J88411q35l13520k0623Q7976L3557J5974O4373L39509K84492j43110
3840.5F76650584k50161k53141l63529l24428K14875Q84533J05858p98047m55916P7427
3860.9F75488055L04997P4625j09554R7871J2398k21193k79546j96635J27613J05918
3881.3F75404549n0485r1374l54529j34647J50383k33472l56376J7107K00391R2387
$$ plain form
3901.7 674643934 674619317 674393475 674009562 673739076 673627615 673571646 673566997 673574626 673466146 673281610 673166573
3924.1 673166573 673056364 672934413 672918975 672894299 672688544 672409236 672193229 672093153 672035217 671875477
3944.5 671875477 671779871 671846747 671814263 671604156 671380460 671248555 671213269 671165347 671085000 671052277 671007514
3966.9 671007514 670931339 670882463 670829117 670711756 670570374 670519233 670568883 670597613 670502424 670330763 670241773
3989.4 670241773 670268297 670278013 670190156 670056403
3997.5 670056403
$$ packed form
3901.7F74643934k4617k25842l83913k70486j11461n5969m649P629j08480j84536j15037
3924.1F73166573j10209j21951j5438k4676k05755k79308k16007j00076n7936j59740
3944.5F71875477r5606O6876l2484k10107k23696j31905l5286m7922q0347l2723m4763
3966.9F71007514p6175m8876n3346j17361j41382n1141M9650K8730r5189j71661q8990
3989.4F70241773K6524R716q7857j33753
3997.5F70056403
##END=$$ End of the data block
